{"text_format":"1","workbook":"xlsx","n_sheets":39,"sheets":["JMF1","Stuff","SiteManager Mapping","AWP Gradations","Contractors Gradations","45","Glassy","Agg. S. G.","Fract. Face","Batch","Washed Grad.","LOI","Furnace","Rice SG","Mix Des. Data","Mix Des. Graphs","TSR","Des. Check","Mix Summary","MARSHALL(TDOT)","TSR(TDOT)","TSR(TDOT) (AASHTO)","N.C.A.T(TDOT)","F.FACE(TDOT)","Glassy (TDOT)","LOI (TDOT)","OGFC (TDOT)","OGFC","OGFC TSR","OGFC Graphs","FILM THICKNESS","HMA Producers","Terminals","Module1","Module2","ASA Suppliers","Aggregate Suppliers","Aggregate Sizes","Sheet1"],"not_rendered":{"charts":13,"images":14,"macros":1,"external_links":0,"defined_names":42,"comments":1,"pivot_tables":0},"unopened":[{"sheet":"Module1","index":33,"reason":"part_missing"},{"sheet":"Module2","index":34,"reason":"part_missing"}],"bounds":{"document_bytes":16777216,"sheet_cells":100000,"rows_first":2000,"rows_last":500,"rows_between":2000,"halvings":0,"cell_chars":16384,"cell_head_chars":4096},"cells_cut":0,"cells_raw":0,"read":"whole","date_system":"1900"}

{"sheet":"JMF1","index":0,"n_rows":63,"n_cols":10,"rows_kept":63,"cut":false,"hidden":false,"merged":[[30,0,30,2],[30,3,30,4],[23,6,23,9],[18,4,18,7],[28,8,28,9],[22,3,22,5],[29,0,29,2],[26,2,26,4],[21,4,21,7],[29,3,29,4],[28,3,28,4],[29,8,29,9],[26,5,26,7],[21,8,21,9],[24,8,24,9],[28,5,28,7],[29,5,29,7],[26,8,26,9],[21,2,21,3],[17,8,17,9],[26,0,26,1],[22,0,22,1],[13,8,13,9],[25,8,25,9],[14,8,14,9],[15,8,15,9],[16,8,16,9],[19,4,19,7],[20,4,20,7],[24,6,24,7],[18,8,18,9],[19,8,19,9],[14,2,14,3],[15,2,15,3],[16,2,16,3],[19,0,19,1],[20,0,20,1],[17,2,17,3],[18,0,18,1],[20,8,20,9],[22,8,22,9],[14,0,14,1],[16,4,16,7],[17,4,17,7],[14,4,14,7],[15,4,15,7],[19,2,19,3],[21,0,21,1],[24,0,24,1],[23,4,23,5],[23,0,23,1],[20,2,20,3],[18,2,18,3],[2,7,2,8],[2,5,2,6],[7,0,7,1],[2,2,2,3],[3,2,3,3],[4,2,4,3],[2,0,2,1],[13,2,13,3],[13,4,13,7],[3,0,3,1],[4,0,4,1],[9,8,9,9],[11,7,11,9],[11,5,11,6],[9,1,9,2],[7,2,7,9],[5,2,5,3],[11,0,11,1],[11,2,11,4],[13,0,13,1],[35,0,35,2],[32,0,32,1],[33,5,33,6],[34,5,34,9],[34,0,34,4],[33,7,33,9],[35,8,35,9],[35,5,35,7],[31,3,31,4],[31,6,31,7],[31,8,31,9],[39,6,40,6],[62,0,62,1],[60,2,60,4],[36,3,36,4],[39,1,40,1],[39,2,40,2],[38,1,38,7],[36,5,36,7],[36,0,36,2],[62,5,62,6],[59,0,59,1],[63,2,63,4],[59,5,59,6],[63,7,63,9],[60,7,60,9],[62,7,62,9],[59,2,59,4],[62,2,62,3],[0,0,0,9],[32,5,32,7],[32,8,32,9],[24,3,24,5],[28,0,28,2],[9,4,9,6],[15,0,15,1],[16,0,16,1],[17,0,17,1],[31,0,31,1],[39,7,40,7],[59,7,59,9],[35,3,35,4],[36,8,36,9],[39,3,40,3],[39,4,40,4],[39,5,40,5]]}
["STATE OF TENNESSEE ASPHALT JOB MIX FORMULA"]
["2026 V12.2",null,null,null,null,null,null,null,null,"V12.2"]
["Date",null,null,null,null,"Roadway Surface",null,{"$f":"Stuff!D105","v":0}]
["Region"]
[]
[]
[]
["Hot-mix Producer",null,{"$f":"Stuff!$B$102","v":0}]
[]
["Type",{"$f":"VLOOKUP(Stuff!$C$27,Stuff!$A$28:$U$43,19)","v":0},{"$f":"VLOOKUP(Stuff!#REF!,Stuff!$A$2:$B$23,2)","v":{"$error":"#REF!"}},"Mix",{"$f":"VLOOKUP(Stuff!C27,Stuff!A28:B53,2)&\" \"&VLOOKUP(Stuff!C54,Stuff!A55:B61,2)","v":"  "},null,null,"Item"]
[]
["Serial No.:",null,null,null,null,"Design No.:"]
[]
["Material",null,"Size or Grade",null,"Producer and Location",null,null,null,"Percent Used"]
[{"$f":"Stuff!I65","v":0},null,{"$f":"Stuff!F65","v":0},null,{"$f":"Stuff!M65","v":0},null,null,null,{"$f":"$B$42*(100-$G$23)/100","v":0},{"$f":"E29*(100-D30)/100","v":{"$error":"#VALUE!"}}]
[{"$f":"Stuff!I66","v":0},null,{"$f":"Stuff!F66","v":0},null,{"$f":"Stuff!M66","v":0},null,null,null,{"$f":"$C$42*(100-$G$23)/100","v":0},{"$f":"E30*(100-D31)/100","v":0}]
[{"$f":"Stuff!I67","v":0},null,{"$f":"Stuff!F67","v":0},null,{"$f":"Stuff!M67","v":0},null,null,null,{"$f":"$D$42*(100-$G$23)/100","v":0},{"$f":"E31*(100-D32)/100","v":{"$error":"#VALUE!"}}]
[{"$f":"Stuff!I68","v":0},null,{"$f":"Stuff!F68","v":0},null,{"$f":"Stuff!M68","v":0},null,null,null,{"$f":"$E$42*(100-$G$23)/100","v":0},{"$f":"E32*(100-D33)/100","v":0}]
[{"$f":"Stuff!I69","v":0},null,{"$f":"Stuff!F69","v":0},null,{"$f":"Stuff!M69","v":0},null,null,null,{"$f":"$F$42*(100-$G$23)/100","v":0},{"$f":"E33*(100-D34)/100","v":0}]
[{"$f":"Stuff!I70","v":0},null,{"$f":"Stuff!F70","v":0},null,{"$f":"Stuff!M70","v":0},null,null,null,{"$f":"IF(C23=0,G42*(100-G23)/100,((G42*(100-G23)/(100-C23))))","v":0},{"$f":"J33*(100-D35)/100","v":{"$error":"#VALUE!"}}]
[{"$f":"Stuff!I71","v":0},null,{"$f":"Stuff!F71","v":0},null,{"$f":"Stuff!M71","v":0},null,null,null,{"$f":"IF(C24=0,H42*(100-G23)/100,((H42*(100-G23)/(100-C24))))","v":0},{"$f":"IF(I35=0,I31*(100-D32)/100,((I31*(100-D32)/(100-I35))))","v":{"$error":"#VALUE!"}}]
["Asphalt Cement",null,{"$f":"VLOOKUP(Stuff!C54,Stuff!A55:C60,3)","v":0},null,{"$f":"Stuff!B110","v":0},null,null,null,{"$f":"IF(AND(C23=0,C24=0),G23,(IF(AND(C23<>0,C24=0),G23-I20*C23/100,(IF(AND(C23=0,C24<>0),G23-(I21*C24/100),G23-(I20*C23/100)-(I21*C24/100))))))","v":0},{"$f":"IF(I35=0,D32,D32-I31*I35/100)","v":"T.S.R.:"}]
["Percent AC in RAP1:",null,{"$f":"Stuff!H93","v":0},"Optimum AC Content:",null,null,{"$f":"'Mix Des. Data'!B34","v":0},"Total",{"$f":"SUM(I15:I22)","v":0}]
["Percent AC in RAP2:",null,{"$f":"Stuff!I93","v":0},null,"Anti-Strip Additive:",null,{"$f":"VLOOKUP('ASA Suppliers'!C1,'ASA Suppliers'!A3:B35,2)","v":0}]
["Anti-Strip Supplier:",null,null,{"$f":"'ASA Suppliers'!F1","v":0},null,null,"Dosage:",null,{"$f":"Stuff!$D$97","v":" "}]
["AC Contribution:",null,"Virgin AC",{"$f":"I22","v":0},"RAP AC",{"$f":"G23-I22","v":0},"Percent Virgin AC:",null,{"$f":"IF(AND(Stuff!I93=0,Stuff!H93=0),\"\",I22/G23*100)","v":""}]
["Asphalt Sp. Gravity:",null,{"$f":"'Rice SG'!H33","v":1.03},null,null,"Dust to Asphalt Ratio:",null,null,{"$f":"IF(ISBLANK('Mix Des. Data'!B34),\"\",I57/G23)","v":""}]
[]
["% Fracture Face on CA:",null,null,{"$f":"'Fract. Face'!$D$23","v":"n/a"},{"$f":"'Fract. Face'!$D$23","v":"n/a"},"% Glassy Particles on CA:",null,null,{"$f":"Glassy!$E$25","v":"n/a"},{"$f":"Glassy!$E$25","v":"n/a"}]
["Theo.Gravity of RAP1:",null,null,null,null,"Eff. Gravity of Agg:",null,null,{"$f":"'Rice SG'!H39","v":""}]
["Theo.Gravity of RAP2:"]
["Theo. Gravity of Mix:",null,{"$f":"'Mix Des. Data'!I34","v":""},"T.S.R.:",null,{"$f":"IF(OR(Stuff!C27=18,Stuff!C27=19),'OGFC TSR'!D30,TSR!C40)","v":""},"Lbs/Ft3:",null,{"$f":"IF(ISBLANK('Mix Des. Data'!B34),\"\",62.4*C32)","v":""}]
["L.O.I.:",null,{"$f":"LOI!E38","v":""},null,null,"Ignition Oven Corr. Factor:",null,null,{"$f":"Furnace!M30","v":""},{"$f":"IF(Furnace!$L$8=\"Yes\",Furnace!$M$30,\"N/A\")","v":"N/A"}]
[null,null,null,null,null,"Warm Mix?",null,{"$f":"VLOOKUP(Stuff!I54,Stuff!G55:H57,2)","v":0}]
["Lab Temperature",null,null,null,null,"Plant Temperature"]
["Mixing Temperature (± 5 °F):",null,null,null,null,"Mixing Temp Range(°F):",null,null,{"$f":"IF(Stuff!I54=2,Stuff!J57,IF(Stuff!C27=18,Stuff!N57,IF(AND(OR(Stuff!C27=3,Stuff!C27=4,Stuff!C27=12),OR(Stuff!C54=2,Stuff!C54=3)),Stuff!J59,IF(OR(Stuff!C27=3,Stuff!C27=4,Stuff!C27=12),Stuff!J60,VLOOKUP(Stuff!C54,Stuff!A55:D60,4)))))","v":0}]
["Lab Compaction Temp (± 5 °F):",null,null,null,null,"Delivery Temperature(°F):",null,null,{"$f":"IF(Stuff!I54=2,Stuff!J57,IF(Stuff!C27=18,Stuff!N57,IF(AND(OR(Stuff!C27=3,Stuff!C27=4,Stuff!C27=12),OR(Stuff!C54=2,Stuff!C54=3)),Stuff!J59,IF(OR(Stuff!C27=3,Stuff!C27=4,Stuff!C27=12),Stuff!J60,VLOOKUP(Stuff!C54,Stuff!A55:D60,4)))))","v":0}]
[]
[null,"Percents Used"]
[null,{"$f":"C15","v":0},{"$f":"C16","v":0},{"$f":"C17","v":0},{"$f":"C18","v":0},{"$f":"C19","v":0},{"$f":"C20","v":0},{"$f":"C21","v":0}]
["Sieve",null,null,null,null,null,null,null,"% Req.","Design"]
["Size",null,null,null,null,null,null,null,{"$f":"SUM(B42:H42)","v":0},"Range"]
["2\"",{"$f":"IF(OR(B$42=0,Stuff!$K78=0),\"\",Stuff!C78)","v":""},{"$f":"IF(OR(C$42=0,Stuff!$K78=0),\"\",Stuff!D78)","v":""},{"$f":"IF(OR(D$42=0,Stuff!$K78=0),\"\",Stuff!E78)","v":""},{"$f":"IF(OR(E$42=0,Stuff!$K78=0),\"\",Stuff!F78)","v":""},{"$f":"IF(OR(F$42=0,Stuff!$K78=0),\"\",Stuff!G78)","v":""},{"$f":"IF(OR(G$42=0,Stuff!$K78=0),\"\",Stuff!H78)","v":""},{"$f":"IF(OR(H$42=0,Stuff!$K78=0),\"\",Stuff!I78)","v":""},{"$f":"IF(Stuff!$K$78=0,\"\",Stuff!$J$78)","v":""},{"$f":"IF(Stuff!$K78=0,\"\",Stuff!K78)","v":""}]
["1.5\"",{"$f":"IF(OR(B$42=0,Stuff!$K79=0),\"\",Stuff!C79)","v":""},{"$f":"IF(OR(C$42=0,Stuff!$K79=0),\"\",Stuff!D79)","v":""},{"$f":"IF(OR(D$42=0,Stuff!$K79=0),\"\",Stuff!E79)","v":""},{"$f":"IF(OR(E$42=0,Stuff!$K79=0),\"\",Stuff!F79)","v":""},{"$f":"IF(OR(F$42=0,Stuff!$K79=0),\"\",Stuff!G79)","v":""},{"$f":"IF(OR(G$42=0,Stuff!$K79=0),\"\",Stuff!H79)","v":""},{"$f":"IF(OR(H$42=0,Stuff!$K79=0),\"\",Stuff!I79)","v":""},{"$f":"IF(Stuff!$K$79=0,\"\",Stuff!$J$79)","v":""},{"$f":"IF(Stuff!$K79=0,\"\",Stuff!K79)","v":""}]
["1.25\"",{"$f":"IF(OR(B$42=0,Stuff!$K80=0),\"\",Stuff!C80)","v":""},{"$f":"IF(OR(C$42=0,Stuff!$K80=0),\"\",Stuff!D80)","v":""},{"$f":"IF(OR(D$42=0,Stuff!$K80=0),\"\",Stuff!E80)","v":""},{"$f":"IF(OR(E$42=0,Stuff!$K80=0),\"\",Stuff!F80)","v":""},{"$f":"IF(OR(F$42=0,Stuff!$K80=0),\"\",Stuff!G80)","v":""},{"$f":"IF(OR(G$42=0,Stuff!$K80=0),\"\",Stuff!H80)","v":""},{"$f":"IF(OR(H$42=0,Stuff!$K80=0),\"\",Stuff!I80)","v":""},{"$f":"IF(Stuff!$K$80=0,\"\",Stuff!$J$80)","v":""},{"$f":"IF(Stuff!$K80=0,\"\",Stuff!K80)","v":""}]
["1\"",{"$f":"IF(OR(B$42=0,Stuff!$K81=0),\"\",Stuff!C81)","v":""},{"$f":"IF(OR(C$42=0,Stuff!$K81=0),\"\",Stuff!D81)","v":""},{"$f":"IF(OR(D$42=0,Stuff!$K81=0),\"\",Stuff!E81)","v":""},{"$f":"IF(OR(E$42=0,Stuff!$K81=0),\"\",Stuff!F81)","v":""},{"$f":"IF(OR(F$42=0,Stuff!$K81=0),\"\",Stuff!G81)","v":""},{"$f":"IF(OR(G$42=0,Stuff!$K81=0),\"\",Stuff!H81)","v":""},{"$f":"IF(OR(H$42=0,Stuff!$K81=0),\"\",Stuff!I81)","v":""},{"$f":"IF(Stuff!$K$81=0,\"\",Stuff!$J$81)","v":""},{"$f":"IF(Stuff!$K81=0,\"\",Stuff!K81)","v":""}]
["3/4\"",{"$f":"IF(OR(B$42=0,Stuff!$K82=0),\"\",Stuff!C82)","v":""},{"$f":"IF(OR(C$42=0,Stuff!$K82=0),\"\",Stuff!D82)","v":""},{"$f":"IF(OR(D$42=0,Stuff!$K82=0),\"\",Stuff!E82)","v":""},{"$f":"IF(OR(E$42=0,Stuff!$K82=0),\"\",Stuff!F82)","v":""},{"$f":"IF(OR(F$42=0,Stuff!$K82=0),\"\",Stuff!G82)","v":""},{"$f":"IF(OR(G$42=0,Stuff!$K82=0),\"\",Stuff!H82)","v":""},{"$f":"IF(OR(H$42=0,Stuff!$K82=0),\"\",Stuff!I82)","v":""},{"$f":"IF(Stuff!$K$82=0,\"\",Stuff!$J$82)","v":""},{"$f":"IF(Stuff!$K82=0,\"\",Stuff!K82)","v":""}]
["5/8\"",{"$f":"IF(OR(B$42=0,Stuff!$K83=0),\"\",Stuff!C83)","v":""},{"$f":"IF(OR(C$42=0,Stuff!$K83=0),\"\",Stuff!D83)","v":""},{"$f":"IF(OR(D$42=0,Stuff!$K83=0),\"\",Stuff!E83)","v":""},{"$f":"IF(OR(E$42=0,Stuff!$K83=0),\"\",Stuff!F83)","v":""},{"$f":"IF(OR(F$42=0,Stuff!$K83=0),\"\",Stuff!G83)","v":""},{"$f":"IF(OR(G$42=0,Stuff!$K83=0),\"\",Stuff!H83)","v":""},{"$f":"IF(OR(H$42=0,Stuff!$K83=0),\"\",Stuff!I83)","v":""},{"$f":"IF(Stuff!$K$83=0,\"\",Stuff!$J$83)","v":""},{"$f":"IF(Stuff!$K83=0,\"\",Stuff!K83)","v":""}]
["1/2\"",{"$f":"IF(OR(B$42=0,Stuff!$K84=0),\"\",Stuff!C84)","v":""},{"$f":"IF(OR(C$42=0,Stuff!$K84=0),\"\",Stuff!D84)","v":""},{"$f":"IF(OR(D$42=0,Stuff!$K84=0),\"\",Stuff!E84)","v":""},{"$f":"IF(OR(E$42=0,Stuff!$K84=0),\"\",Stuff!F84)","v":""},{"$f":"IF(OR(F$42=0,Stuff!$K84=0),\"\",Stuff!G84)","v":""},{"$f":"IF(OR(G$42=0,Stuff!$K84=0),\"\",Stuff!H84)","v":""},{"$f":"IF(OR(H$42=0,Stuff!$K84=0),\"\",Stuff!I84)","v":""},{"$f":"IF(Stuff!$K$84=0,\"\",Stuff!$J$84)","v":""},{"$f":"IF(Stuff!$K84=0,\"\",Stuff!K84)","v":""}]
["3/8\"",{"$f":"IF(OR(B$42=0,Stuff!$K85=0),\"\",Stuff!C85)","v":""},{"$f":"IF(OR(C$42=0,Stuff!$K85=0),\"\",Stuff!D85)","v":""},{"$f":"IF(OR(D$42=0,Stuff!$K85=0),\"\",Stuff!E85)","v":""},{"$f":"IF(OR(E$42=0,Stuff!$K85=0),\"\",Stuff!F85)","v":""},{"$f":"IF(OR(F$42=0,Stuff!$K85=0),\"\",Stuff!G85)","v":""},{"$f":"IF(OR(G$42=0,Stuff!$K85=0),\"\",Stuff!H85)","v":""},{"$f":"IF(OR(H$42=0,Stuff!$K85=0),\"\",Stuff!I85)","v":""},{"$f":"IF(Stuff!$K$85=0,\"\",Stuff!$J$85)","v":""},{"$f":"IF(Stuff!$K85=0,\"\",Stuff!K85)","v":""}]
["No.4",{"$f":"IF(OR(B$42=0,Stuff!$K86=0),\"\",Stuff!C86)","v":""},{"$f":"IF(OR(C$42=0,Stuff!$K86=0),\"\",Stuff!D86)","v":""},{"$f":"IF(OR(D$42=0,Stuff!$K86=0),\"\",Stuff!E86)","v":""},{"$f":"IF(OR(E$42=0,Stuff!$K86=0),\"\",Stuff!F86)","v":""},{"$f":"IF(OR(F$42=0,Stuff!$K86=0),\"\",Stuff!G86)","v":""},{"$f":"IF(OR(G$42=0,Stuff!$K86=0),\"\",Stuff!H86)","v":""},{"$f":"IF(OR(H$42=0,Stuff!$K86=0),\"\",Stuff!I86)","v":""},{"$f":"IF(Stuff!$K$86=0,\"\",Stuff!$J$86)","v":""},{"$f":"IF(Stuff!$K86=0,\"\",Stuff!K86)","v":""}]
["No.8",{"$f":"IF(OR(B$42=0,Stuff!$K87=0),\"\",Stuff!C87)","v":""},{"$f":"IF(OR(C$42=0,Stuff!$K87=0),\"\",Stuff!D87)","v":""},{"$f":"IF(OR(D$42=0,Stuff!$K87=0),\"\",Stuff!E87)","v":""},{"$f":"IF(OR(E$42=0,Stuff!$K87=0),\"\",Stuff!F87)","v":""},{"$f":"IF(OR(F$42=0,Stuff!$K87=0),\"\",Stuff!G87)","v":""},{"$f":"IF(OR(G$42=0,Stuff!$K87=0),\"\",Stuff!H87)","v":""},{"$f":"IF(OR(H$42=0,Stuff!$K87=0),\"\",Stuff!I87)","v":""},{"$f":"IF(Stuff!$K$87=0,\"\",Stuff!$J$87)","v":""},{"$f":"IF(Stuff!$K87=0,\"\",Stuff!K87)","v":""}]
["No.16",{"$f":"IF(OR(B$42=0,Stuff!$K88=0),\"\",Stuff!C88)","v":""},{"$f":"IF(OR(C$42=0,Stuff!$K88=0),\"\",Stuff!D88)","v":""},{"$f":"IF(OR(D$42=0,Stuff!$K88=0),\"\",Stuff!E88)","v":""},{"$f":"IF(OR(E$42=0,Stuff!$K88=0),\"\",Stuff!F88)","v":""},{"$f":"IF(OR(F$42=0,Stuff!$K88=0),\"\",Stuff!G88)","v":""},{"$f":"IF(OR(G$42=0,Stuff!$K88=0),\"\",Stuff!H88)","v":""},{"$f":"IF(OR(H$42=0,Stuff!$K88=0),\"\",Stuff!I88)","v":""},{"$f":"IF(Stuff!$K$88=0,\"\",Stuff!$J$88)","v":""},{"$f":"IF(Stuff!$K88=0,\"\",Stuff!K88)","v":""}]
["No.30",{"$f":"IF(OR(B$42=0,Stuff!$K89=0),\"\",Stuff!C89)","v":""},{"$f":"IF(OR(C$42=0,Stuff!$K89=0),\"\",Stuff!D89)","v":""},{"$f":"IF(OR(D$42=0,Stuff!$K89=0),\"\",Stuff!E89)","v":""},{"$f":"IF(OR(E$42=0,Stuff!$K89=0),\"\",Stuff!F89)","v":""},{"$f":"IF(OR(F$42=0,Stuff!$K89=0),\"\",Stuff!G89)","v":""},{"$f":"IF(OR(G$42=0,Stuff!$K89=0),\"\",Stuff!H89)","v":""},{"$f":"IF(OR(H$42=0,Stuff!$K89=0),\"\",Stuff!I89)","v":""},{"$f":"IF(Stuff!$K$89=0,\"\",Stuff!$J$89)","v":""},{"$f":"IF(Stuff!$K89=0,\"\",Stuff!K89)","v":""}]
["No.50",{"$f":"IF(OR(B$42=0,Stuff!$K90=0),\"\",Stuff!C90)","v":""},{"$f":"IF(OR(C$42=0,Stuff!$K90=0),\"\",Stuff!D90)","v":""},{"$f":"IF(OR(D$42=0,Stuff!$K90=0),\"\",Stuff!E90)","v":""},{"$f":"IF(OR(E$42=0,Stuff!$K90=0),\"\",Stuff!F90)","v":""},{"$f":"IF(OR(F$42=0,Stuff!$K90=0),\"\",Stuff!G90)","v":""},{"$f":"IF(OR(G$42=0,Stuff!$K90=0),\"\",Stuff!H90)","v":""},{"$f":"IF(OR(H$42=0,Stuff!$K90=0),\"\",Stuff!I90)","v":""},{"$f":"IF(Stuff!$K$90=0,\"\",Stuff!$J$90)","v":""},{"$f":"IF(Stuff!$K90=0,\"\",Stuff!K90)","v":""}]
["No.100",{"$f":"IF(OR(B$42=0,Stuff!$K91=0),\"\",Stuff!C91)","v":""},{"$f":"IF(OR(C$42=0,Stuff!$K91=0),\"\",Stuff!D91)","v":""},{"$f":"IF(OR(D$42=0,Stuff!$K91=0),\"\",Stuff!E91)","v":""},{"$f":"IF(OR(E$42=0,Stuff!$K91=0),\"\",Stuff!F91)","v":""},{"$f":"IF(OR(F$42=0,Stuff!$K91=0),\"\",Stuff!G91)","v":""},{"$f":"IF(OR(G$42=0,Stuff!$K91=0),\"\",Stuff!H91)","v":""},{"$f":"IF(OR(H$42=0,Stuff!$K91=0),\"\",Stuff!I91)","v":""},{"$f":"IF(Stuff!$K$91=0,\"\",Stuff!$J$91)","v":""},{"$f":"IF(Stuff!$K91=0,\"\",Stuff!K91)","v":""}]
["No.200",{"$f":"IF(OR(B$42=0,Stuff!$K92=0),\"\",Stuff!C92)","v":""},{"$f":"IF(OR(C$42=0,Stuff!$K92=0),\"\",Stuff!D92)","v":""},{"$f":"IF(OR(D$42=0,Stuff!$K92=0),\"\",Stuff!E92)","v":""},{"$f":"IF(OR(E$42=0,Stuff!$K92=0),\"\",Stuff!F92)","v":""},{"$f":"IF(OR(F$42=0,Stuff!$K92=0),\"\",Stuff!G92)","v":""},{"$f":"IF(OR(G$42=0,Stuff!$K92=0),\"\",Stuff!H92)","v":""},{"$f":"IF(OR(H$42=0,Stuff!$K92=0),\"\",Stuff!I92)","v":""},{"$f":"IF(Stuff!$K$92=0,\"\",Stuff!$J$92)","v":""},{"$f":"IF(Stuff!$K92=0,\"\",Stuff!K92)","v":""}]
[]
[]
["Requested:",null,null,null,null,"Approved:"]
[null,null,"Contractor Personnel and Lab Tech Cert No.",null,null,null,null,"Regional Materials and Tests Supervisor"]
[]
[null,null,"Date last lab inspection"]

{"sheet":"Stuff","index":1,"n_rows":330,"n_cols":30,"rows_kept":330,"cut":false,"hidden":true,"merged":[[10,2,11,11],[63,5,63,7],[27,20,27,21],[22,26,22,27],[53,9,53,10],[56,9,56,10],[58,9,58,10],[59,9,59,10],[56,13,56,14],[74,8,75,8],[71,7,71,10],[74,2,75,2],[74,3,75,3],[74,4,75,4],[74,5,75,5],[74,6,75,6],[74,7,75,7],[73,2,73,8]]}
["Aggregate Sizes",null,"Cell Links"]
[1,null,1,1,1,1]
[{"$f":"1+A2","v":2},"Coarse Aggregate",8,1,1,1]
[3,"Medium Coarse Aggregate",4,1,1,1]
[4,"Screenings",12,1,1,1]
[5,"Washed Screenings",2,1,1,1]
[6,"Manufactured Sand",2,1,1]
[7,"Natural Sand",3,1,1]
[8,"Mineral Filler",4,1,1]
[9,"Baghouse Fines"]
[10,"Non Processed RAP","What do you think you're doing? Quit messing with this. You're going to mess it up."]
[11,"Minus 1.5 inch Rap"]
[12,"Minus 3/4 inch Rap"]
[13,"Minus 1/2 inch Rap"]
[14,"Minus 5/16 inch Rap"]
[null,null,null,null,null,null,null,null,null,null,null,null,null,null,null,null,null,null,null,null,null,null,null,null,null,null,"Opt.",{"$f":"'Mix Des. Data'!B34","v":0},"charts optimum"]
["AC Grades",null,null,null,null,null,null,null,null,null,null,null,null,null,null,null,null,null,null,null,null,null,null,null,null,null,"high",{"$f":"AB16-0.25","v":-0.25},{"$f":"AB16","v":0},0]
[1," ",null,null,null,null,null,null,null,null,null,null,null,null,null,null,null,null,null,null,null,null,null,null,null,null,"low",{"$f":"AB16+0.25","v":0.25},{"$f":"AB16","v":0},6.5]
[2,null,null,null,null,null,null,null,null,null,null,null,null,null,null,null,null,null,null,null,null,null,null,null,null,null,"charts low voids",null,"charts high voids"]
[3,"PG 64-22/67-22"]
[4,"PG 70-22",null,null,null,null,null,null,null,null,null,null,null,null,null,null,null,null,null,null,null,null,null,null,null,null,{"$f":"VLOOKUP(C27,A33:V44,21)","v":{"$error":"#N/A"}},3.5,{"$f":"VLOOKUP(C27,A33:V44,22)","v":{"$error":"#N/A"}},3.5]
[5,"PG 76-22",null,null,null,null,null,null,null,null,null,null,null,null,null,null,null,null,null,null,null,null,null,null,null,null,{"$f":"AA21","v":{"$error":"#N/A"}},8,{"$f":"AC21","v":{"$error":"#N/A"}},8]
[6,"PG 82-22",null,null,null,null,null,null,null,null,null,null,null,null,null,null,null,null,null,null,null,null,null,null,null,null,"charts low ac",null,"charts high ac"]
[null,null,null,null,null,null,null,null,null,null,null,null,null,null,null,null,null,null,null,null,null,null,null,null,null,null,{"$f":"AB18","v":0.25},0,{"$f":"AB17","v":-0.25},0]
[null,null,null,null,null,null,null,null,null,null,null,null,null,null,null,null,null,null,null,null,null,null,null,null,null,null,{"$f":"AA24","v":0.25},6.5,{"$f":"AC24","v":-0.25},6.5]
[null,null,null,"Gradations"]
["Section Numbers",null,1,"2\"","1.5\"","1.25\"","1\"","3/4\"","5/8\"","1/2\"","3/8\"","#4","#8","#16","#30","#50","#100","#200"]
[1," ",null,null,null,null,null,null,null,null,null,null,null,null,null,null,null,null,null,null,"Void Range"]
[2,"307-A",null,100,"81-100",null,null,"50-71",null,null,"35-50","24-36","13-27",null,"7-17",null,"0-10","0-4.5","BPMB-HM","307-A",3,5.5]
[3,"307-AS",null,100,"75-100",null,null,"55-80",null,null,null,"7-11",null,null,null,null,"0-6","0-4.5","BPMB-HM","307-AS",3.5,5.5]
[4,"307ACRL",null,100,"80-93",null,null,"60-75",null,null,null,"12-16",null,null,null,null,"0-4","0-3.5","BPMB-HM","307-ACRL",3,5.5]
[5,"307-B",null,100,"95-100",null,null,"70-85",null,null,"49-72","34-51","23-42",null,"11-22","9-14","4-10","2.5-6.5","BPMB-HM","307-B",3,5.5]
[6,"307-BM",null,null,null,null,"100","85-100",null,null,"59-79","42-61","29-47",null,"13-27","7-20","4-10","0-6.5","BPMB-HM","307-BM",3,5.5]
[7,"307-BM2",null,null,null,100,null,"81-93",null,null,"57-73","40-56","28-43",null,"13-25","9-19","6-10","2.5-6.5","BPMB-HM","307-BM2",3,5.5]
[8,"307-C",null,null,null,null,null,"100",null,null,"70-90","39-66","23-47",null,"10-27","8-15","4-8","2.5-6.5","BPMB-HM","307-C",3,5.5]
[9,"307-CW",null,null,null,null,null,"100",null,null,"75-100",null,"43-67",null,"23-47",null,"4-10","2.5-6.5","BPMB-HM","307-CW",3,5]
[10,"307-CS",null,null,null,null,null,null,null,null,"100","89-94","53-77",null,"23-42",null,"9-18","6-13.5","BPMB-HM","307-CS",1,5]
[11,"307-CAM",null,null,null,null,null,100,null,null,"75-100","NO RANGE","NO RANGE","NO RANGE","NO RANGE","NO RANGE","NO RANGE","NO RANGE","BPMB-HM","307-CAM"]
[12,"313-TPB",null,"100","70-100",null,null,"55-80",null,null,null,"0-11",null,null,null,null,"0-4","0-3","BPMB-HM","313-TPB",2,5]
[13,"411-D",null,null,null,null,null,null,"100","95-100","80-93","54-76","35-57",null,"17-29","10-18","3-10","0-6.5","ACS-HM","411-D",3,5.5]
[14,"411-E",null,null,null,null,null,null,"100","95-100","80-93","54-76","35-57",null,"17-29","10-18","3-11","0-8","ACS-HM","411-E",3,5.5]
[15,"411-E (shoulders)",null,null,null,null,null,null,100,"95-100","80-93","54-76","35-57",null,"17-29","10-18","3-11","0-8","ACS-HM","411-E(shoulder)",2,5]
[16,"411-TL",null,null,null,null,null,null,null,null,100,"89-94","53-77",null,"23-42",null,"9-18","6-14","ACS-HM","411-TL",3,5.5]
[17,"411-TLD",null,null,null,null,null,null,null,100,"90-100","54-76","35-57",null,"17-33","10-18","3-10","3-7","ACS-HM","411-TLD",3,5.5]
[18,"411-OGFC",null,null,null,null,null,100,null,"85-100","55-75"," 10-25"," 5-10",null,null,null,null," 2-4","ACS-HM","411-OGFC",20,30]
[19,"411-OGFC (shoulders)",null,null,null,null,null,100,null,"85-100","55-75"," 10-25"," 5-10",null,null,null,null," 2-4","ACS-HM","411-OGFC(shoulder)",20,30]
[20,"307-CM",null,null,null,null,null,100,null,null,"75-100",null,"35-57",null,"18-35",null,"4-10","2.5-6.5","BPMB-HM","307-CM",3,5.5]
[21,"411-NC (A)",null,null,null,null,null,null,null,null,100,"40-55","22-32","15-25"," 10-18"," 8-13"," 6-10"," 4-6","ACS-HM","411-NC (A)"]
[22,"411-NC (B)",null,null,null,null,null,null,100,"90-100","75-100","25-38","19-27","15-23"," 10-18"," 8-13"," 6-10"," 4-6","ACS-HM","411-NC (B)"]
[23,"411-NC (C)",null,null,null,null,null,100,null,"75-100","50-80","25-38","19-27","15-23"," 10-18"," 8-13"," 6-10"," 4-6","ACS-HM","411-NC (C)"]
[24,"411-SMA",null,null,null,null,null,100,null,"90-100","50-80","20-35","16-24",null,null,null,null," 8-11","ACS-HM","411-SMA"]
[25,"411-TLE",null,null,null,null,null,null,null,100,"90-100","54-76","35-57",null,"17-33","10-18","3-10","4-7","ACS-HM","411-TLE",3,5.5]
[26,"411-TLE (shoulders)",null,null,null,null,null,null,null,100,"90-100","54-76","35-57",null,"17-33","10-18","3-10","4-7","ACS-HM","411-TLE (shoulder)",2,5]
["Special Designations",null,1,{"$f":"VLOOKUP(C54,A55:E60,5)","v":0},{"$f":"VLOOKUP(C54,A55:C60,3)","v":0},null,"Warm Mix",null,1,"Temps",null,null,"OGFC","code = 17","TEMP"]
[1,null,null,null,null,null,1,null,null,"Min","Max",null,null,"min","max"]
[2,null,null,null,null,null,2,"Yes",null,{"$f":"'JMF1'!D36-20","v":-20},{"$f":"MIN(300,'JMF1'!D36+20)","v":20},null,null,280,{"$f":"RIGHT(VLOOKUP('JMF1'!C22,Stuff!C56:D60,2,0),5)","v":{"$error":"#N/A"}}]
[3,"PG 64-22/67-22","PG 64-22/67-22","270ºF ≤ T ≤ 310ºF","904.01.001",null,3,"No",null,{"$f":"J56&\"ºF ≤ T ≤ \"&K56&\"ºF\"","v":"-20ºF ≤ T ≤ 20ºF"},null,null,null,{"$f":"N56&\"ºF ≤ T ≤ \"&O56&\"\"","v":{"$error":"#N/A"}}]
[4,"PG 70-22","PG 70-22","290ºF ≤ T ≤ 330ºF","904.01.002"]
[5,"PG 76-22","PG 76-22","290ºF ≤ T ≤ 330ºF","904.01.003",null,"TPB, ACRL, and AS (PG64, PG67)",null,null,"225°F ≤ T ≤ 275°F"]
[6,"PG 82-22","PG 82-22","290ºF ≤ T ≤ 330ºF","904.01.004",null,"TPB, ACRL, and AS (PG70 and above)",null,null,"250°F ≤ T ≤ 310°F"]
[]
[]
[]
[null,null,null,"Aggregate Source","Stockpile selection","Source Size",null,null,"Material Description",null,null,"Material Code","Supplier Description",null,null,null,null,"Supplier Code","Individual %","Source/ Supplier",null,"Cum %"]
[null,null,null,1,2,{"$f":"HLOOKUP($E65,'Aggregate Suppliers'!$F$9:$AI$20,8)","v":0},null,null,{"$f":"HLOOKUP($E65,'Aggregate Suppliers'!$F$9:$AI$20,10)","v":0},null,null,{"$f":"HLOOKUP($E65,'Aggregate Suppliers'!$F$9:$AI$20,11)","v":0},{"$f":"HLOOKUP($E65,'Aggregate Suppliers'!$F$9:$AI$20,6)","v":0},null,null,null,null,{"$f":"HLOOKUP($E65,'Aggregate Suppliers'!$F$9:$AI$20,5)","v":0},{"$f":"'JMF1'!B42","v":0},{"$f":"L65&R65","v":"00"},null,{"$f":"SUMIF($T$65:$T$71,\"=\"&T65,$S$65:$S$71)","v":0}]
[null,null,null,2,1,{"$f":"HLOOKUP(E66,'Aggregate Suppliers'!$F$9:$AI$20,8)","v":0},null,null,{"$f":"HLOOKUP($E66,'Aggregate Suppliers'!$F$9:$AI$20,10)","v":0},null,null,{"$f":"HLOOKUP($E66,'Aggregate Suppliers'!$F$9:$AI$20,11)","v":0},{"$f":"HLOOKUP($E66,'Aggregate Suppliers'!$F$9:$AI$20,6)","v":0},null,null,null,null,{"$f":"HLOOKUP($E66,'Aggregate Suppliers'!$F$9:$AI$20,5)","v":0},{"$f":"'JMF1'!C42","v":0},{"$f":"L66&R66","v":"00"},null,{"$f":"IF(T66=T65,0,SUMIF($T$65:$T$71,\"=\"&T66,$S$65:$S$71))","v":0}]
[null,null,null,3,1,{"$f":"HLOOKUP(E67,'Aggregate Suppliers'!$F$9:$AI$20,8)","v":0},null,null,{"$f":"HLOOKUP($E67,'Aggregate Suppliers'!$F$9:$AI$20,10)","v":0},null,null,{"$f":"HLOOKUP($E67,'Aggregate Suppliers'!$F$9:$AI$20,11)","v":0},{"$f":"HLOOKUP($E67,'Aggregate Suppliers'!$F$9:$AI$20,6)","v":0},null,null,null,null,{"$f":"HLOOKUP($E67,'Aggregate Suppliers'!$F$9:$AI$20,5)","v":0},{"$f":"'JMF1'!D42","v":0},"00",null,{"$f":"IF(OR(T67=T65,T67=T66),0,SUMIF($T$65:$T$71,\"=\"&T67,$S$65:$S$71))","v":0}]
[null,null,null,4,1,{"$f":"HLOOKUP(E68,'Aggregate Suppliers'!$F$9:$AI$20,8)","v":0},null,null,{"$f":"HLOOKUP($E68,'Aggregate Suppliers'!$F$9:$AI$20,10)","v":0},null,null,{"$f":"HLOOKUP($E68,'Aggregate Suppliers'!$F$9:$AI$20,11)","v":0},{"$f":"HLOOKUP($E68,'Aggregate Suppliers'!$F$9:$AI$20,6)","v":0},null,null,null,null,{"$f":"HLOOKUP($E68,'Aggregate Suppliers'!$F$9:$AI$20,5)","v":0},{"$f":"'JMF1'!E42","v":0},"00",null,{"$f":"IF(OR(T68=T65,T68=T66,T68=T67),0,SUMIF($T$65:$T$71,\"=\"&T68,$S$65:$S$71))","v":0}]
[null,null,null,5,1,{"$f":"HLOOKUP(E69,'Aggregate Suppliers'!$F$9:$AI$20,8)","v":0},null,null,{"$f":"HLOOKUP($E69,'Aggregate Suppliers'!$F$9:$AI$20,10)","v":0},null,null,{"$f":"HLOOKUP($E69,'Aggregate Suppliers'!$F$9:$AI$20,11)","v":0},{"$f":"HLOOKUP($E69,'Aggregate Suppliers'!$F$9:$AI$20,6)","v":0},null,null,null,null,{"$f":"HLOOKUP($E69,'Aggregate Suppliers'!$F$9:$AI$20,5)","v":0},{"$f":"'JMF1'!F42","v":0},"00",null,{"$f":"IF(OR(T69=T65,T69=T66,T69=T67,T69=T68),0,SUMIF($T$65:$T$71,\"=\"&T69,$S$65:$S$71))","v":0}]
[null,null,null,6,1,{"$f":"HLOOKUP(E70,'Aggregate Suppliers'!$F$9:$AI$20,8)","v":0},null,null,{"$f":"HLOOKUP($E70,'Aggregate Suppliers'!$F$9:$AI$20,10)","v":0},null,null,{"$f":"HLOOKUP($E70,'Aggregate Suppliers'!$F$9:$AI$20,11)","v":0},{"$f":"HLOOKUP($E70,'Aggregate Suppliers'!$F$9:$AI$20,6)","v":0},null,null,null,null,{"$f":"HLOOKUP($E70,'Aggregate Suppliers'!$F$9:$AI$20,5)","v":0},{"$f":"'JMF1'!G42","v":0},"00",null,{"$f":"IF(OR(T70=T65,T70=T66,T70=T67,T70=T68,T70=T69),0,SUMIF($T$65:$T$71,\"=\"&T70,$S$65:$S$71))","v":0}]
[null,null,null,7,1,{"$f":"HLOOKUP(E71,'Aggregate Suppliers'!$F$9:$AI$20,8)","v":0},null,null,{"$f":"HLOOKUP($E71,'Aggregate Suppliers'!$F$9:$AI$20,10)","v":0},null,null,{"$f":"HLOOKUP($E71,'Aggregate Suppliers'!$F$9:$AI$20,11)","v":0},{"$f":"HLOOKUP($E71,'Aggregate Suppliers'!$F$9:$AI$20,6)","v":0},null,null,null,null,{"$f":"HLOOKUP($E71,'Aggregate Suppliers'!$F$9:$AI$20,5)","v":0},{"$f":"'JMF1'!H42","v":0},"00",null,{"$f":"IF(OR(T71=T65,T71=U66,U71=T67,T71=T68,T71=T69,T71=T70),0,SUMIF($T$65:$T$71,\"=\"&T71,$S$65:$S$71))","v":0}]
[null,null,null,null,null,null,null,null,null,null,null,null,null,null,null,null,null,null,null,null,null,{"$f":"SUM(V65:V71)","v":0}]
[null,null,null,null,null,null,null,null,null,null,null,null,null,null,null,null,null,null,null,null,null,{"$f":"IF(V72<>'JMF1'!I42,\"!!!\",\"OK\")","v":"OK"}]
[null,null,"Percents Used"]
[null,null,{"$f":"D65","v":1},{"$f":"D66","v":2},{"$f":"D67","v":3},{"$f":"D68","v":4},{"$f":"D69","v":5},{"$f":"D70","v":6},{"$f":"D71","v":7}]
[null,"Seive",null,null,null,null,null,null,null,"Req%","Design",null,null,"Source","Percentage","Absorption","% Coarse","Coarse Factor","Coarse Absorption"]
[null,"Size",{"$f":"'JMF1'!$B$42","v":0},{"$f":"'JMF1'!$C$42","v":0},{"$f":"'JMF1'!$D$42","v":0},{"$f":"'JMF1'!$E$42","v":0},{"$f":"'JMF1'!$F$42","v":0},{"$f":"'JMF1'!$G$42","v":0},{"$f":"'JMF1'!$H$42","v":0},{"$f":"SUM(C77:I77)","v":0},"Range",null,"Agg 1",{"$f":"M65","v":0},{"$f":"S65","v":0},{"$f":"IF(ISBLANK(N77),,VLOOKUP(N77,'Aggregate Suppliers'!$B$3:$D$395,3,FALSE))","v":0},{"$f":"100-C86","v":100},{"$f":"O77*Q77/100","v":0},{"$f":"P77*R77/$R$85","v":{"$error":"#DIV/0!"}}]
[5,"2\"",{"$f":"ROUND(HLOOKUP($E$65,'Contractors Gradations'!$B$2:$AE$21,$A78),0)","v":0},{"$f":"ROUND(HLOOKUP($E$66,'Contractors Gradations'!$B$2:$AE$21,$A78),0)","v":0},{"$f":"ROUND(HLOOKUP($E$67,'Contractors Gradations'!$B$2:$AE$21,$A78),0)","v":0},{"$f":"ROUND(HLOOKUP($E$68,'Contractors Gradations'!$B$2:$AE$21,$A78),0)","v":0},{"$f":"ROUND(HLOOKUP($E$69,'Contractors Gradations'!$B$2:$AE$21,$A78),0)","v":0},{"$f":"ROUND(HLOOKUP($E$70,'Contractors Gradations'!$B$2:$AE$21,$A78),0)","v":0},{"$f":"ROUND(HLOOKUP($E$71,'Contractors Gradations'!$B$2:$AE$21,$A78),0)","v":0},{"$f":"ROUND((C78*$C$77+D78*$D$77+E78*$E$77+F78*$F$77+G78*$G$77+H78*$H$77+I78*$I$77)/100,0)","v":0},{"$f":"VLOOKUP($C$27,$A$28:$R$53,$A78-1)","v":0},null,"Agg 2",{"$f":"M66","v":0},{"$f":"S66","v":0},{"$f":"IF(ISBLANK(N78),,VLOOKUP(N78,'Aggregate Suppliers'!$B$3:$D$395,3,FALSE))","v":0},{"$f":"100-D86","v":100},{"$f":"O78*Q78/100","v":0},{"$f":"P78*R78/$R$85","v":{"$error":"#DIV/0!"}}]
[{"$f":"1+A78","v":6},"1.5\"",{"$f":"ROUND(HLOOKUP($E$65,'Contractors Gradations'!$B$2:$AE$21,$A79),0)","v":0},{"$f":"ROUND(HLOOKUP($E$66,'Contractors Gradations'!$B$2:$AE$21,$A79),0)","v":0},{"$f":"ROUND(HLOOKUP($E$67,'Contractors Gradations'!$B$2:$AE$21,$A79),0)","v":0},{"$f":"ROUND(HLOOKUP($E$68,'Contractors Gradations'!$B$2:$AE$21,$A79),0)","v":0},{"$f":"ROUND(HLOOKUP($E$69,'Contractors Gradations'!$B$2:$AE$21,$A79),0)","v":0},{"$f":"ROUND(HLOOKUP($E$70,'Contractors Gradations'!$B$2:$AE$21,$A79),0)","v":0},{"$f":"ROUND(HLOOKUP($E$71,'Contractors Gradations'!$B$2:$AE$21,$A79),0)","v":0},{"$f":"ROUND((C79*$C$77+D79*$D$77+E79*$E$77+F79*$F$77+G79*$G$77+H79*$H$77+I79*$I$77)/100,0)","v":0},0,null,"Agg 3",0,0,{"$f":"IF(ISBLANK(N79),,VLOOKUP(N79,'Aggregate Suppliers'!$B$3:$D$395,3,FALSE))","v":0},{"$f":"100-E86","v":100},0,{"$error":"#DIV/0!"}]
[{"$f":"1+A79","v":7},"1.25\"",{"$f":"ROUND(HLOOKUP($E$65,'Contractors Gradations'!$B$2:$AE$21,$A80),0)","v":0},{"$f":"ROUND(HLOOKUP($E$66,'Contractors Gradations'!$B$2:$AE$21,$A80),0)","v":0},{"$f":"ROUND(HLOOKUP($E$67,'Contractors Gradations'!$B$2:$AE$21,$A80),0)","v":0},{"$f":"ROUND(HLOOKUP($E$68,'Contractors Gradations'!$B$2:$AE$21,$A80),0)","v":0},{"$f":"ROUND(HLOOKUP($E$69,'Contractors Gradations'!$B$2:$AE$21,$A80),0)","v":0},{"$f":"ROUND(HLOOKUP($E$70,'Contractors Gradations'!$B$2:$AE$21,$A80),0)","v":0},{"$f":"ROUND(HLOOKUP($E$71,'Contractors Gradations'!$B$2:$AE$21,$A80),0)","v":0},0,0,null,"Agg 4",0,0,{"$f":"IF(ISBLANK(N80),,VLOOKUP(N80,'Aggregate Suppliers'!$B$3:$D$395,3,FALSE))","v":0},{"$f":"100-F86","v":100},0,{"$error":"#DIV/0!"}]
[8,"1\"",{"$f":"ROUND(HLOOKUP($E$65,'Contractors Gradations'!$B$2:$AE$21,$A81),0)","v":0},{"$f":"ROUND(HLOOKUP($E$66,'Contractors Gradations'!$B$2:$AE$21,$A81),0)","v":0},{"$f":"ROUND(HLOOKUP($E$67,'Contractors Gradations'!$B$2:$AE$21,$A81),0)","v":0},{"$f":"ROUND(HLOOKUP($E$68,'Contractors Gradations'!$B$2:$AE$21,$A81),0)","v":0},{"$f":"ROUND(HLOOKUP($E$69,'Contractors Gradations'!$B$2:$AE$21,$A81),0)","v":0},{"$f":"ROUND(HLOOKUP($E$70,'Contractors Gradations'!$B$2:$AE$21,$A81),0)","v":0},{"$f":"ROUND(HLOOKUP($E$71,'Contractors Gradations'!$B$2:$AE$21,$A81),0)","v":0},0,0,null,"Agg 5",0,0,{"$f":"IF(ISBLANK(N81),,VLOOKUP(N81,'Aggregate Suppliers'!$B$3:$D$395,3,FALSE))","v":0},{"$f":"100-G86","v":100},0,{"$error":"#DIV/0!"}]
[9,"3/4\"",{"$f":"ROUND(HLOOKUP($E$65,'Contractors Gradations'!$B$2:$AE$21,$A82),0)","v":0},{"$f":"ROUND(HLOOKUP($E$66,'Contractors Gradations'!$B$2:$AE$21,$A82),0)","v":0},{"$f":"ROUND(HLOOKUP($E$67,'Contractors Gradations'!$B$2:$AE$21,$A82),0)","v":0},{"$f":"ROUND(HLOOKUP($E$68,'Contractors Gradations'!$B$2:$AE$21,$A82),0)","v":0},{"$f":"ROUND(HLOOKUP($E$69,'Contractors Gradations'!$B$2:$AE$21,$A82),0)","v":0},{"$f":"ROUND(HLOOKUP($E$70,'Contractors Gradations'!$B$2:$AE$21,$A82),0)","v":0},{"$f":"ROUND(HLOOKUP($E$71,'Contractors Gradations'!$B$2:$AE$21,$A82),0)","v":0},0,0,null,"Agg 6",0,0,{"$f":"IF(ISBLANK(N82),,VLOOKUP(N82,'Aggregate Suppliers'!$B$3:$D$395,3,FALSE))","v":0},{"$f":"100-H86","v":100},0,{"$error":"#DIV/0!"}]
[10,"5/8\"",{"$f":"ROUND(HLOOKUP($E$65,'Contractors Gradations'!$B$2:$AE$21,$A83),0)","v":0},{"$f":"ROUND(HLOOKUP($E$66,'Contractors Gradations'!$B$2:$AE$21,$A83),0)","v":0},{"$f":"ROUND(HLOOKUP($E$67,'Contractors Gradations'!$B$2:$AE$21,$A83),0)","v":0},{"$f":"ROUND(HLOOKUP($E$68,'Contractors Gradations'!$B$2:$AE$21,$A83),0)","v":0},{"$f":"ROUND(HLOOKUP($E$69,'Contractors Gradations'!$B$2:$AE$21,$A83),0)","v":0},{"$f":"ROUND(HLOOKUP($E$70,'Contractors Gradations'!$B$2:$AE$21,$A83),0)","v":0},{"$f":"ROUND(HLOOKUP($E$71,'Contractors Gradations'!$B$2:$AE$21,$A83),0)","v":0},0,0,null,"Agg 7",0,0,{"$f":"IF(ISBLANK(N83),,VLOOKUP(N83,'Aggregate Suppliers'!$B$3:$D$395,3,FALSE))","v":0},{"$f":"100-I86","v":100},0,{"$error":"#DIV/0!"}]
[11,"1/2\"",{"$f":"ROUND(HLOOKUP($E$65,'Contractors Gradations'!$B$2:$AE$21,$A84),0)","v":0},{"$f":"ROUND(HLOOKUP($E$66,'Contractors Gradations'!$B$2:$AE$21,$A84),0)","v":0},{"$f":"ROUND(HLOOKUP($E$67,'Contractors Gradations'!$B$2:$AE$21,$A84),0)","v":0},{"$f":"ROUND(HLOOKUP($E$68,'Contractors Gradations'!$B$2:$AE$21,$A84),0)","v":0},{"$f":"ROUND(HLOOKUP($E$69,'Contractors Gradations'!$B$2:$AE$21,$A84),0)","v":0},{"$f":"ROUND(HLOOKUP($E$70,'Contractors Gradations'!$B$2:$AE$21,$A84),0)","v":0},{"$f":"ROUND(HLOOKUP($E$71,'Contractors Gradations'!$B$2:$AE$21,$A84),0)","v":0},0,0]
[12,"3/8\"",{"$f":"ROUND(HLOOKUP($E$65,'Contractors Gradations'!$B$2:$AE$21,$A85),0)","v":0},{"$f":"ROUND(HLOOKUP($E$66,'Contractors Gradations'!$B$2:$AE$21,$A85),0)","v":0},{"$f":"ROUND(HLOOKUP($E$67,'Contractors Gradations'!$B$2:$AE$21,$A85),0)","v":0},{"$f":"ROUND(HLOOKUP($E$68,'Contractors Gradations'!$B$2:$AE$21,$A85),0)","v":0},{"$f":"ROUND(HLOOKUP($E$69,'Contractors Gradations'!$B$2:$AE$21,$A85),0)","v":0},{"$f":"ROUND(HLOOKUP($E$70,'Contractors Gradations'!$B$2:$AE$21,$A85),0)","v":0},{"$f":"ROUND(HLOOKUP($E$71,'Contractors Gradations'!$B$2:$AE$21,$A85),0)","v":0},0,0,null,null,null,null,null,null,{"$f":"SUM(R77:R83)","v":0},{"$f":"SUM(S77:S83)","v":{"$error":"#DIV/0!"}}]
[13,"No.4",{"$f":"ROUND(HLOOKUP($E$65,'Contractors Gradations'!$B$2:$AE$21,$A86),0)","v":0},{"$f":"ROUND(HLOOKUP($E$66,'Contractors Gradations'!$B$2:$AE$21,$A86),0)","v":0},{"$f":"ROUND(HLOOKUP($E$67,'Contractors Gradations'!$B$2:$AE$21,$A86),0)","v":0},{"$f":"ROUND(HLOOKUP($E$68,'Contractors Gradations'!$B$2:$AE$21,$A86),0)","v":0},{"$f":"ROUND(HLOOKUP($E$69,'Contractors Gradations'!$B$2:$AE$21,$A86),0)","v":0},{"$f":"ROUND(HLOOKUP($E$70,'Contractors Gradations'!$B$2:$AE$21,$A86),0)","v":0},{"$f":"ROUND(HLOOKUP($E$71,'Contractors Gradations'!$B$2:$AE$21,$A86),0)","v":0},0,0]
[14,"No.8",{"$f":"ROUND(HLOOKUP($E$65,'Contractors Gradations'!$B$2:$AE$21,$A87),0)","v":0},{"$f":"ROUND(HLOOKUP($E$66,'Contractors Gradations'!$B$2:$AE$21,$A87),0)","v":0},{"$f":"ROUND(HLOOKUP($E$67,'Contractors Gradations'!$B$2:$AE$21,$A87),0)","v":0},{"$f":"ROUND(HLOOKUP($E$68,'Contractors Gradations'!$B$2:$AE$21,$A87),0)","v":0},{"$f":"ROUND(HLOOKUP($E$69,'Contractors Gradations'!$B$2:$AE$21,$A87),0)","v":0},{"$f":"ROUND(HLOOKUP($E$70,'Contractors Gradations'!$B$2:$AE$21,$A87),0)","v":0},{"$f":"ROUND(HLOOKUP($E$71,'Contractors Gradations'!$B$2:$AE$21,$A87),0)","v":0},0,0]
[15,"No.16",{"$f":"ROUND(HLOOKUP($E$65,'Contractors Gradations'!$B$2:$AE$21,$A88),0)","v":0},{"$f":"ROUND(HLOOKUP($E$66,'Contractors Gradations'!$B$2:$AE$21,$A88),0)","v":0},{"$f":"ROUND(HLOOKUP($E$67,'Contractors Gradations'!$B$2:$AE$21,$A88),0)","v":0},{"$f":"ROUND(HLOOKUP($E$68,'Contractors Gradations'!$B$2:$AE$21,$A88),0)","v":0},{"$f":"ROUND(HLOOKUP($E$69,'Contractors Gradations'!$B$2:$AE$21,$A88),0)","v":0},{"$f":"ROUND(HLOOKUP($E$70,'Contractors Gradations'!$B$2:$AE$21,$A88),0)","v":0},{"$f":"ROUND(HLOOKUP($E$71,'Contractors Gradations'!$B$2:$AE$21,$A88),0)","v":0},0,0]
[16,"No.30",{"$f":"ROUND(HLOOKUP($E$65,'Contractors Gradations'!$B$2:$AE$21,$A89),0)","v":0},{"$f":"ROUND(HLOOKUP($E$66,'Contractors Gradations'!$B$2:$AE$21,$A89),0)","v":0},{"$f":"ROUND(HLOOKUP($E$67,'Contractors Gradations'!$B$2:$AE$21,$A89),0)","v":0},{"$f":"ROUND(HLOOKUP($E$68,'Contractors Gradations'!$B$2:$AE$21,$A89),0)","v":0},{"$f":"ROUND(HLOOKUP($E$69,'Contractors Gradations'!$B$2:$AE$21,$A89),0)","v":0},{"$f":"ROUND(HLOOKUP($E$70,'Contractors Gradations'!$B$2:$AE$21,$A89),0)","v":0},{"$f":"ROUND(HLOOKUP($E$71,'Contractors Gradations'!$B$2:$AE$21,$A89),0)","v":0},0,0]
[17,"No.50",{"$f":"ROUND(HLOOKUP($E$65,'Contractors Gradations'!$B$2:$AE$21,$A90),0)","v":0},{"$f":"ROUND(HLOOKUP($E$66,'Contractors Gradations'!$B$2:$AE$21,$A90),0)","v":0},{"$f":"ROUND(HLOOKUP($E$67,'Contractors Gradations'!$B$2:$AE$21,$A90),0)","v":0},{"$f":"ROUND(HLOOKUP($E$68,'Contractors Gradations'!$B$2:$AE$21,$A90),0)","v":0},{"$f":"ROUND(HLOOKUP($E$69,'Contractors Gradations'!$B$2:$AE$21,$A90),0)","v":0},{"$f":"ROUND(HLOOKUP($E$70,'Contractors Gradations'!$B$2:$AE$21,$A90),0)","v":0},{"$f":"ROUND(HLOOKUP($E$71,'Contractors Gradations'!$B$2:$AE$21,$A90),0)","v":0},0,0]
[18,"No.100",{"$f":"ROUND(HLOOKUP($E$65,'Contractors Gradations'!$B$2:$AE$21,$A91),0)","v":0},{"$f":"ROUND(HLOOKUP($E$66,'Contractors Gradations'!$B$2:$AE$21,$A91),0)","v":0},{"$f":"ROUND(HLOOKUP($E$67,'Contractors Gradations'!$B$2:$AE$21,$A91),0)","v":0},{"$f":"ROUND(HLOOKUP($E$68,'Contractors Gradations'!$B$2:$AE$21,$A91),0)","v":0},{"$f":"ROUND(HLOOKUP($E$69,'Contractors Gradations'!$B$2:$AE$21,$A91),0)","v":0},{"$f":"ROUND(HLOOKUP($E$70,'Contractors Gradations'!$B$2:$AE$21,$A91),0)","v":0},{"$f":"ROUND(HLOOKUP($E$71,'Contractors Gradations'!$B$2:$AE$21,$A91),0)","v":0},{"$f":"ROUND((C91*$C$77+D91*$D$77+E91*$E$77+F91*$F$77+G91*$G$77+H91*$H$77+I91*$I$77)/100,0)","v":0},0]
[19,"No.200",{"$f":"IF(HLOOKUP($E$65,'Contractors Gradations'!$B$2:$AE$21,$A92)<10,ROUND(HLOOKUP($E$65,'Contractors Gradations'!$B$2:$AE$21,$A92),1),ROUND(HLOOKUP($E$65,'Contractors Gradations'!$B$2:$AE$21,$A92),0))","v":0},{"$f":"IF(HLOOKUP($E$66,'Contractors Gradations'!$B$2:$AE$21,$A92)<10,ROUND(HLOOKUP($E$66,'Contractors Gradations'!$B$2:$AE$21,$A92),1),ROUND(HLOOKUP($E$66,'Contractors Gradations'!$B$2:$AE$21,$A92),0))","v":0},{"$f":"IF(HLOOKUP($E$67,'Contractors Gradations'!$B$2:$AE$21,$A92)<10,ROUND(HLOOKUP($E$67,'Contractors Gradations'!$B$2:$AE$21,$A92),1),ROUND(HLOOKUP($E$67,'Contractors Gradations'!$B$2:$AE$21,$A92),0))","v":0},{"$f":"IF(HLOOKUP($E$68,'Contractors Gradations'!$B$2:$AE$21,$A92)<10,ROUND(HLOOKUP($E$68,'Contractors Gradations'!$B$2:$AE$21,$A92),1),ROUND(HLOOKUP($E$68,'Contractors Gradations'!$B$2:$AE$21,$A92),0))","v":0},{"$f":"IF(HLOOKUP($E$69,'Contractors Gradations'!$B$2:$AE$21,$A92)<10,ROUND(HLOOKUP($E$69,'Contractors Gradations'!$B$2:$AE$21,$A92),1),ROUND(HLOOKUP($E$69,'Contractors Gradations'!$B$2:$AE$21,$A92),0))","v":0},{"$f":"IF(HLOOKUP($E$70,'Contractors Gradations'!$B$2:$AE$21,$A92)<10,ROUND(HLOOKUP($E$70,'Contractors Gradations'!$B$2:$AE$21,$A92),1),ROUND(HLOOKUP($E$70,'Contractors Gradations'!$B$2:$AE$21,$A92),0))","v":0},{"$f":"IF(HLOOKUP($E$71,'Contractors Gradations'!$B$2:$AE$21,$A92)<10,ROUND(HLOOKUP($E$71,'Contractors Gradations'!$B$2:$AE$21,$A92),1),ROUND(HLOOKUP($E$71,'Contractors Gradations'!$B$2:$AE$21,$A92),0))","v":0},{"$f":"ROUND((C92*$C$77+D92*$D$77+E92*$E$77+F92*$F$77+G92*$G$77+H92*$H$77+I92*$I$77)/100,1)","v":0},0]
[20,"RAP AC",null,null,null,null,null,{"$f":"HLOOKUP($E$70,'Contractors Gradations'!$B$2:$AE$21,$A93)","v":0},{"$f":"HLOOKUP($E$71,'Contractors Gradations'!$B$2:$AE$21,$A93)","v":0}]
[]
[]
[null,"Anti-Strip Dosage Rates"]
[1," ",1,{"$f":"IF('ASA Suppliers'!C1=16,0.0003,VLOOKUP($C$97,A97:B99,2))","v":" "}]
[2,3.0000000000000001E-3]
[3,5.0000000000000001E-3]
[]
["HMA Producer"]
[1,{"$f":"VLOOKUP(A102,'HMA Producers'!A2:F170,6)","v":0},{"$f":"VLOOKUP(A102,'HMA Producers'!A2:G170,7)","v":0}]
[]
[null,"Roadway Surface"]
[1,null,1,{"$f":"VLOOKUP($C$105,A105:B107,2)","v":0}]
[2,"Yes"]
[3,"No"]
[]
["Liquid Asphalt Producer"]
[1,{"$f":"VLOOKUP(A110,Terminals!A3:F32,6)","v":0},{"$f":"VLOOKUP(A110,Terminals!A3:G31,7)","v":0}]
[]
[]
[]
[]
[]
[]
[]
["Info for Drop Box"]
[null,{"$f":"'Aggregate Suppliers'!G$20","v":"0, 0 from 0"}]
[null,{"$f":"'Aggregate Suppliers'!H$20","v":"0, 0 from 0"}]
[null,{"$f":"'Aggregate Suppliers'!I$20","v":"0, 0 from 0"}]
[null,{"$f":"'Aggregate Suppliers'!J$20","v":"0, 0 from 0"}]
[null,{"$f":"'Aggregate Suppliers'!K$20","v":"0, 0 from 0"}]
[null,{"$f":"'Aggregate Suppliers'!L$20","v":"0, 0 from 0"}]
[null,{"$f":"'Aggregate Suppliers'!M$20","v":"0, 0 from 0"}]
[null,{"$f":"'Aggregate Suppliers'!N$20","v":"0, 0 from 0"}]
[null,{"$f":"'Aggregate Suppliers'!O$20","v":"0, 0 from 0"}]
[null,{"$f":"'Aggregate Suppliers'!P$20","v":"0, 0 from 0"}]
[null,{"$f":"'Aggregate Suppliers'!Q$20","v":"0, 0 from 0"}]
[null,{"$f":"'Aggregate Suppliers'!R$20","v":"0, 0 from 0"}]
[null,{"$f":"'Aggregate Suppliers'!S$20","v":"0, 0 from 0"}]
[null,{"$f":"'Aggregate Suppliers'!T$20","v":"0, 0 from 0"}]
[null,{"$f":"'Aggregate Suppliers'!U$20","v":"0, 0 from 0"}]
[null,{"$f":"'Aggregate Suppliers'!V$20","v":"0, 0 from 0"}]
[null,{"$f":"'Aggregate Suppliers'!W$20","v":"0, 0 from 0"}]
[null,{"$f":"'Aggregate Suppliers'!X$20","v":"0, 0 from 0"}]
[null,{"$f":"'Aggregate Suppliers'!Y$20","v":"0, 0 from 0"}]
[null,{"$f":"'Aggregate Suppliers'!Z$20","v":"0, 0 from 0"}]
[null,{"$f":"'Aggregate Suppliers'!AA$20","v":"0, 0 from 0"}]
[null,{"$f":"'Aggregate Suppliers'!AB$20","v":"0, 0 from 0"}]
[null,{"$f":"'Aggregate Suppliers'!AC$20","v":"0, 0 from 0"}]
[null,{"$f":"'Aggregate Suppliers'!AD$20","v":"0, 0 from 0"}]
[null,{"$f":"'Aggregate Suppliers'!AE$20","v":"0, 0 from 0"}]
[null,{"$f":"'Aggregate Suppliers'!AF$20","v":"0, 0 from 0"}]
[null,{"$f":"'Aggregate Suppliers'!AG$20","v":"0, 0 from 0"}]
[null,{"$f":"'Aggregate Suppliers'!AH$20","v":"0, 0 from 0"}]
[null,{"$f":"'Aggregate Suppliers'!AI$20","v":"0, 0 from 0"}]
[]
[]
[]
[]
[]
[]
[]
[]
[null,"Drop Box on Contractor Gradation Sheet","Cell Links for Drop Boxes on Contractor Gradation Sheet"]
[1,null,9]
[2,"#1",11]
[3,"#2",27]
[4,"#24",34]
[5,"#3",9]
[6,"#357",11]
[7,"#4",16]
[8,"#467",27]
[9,"#5",1]
[10,"#56",1]
[11,"#57",1]
[12,"#6",1]
[13,"#67",1]
[14,"#68",1]
[15,"#7",1]
[16,"#78",1]
[17,"D Rock (Limestone)",1]
[18,"BM-2 Rock (Limestone)",1]
[19,"D Rock (Gravel)",1]
[20,"BM-2 Rock (Gravel)",1]
[21,"D Rock (Granite)",1]
[22,"BM-2 Rock (Gravel)",1]
[23,"#8",1]
[24,"#89",1]
[25,"#9",1]
[26,"#10 (Hard)",1]
[27,"#10 (Soft)",1]
[28,"Manufactured Sand",1]
[29,"Natural Sand",1]
[30,"Slag"]
[31,"Hydrated Lime"]
[32,"AG Lime"]
[33,"Baghouse Fines"]
[34,"RAP"]
[]
[null,"AC Grade","Temp Range"]
[1," "]
[2]
[3,"PG 64-22/67-22","270ºF ≤ T ≤ 310ºF"]
[4,"PG 70-22","290ºF ≤ T ≤ 330ºF"]
[5,"PG 70-22 Latex","290ºF ≤ T ≤ 330ºF"]
[6,"PG 76-22","290ºF ≤ T ≤ 330ºF"]
[7,"PG 82-22","290ºF ≤ T ≤ 330ºF"]
[]
[false,false]
[false,false]
[]
[true,false,"L-20",{"$f":"IF(A201=TRUE,,1)","v":1},{"$f":"IF(B201=TRUE,,1)","v":1}]
[true,false,"L-13, L-20",{"$f":"IF(A202=TRUE,,1)","v":1},{"$f":"IF(B202=TRUE,,1)","v":1}]
[]
[]
[]
[]
[]
[]
[]
[]
[]
[{"$f":"100*C27+C54","v":101},"Description","Material Code",{"$f":"VLOOKUP(A215,A216:C307,3)","v":{"$error":"#N/A"}},{"$f":"VLOOKUP(A215,A216:C307,2)","v":{"$error":"#N/A"}}]
[202,"307-A Bit PM Base, PG 64-22/67-22","307.03.001     "]
[204,"307-A Bit PM Base, PG 70-22","307.03.003     "]
[205,"307-A Bit PM Base, PG 76-22","307.03.004     "]
[206,"307-A Bit PM Base, PG 82-22","307.03.005     "]
[302,"307-AS Bit PM Base, PG 64-22/67-22","307.03.006     "]
[304,"307-AS Bit PM Base, PG 70-22","307.03.008     "]
[305,"307-AS Bit PM Base, PG 76-22","307.03.009     "]
[306,"307-AS Bit PM Base, PG 82-22","307.03.010     "]
[402,"307-ACRL Bit PM Base, PG 64-22/67-22","307.03.011     "]
[404,"307-ACRL Bit PM Base, PG 70-22","307.03.013     "]
[405,"307-ACRL Bit PM Base, PG 76-22","307.03.014     "]
[406,"307-ACRL Bit PM Base, PG 82-22","307.03.015     "]
[502,"307-B Bit PM Base, PG 64-22/67-22","307.03.016     "]
[504,"307-B Bit PM Base, PG 70-22","307.03.018     "]
[505,"307-B Bit PM Base, PG 76-22","307.03.019     "]
[506,"307-B Bit PM Base, PG 82-22","307.03.020     "]
[602,"307-BM Bit PM Base, PG 64-22/67-22","307.03.021     "]
[604,"307-BM Bit PM Base, PG 70-22","307.03.023     "]
[605,"307-BM Bit PM Base, PG 76-22","307.03.024     "]
[606,"307-BM Bit PM Base, PG 82-22","307.03.025     "]
[702,"307-BM2 Bit PM Base, PG 64-22/67-22","307.03.026     "]
[704,"307-BM2 Bit PM Base, PG 70-22","307.03.028     "]
[705,"307-BM2 Bit PM Base, PG 76-22","307.03.029     "]
[706,"307-BM2 Bit PM Base, PG 82-22","307.03.030     "]
[802,"307-C Bit PM Base, PG 64-22/67-22","307.03.031     "]
[804,"307-C Bit PM Base, PG 70-22","307.03.033     "]
[805,"307-C Bit PM Base, PG 76-22","307.03.034     "]
[806,"307-C Bit PM Base, PG 82-22","307.03.035     "]
[902,"307-CW Bit PM, PG 64-22/67-22","307.03.036     "]
[904,"307-CW Bit PM, PG 70-22","307.03.038     "]
[905,"307-CW Bit PM, PG 76-22","307.03.039     "]
[906,"307-CW Bit PM, PG 82-22","307.03.040     "]
[1002,"307-CS Bit PM, PG 64-22/67-22","307.03.041     "]
[1004,"307-CS Bit PM, PG 70-22","307.03.043     "]
[1005,"307-CS Bit PM, PG 76-22","307.03.044     "]
[1006,"307-CS Bit PM, PG 82-22","307.03.045     "]
[1103,"307-CAM Bit PM, PG 64-22/67-22","N/A"]
[1104,"307-CAM Bit PM, PG 70-22","307.02.009"]
[1105,"307-CAM Bit PM, PG 76-22","307.02.009"]
[1106,"307-CAM Bit PM, PG 82-22","307.02.009"]
[1202,"313 Asph Treat Perm Base Grade PG 64 22/67-22","313.03.001     "]
[1204,"313 Asph Treat Perm Base Grade PG 70 22","313.03.003     "]
[1205,"313 Asph Treat Perm Base Grade PG 76 22","313.03.004     "]
[1302,"411-D Bit PM, PG 64-22/67-22","411.03.001     "]
[1304,"411-D Bit PM, PG 70-22","411.03.003     "]
[1305,"411-D Bit PM, PG 76-22","411.03.004     "]
[1306,"411-D Bit PM, PG 82-22","411.03.005     "]
[1402,"411-E Bit PM, PG 64-22/67-22","411.03.006     "]
[1404,"411-E Bit PM, PG 70-22","411.03.008     "]
[1405,"411-E Bit PM, PG 76-22","411.03.009     "]
[1406,"411-E Bit PM, PG 82-22","411.03.010     "]
[1502,"411-E (shoulders) Bit PM, PG 64-22/67-22","411.03.011     "]
[1504,"411-E (shoulders) Bit PM, PG 70-22","411.03.013     "]
[1505,"411-E (shoulders) Bit PM, PG 76-22","411.03.014     "]
[1506,"411-E (shoulders) Bit PM, PG 82-22","411.03.015     "]
[1602,"SP411-TL Bit PM, PG 64-22/67-22","411.03.016     "]
[1604,"SP411-TL Bit PM, PG 70-22","411.03.018     "]
[1605,"SP411-TL Bit PM, PG 76-22","411.03.019     "]
[1606,"SP411-TL Bit PM, PG 82-22","411.03.020     "]
[1702,"SP411-TLD Bit PM, PG 64-22/67-22","411.03.021     "]
[1704,"SP411-TLD Bit PM, PG 70-22","411.03.023     "]
[1705,"SP411-TLD Bit PM, PG 76-22","411.03.024     "]
[1706,"SP411-TLD Bit PM, PG 82-22","411.03.025     "]
[1802,"SP411-OGFC Bit PM, PG 64-22/67-22","411.03.026     "]
[1804,"SP411-OGFC Bit PM, PG 70-22","411.03.028     "]
[1805,"SP411-OGFC Bit PM, PG 76-22","411.03.029     "]
[1806,"SP411-OGFC Bit PM, PG 82-22","411.03.030     "]
[1902,"SP411-OGFC Bit PM (shoulders), PG 64-22/67-22","411.03.026SHLD"]
[1904,"SP411-OGFC Bit PM (shoulders), PG 70-22","411.03.028SHLD"]
[1905,"SP411-OGFC Bit PM (shoulders), PG 76-22","411.03.029SHLD"]
[2002,"307-CM Bit PM, PG 64-22/67-22","307.03.046"]
[2005,"307-CM Bit PM, PG 76-22","307.03.047"]
[2102,"SP411-NC (Type A) Bit PM, PG 64-22/67-22","411.03.031     "]
[2104,"SP411-NC (Type A) Bit PM, PG 70-22","411.03.033     "]
[2105,"SP411-NC (Type A) Bit PM, PG 76-22","411.03.034     "]
[2106,"SP411-NC (Type A) Bit PM, PG 82-22","411.03.035     "]
[2202,"SP411-NC (Type B) Bit PM, PG 64-22/67-22","411.03.036     "]
[2204,"SP411-NC (Type B) Bit PM, PG 70-22","411.03.038     "]
[2205,"SP411-NC (Type B) Bit PM, PG 76-22","411.03.039     "]
[2206,"SP411-NC (Type B) Bit PM, PG 82-22","411.03.040     "]
[2302,"SP411-NC (Type C) Bit PM, PG 64-22/67-22","411.03.041     "]
[2304,"SP411-NC (Type C) Bit PM, PG 70-22","411.03.043     "]
[2305,"SP411-NC (Type C) Bit PM, PG 76-22","411.03.044     "]
[2306,"SP411-NC (Type C) Bit PM, PG 82-22","411.03.045     "]
[2402,"SP411-SMA Bit PM, PG 64-22/67-22","411.03.046     "]
[2404,"SP411-SMA Bit PM, PG 70-22","411.03.048     "]
[2405,"SP411-SMA Bit PM, PG 76-22","411.03.049     "]
[2406,"SP411-SMA Bit PM, PG 82-22","411.03.050     "]
[2502,"411-TLE Bit PM, PG 64-22/67-22","411.03.051"]
[2504,"411-TLE Bit PM, PG 70-22","411.03.053"]
[2505,"411-TLE Bit PM, PG 76-22","411.03.054"]
[2602,"411-TLE (shoulders) Bit PM, PG 64-22/67-22","411.03.056"]
[null,"Asphalt Absorption"]
[null,"Gse",{"$f":"'Rice SG'!H39","v":""}]
[null,"Gsb",{"$f":"IF('Agg. S. G.'!N6=1,'Agg. S. G.'!E43,'Agg. S. G.'!N31)","v":""}]
[null,"Gb",{"$f":"'Rice SG'!H33","v":1.03}]
[null,"Pba",{"$f":"100*((C309-C310)/(C309*C310))*C311","v":{"$error":"#VALUE!"}}]
[null,"Vbe"]
[]
[]
[null,"Design Dates"]
[null,{"$f":"TODAY()","v":"2026-06-05"},"Today"]
[null,{"$f":"DATE(YEAR(B317),12,31)","v":"2026-12-31"},"Expiration"]
[]
[]
[null,"Aggregate Specific Gravity"]
[null,{"$f":"IF('Agg. S. G.'!N6=1,'Agg. S. G.'!E43,'Agg. S. G.'!N31)","v":""},"Gsb"]
[null,{"$f":"IF('Agg. S. G.'!N6=1,'Agg. S. G.'!E45,'Agg. S. G.'!N33)","v":""},"Gsa"]
[null,{"$f":"IF('Agg. S. G.'!N6=1,'Agg. S. G.'!E47,'Agg. S. G.'!N35)","v":""},"Abs"]
[null,{"$f":"IF('Agg. S. G.'!N6=1,\"Blended Sample\",\"Stockpile Method\")","v":"Blended Sample"}]
[]
[null,"OGFC Fiber",1]
[1]
[2,3.0000000000000001E-3]
[3,4.0000000000000001E-3]

{"sheet":"SiteManager Mapping","index":2,"n_rows":370,"n_cols":5,"rows_kept":370,"cut":false,"hidden":true,"merged":[]}
["Excel Worksheet","Tab","Field Description","Location"]
["JMF1","Description","Mix ID",{"$f":"('JMF1'!H12)","v":0}]
["Stuff","Description","Material Code",{"$f":"(Stuff!D215)","v":{"$error":"#N/A"}}]
["Stuff","Description","Material Desc",{"$f":"Stuff!E215","v":{"$error":"#N/A"}}]
["Stuff","Description","Producer Supplier Code",{"$f":"Stuff!C102","v":0}]
["Stuff","Description","Producer Supplier Desc",{"$f":"Stuff!B102","v":0}]
["JMF1","Description","Designer Name",{"$f":"IF(ISBLANK('JMF1'!C60),\"\",'JMF1'!C60)","v":""}]
["JMF1","Properties","Asphalt Content %",{"$f":"('JMF1'!G23)","v":0}]
["Mix Des. Data","Properties","Flow",{"$f":"'Mix Des. Data'!P37","v":""}]
[null,"Properties","Flow units"]
["Mix Des. Data","Properties","VMA %",{"$f":"'Mix Des. Data'!K34","v":""}]
["Mix Des. Data","Properties","VFA %",{"$f":"'Mix Des. Data'!M34","v":""}]
[null,"Properties","Brick height"]
[null,"Properties","Brick height units"]
[null,"Properties","Recycling Agent %"]
["Stuff","Properties","Asphalt Abs %",{"$f":"Stuff!C312","v":{"$error":"#VALUE!"}}]
["JMF1","Properties","Max Spcfc Gravity",{"$f":"'JMF1'!C32","v":""}]
[null,"Properties","Virtual Spcfc Gravity"]
["Mix Des. Data","Properties","Density Unit Weight",{"$f":"'Mix Des. Data'!N34","v":""}]
[null,"Properties","Density Unit Weight Units"]
["JMF1","Properties","Mixing Temperature",{"$f":"'JMF1'!D36","v":0}]
[null,"Properties","Mixing Temperature Units"]
["JMF1","Properties","Compaction Temp",{"$f":"'JMF1'!D37","v":0}]
[null,"Properties","Compaction Temp Units"]
["Mix Des. Data","Properties","Stability",{"$f":"'Mix Des. Data'!O37","v":""}]
[null,"Properties","Stability Units"]
["Mix Des. Data","Properties","Air Void %",{"$f":"'Mix Des. Data'!J34","v":""}]
[null,"Properties","Film Thickness"]
["JMF1","Properties","Filler/Bitumen Ratio",{"$f":"'JMF1'!I27","v":""}]
["JMF1","Properties","Anti Strip Agent%",{"$f":"'JMF1'!I25*100","v":{"$error":"#VALUE!"}}]
[null,"Properties","Weighted Bulk Specific Gravity"]
["Mix Des. Data","Properties","Bulk Specific Gravity",{"$f":"'Mix Des. Data'!H37","v":""}]
[null,"Properties","Effective Asphalt"]
["Mix Des. Data","Properties","No of Blows",{"$f":"'Mix Des. Data'!P5","v":75}]
["Stuff","Materials (Material 1)","Material Code",{"$f":"Stuff!L65","v":0}]
["Stuff","Materials (Material 1)","Material Full Name",{"$f":"Stuff!I65","v":0}]
["Stuff","Materials (Material 1)","Producer Supplier Code",{"$f":"Stuff!R65","v":0}]
["Stuff","Materials (Material 1)","Producer Supplier Name",{"$f":"Stuff!M65","v":0}]
["JMF1","Materials (Material 1)","Blend Percent",{"$f":"'JMF1'!B42","v":0}]
["Agg. S. G.","Materials (Material 1)","Specific Gravity (Apparent)",{"$f":"'Agg. S. G.'!L24","v":0}]
["Agg. S. G.","Materials (Material 1)","Specific Gravity (Bulk)",{"$f":"'Agg. S. G.'!L22","v":0}]
["Stuff","Materials (Material 2)","Material Code",{"$f":"Stuff!L66","v":0}]
["Stuff","Materials (Material 2)","Material Full Name",{"$f":"Stuff!I66","v":0}]
["Stuff","Materials (Material 2)","Producer Supplier Code",{"$f":"Stuff!R66","v":0}]
["Stuff","Materials (Material 2)","Producer Supplier Name",{"$f":"Stuff!M66","v":0}]
["JMF1","Materials (Material 2)","Blend Percent",{"$f":"'JMF1'!C42","v":0}]
["Agg. S. G.","Materials (Material 2)","Specific Gravity (Apparent)",{"$f":"'Agg. S. G.'!M24","v":0}]
["Agg. S. G.","Materials (Material 2)","Specific Gravity (Bulk)",{"$f":"'Agg. S. G.'!M22","v":0}]
["Stuff","Materials (Material 3)","Material Code",{"$f":"Stuff!L67","v":0}]
["Stuff","Materials (Material 3)","Material Full Name",{"$f":"Stuff!I67","v":0}]
["Stuff","Materials (Material 3)","Producer Supplier Code",{"$f":"Stuff!R67","v":0}]
["Stuff","Materials (Material 3)","Producer Supplier Name",{"$f":"Stuff!M67","v":0}]
["JMF1","Materials (Material 3)","Blend Percent",{"$f":"'JMF1'!D42","v":0}]
["Agg. S. G.","Materials (Material 3)","Specific Gravity (Apparent)",{"$f":"'Agg. S. G.'!N24","v":0}]
["Agg. S. G.","Materials (Material 3)","Specific Gravity (Bulk)",{"$f":"'Agg. S. G.'!N22","v":0}]
["Stuff","Materials (Material 4)","Material Code",{"$f":"Stuff!L68","v":0}]
["Stuff","Materials (Material 4)","Material Full Name",{"$f":"Stuff!I68","v":0}]
["Stuff","Materials (Material 4)","Producer Supplier Code",{"$f":"Stuff!R68","v":0}]
["Stuff","Materials (Material 4)","Producer Supplier Name",{"$f":"Stuff!M68","v":0}]
["JMF1","Materials (Material 4)","Blend Percent",{"$f":"'JMF1'!E42","v":0}]
["Agg. S. G.","Materials (Material 4)","Specific Gravity (Apparent)",{"$f":"'Agg. S. G.'!O24","v":0}]
["Agg. S. G.","Materials (Material 4)","Specific Gravity (Bulk)",{"$f":"'Agg. S. G.'!O22","v":0}]
["Stuff","Materials (Material 5)","Material Code",{"$f":"Stuff!L69","v":0}]
["Stuff","Materials (Material 5)","Material Full Name",{"$f":"Stuff!I69","v":0}]
["Stuff","Materials (Material 5)","Producer Supplier Code",{"$f":"Stuff!R69","v":0}]
["Stuff","Materials (Material 5)","Producer Supplier Name",{"$f":"Stuff!M69","v":0}]
["JMF1","Materials (Material 5)","Blend Percent",{"$f":"'JMF1'!F42","v":0}]
["Agg. S. G.","Materials (Material 5)","Specific Gravity (Apparent)",{"$f":"'Agg. S. G.'!P24","v":0}]
["Agg. S. G.","Materials (Material 5)","Specific Gravity (Bulk)",{"$f":"'Agg. S. G.'!P22","v":0}]
["Stuff","Materials (Material 6)","Material Code",{"$f":"Stuff!L70","v":0}]
["Stuff","Materials (Material 6)","Material Full Name",{"$f":"Stuff!I70","v":0}]
["Stuff","Materials (Material 6)","Producer Supplier Code",{"$f":"Stuff!R70","v":0}]
["Stuff","Materials (Material 6)","Producer Supplier Name",{"$f":"Stuff!M70","v":0}]
["JMF1","Materials (Material 6)","Blend Percent",{"$f":"'JMF1'!G42","v":0}]
["Agg. S. G.","Materials (Material 6)","Specific Gravity (Apparent)",{"$f":"'Agg. S. G.'!Q24","v":0}]
["Agg. S. G.","Materials (Material 6)","Specific Gravity (Bulk)",{"$f":"'Agg. S. G.'!Q22","v":0}]
["Stuff","Materials (Material 7)","Material Code",{"$f":"Stuff!L71","v":0}]
["Stuff","Materials (Material 7)","Material Full Name",{"$f":"Stuff!I71","v":0}]
["Stuff","Materials (Material 7)","Producer Supplier Code",{"$f":"Stuff!R71","v":0}]
["Stuff","Materials (Material 7)","Producer Supplier Name",{"$f":"Stuff!M71","v":0}]
["JMF1","Materials (Material 7)","Blend Percent",{"$f":"'JMF1'!H42","v":0}]
["Agg. S. G.","Materials (Material 7)","Specific Gravity (Apparent)",{"$f":"'Agg. S. G.'!R24","v":0}]
["Agg. S. G.","Materials (Material 7)","Specific Gravity (Bulk)",{"$f":"'Agg. S. G.'!R22","v":0}]
["Stuff","Materials (Material 8)","Material Code",{"$f":"Stuff!D54","v":0}]
["Stuff","Materials (Material 8)","Material Full Name",{"$f":"Stuff!E54","v":0}]
["Stuff","Materials (Material 8)","Producer Supplier Code",{"$f":"Stuff!C110","v":0}]
["Stuff","Materials (Material 8)","Producer Supplier Name",{"$f":"Stuff!B110","v":0}]
["JMF1","Materials (Material 8)","Blend Percent",{"$f":"'JMF1'!I22","v":0}]
["Rice SG","Materials (Material 8)","Specific Gravity (Apparent)",{"$f":"'Rice SG'!H33","v":1.03}]
["JMF1","Gradations Tab","Sieve Value - Sieve Size 2\"",{"$f":"'JMF1'!I43","v":""}]
["JMF1","Gradations Tab","Sieve Value - Sieve Size 1.5\"",{"$f":"'JMF1'!I44","v":""}]
["JMF1","Gradations Tab","Sieve Value - Sieve Size 1.25\"",{"$f":"'JMF1'!I45","v":""}]
["JMF1","Gradations Tab","Sieve Value - Sieve Size 1\"",{"$f":"'JMF1'!I46","v":""}]
["JMF1","Gradations Tab","Sieve Value - Sieve Size 3/4\"",{"$f":"'JMF1'!I47","v":""}]
["JMF1","Gradations Tab","Sieve Value - Sieve Size 5/8\"",{"$f":"'JMF1'!I48","v":""}]
["JMF1","Gradations Tab","Sieve Value - Sieve Size 1/2\"",{"$f":"'JMF1'!I49","v":""}]
["JMF1","Gradations Tab","Sieve Value - Sieve Size 3/8\"",{"$f":"'JMF1'!I50","v":""}]
["JMF1","Gradations Tab","Sieve Value - Sieve Size No.4",{"$f":"'JMF1'!I51","v":""}]
["JMF1","Gradations Tab","Sieve Value - Sieve Size No.8",{"$f":"'JMF1'!I52","v":""}]
["JMF1","Gradations Tab","Sieve Value - Sieve Size No.16",{"$f":"'JMF1'!I53","v":""}]
["JMF1","Gradations Tab","Sieve Value - Sieve Size No.30",{"$f":"'JMF1'!I54","v":""}]
["JMF1","Gradations Tab","Sieve Value - Sieve Size No.50",{"$f":"'JMF1'!I55","v":""}]
["JMF1","Gradations Tab","Sieve Value - Sieve Size No.100",{"$f":"'JMF1'!I56","v":""}]
["JMF1","Gradations Tab","Sieve Value - Sieve Size No.200",{"$f":"'JMF1'!I57","v":""}]
[null,"Gradations Tab","Min Range - Sieve Size 2\""]
[null,"Gradations Tab","Min Range - Sieve Size 1.5\""]
[null,"Gradations Tab","Min Range - Sieve Size 1.25\""]
[null,"Gradations Tab","Min Range - Sieve Size 1\""]
[null,"Gradations Tab","Min Range - Sieve Size 3/4\""]
[null,"Gradations Tab","Min Range - Sieve Size 5/8\""]
[null,"Gradations Tab","Min Range - Sieve Size 1/2\""]
[null,"Gradations Tab","Min Range - Sieve Size 3/8\""]
[null,"Gradations Tab","Min Range - Sieve Size No.4"]
[null,"Gradations Tab","Min Range - Sieve Size No.8"]
[null,"Gradations Tab","Min Range - Sieve Size No.16"]
[null,"Gradations Tab","Min Range - Sieve Size No.30"]
[null,"Gradations Tab","Min Range - Sieve Size No.50"]
[null,"Gradations Tab","Min Range - Sieve Size No.100"]
[null,"Gradations Tab","Min Range - Sieve Size No.200"]
[null,"Gradations Tab","Max Range - Sieve Size 2\""]
[null,"Gradations Tab","Max Range - Sieve Size 1.5\""]
[null,"Gradations Tab","Max Range - Sieve Size 1.25\""]
[null,"Gradations Tab","Max Range - Sieve Size 1\""]
[null,"Gradations Tab","Max Range - Sieve Size 3/4\""]
[null,"Gradations Tab","Max Range - Sieve Size 5/8\""]
[null,"Gradations Tab","Max Range - Sieve Size 1/2\""]
[null,"Gradations Tab","Max Range - Sieve Size 3/8\""]
[null,"Gradations Tab","Max Range - Sieve Size No.4"]
[null,"Gradations Tab","Max Range - Sieve Size No.8"]
[null,"Gradations Tab","Max Range - Sieve Size No.16"]
[null,"Gradations Tab","Max Range - Sieve Size No.30"]
[null,"Gradations Tab","Max Range - Sieve Size No.50"]
[null,"Gradations Tab","Max Range - Sieve Size No.100"]
[null,"Gradations Tab","Max Range - Sieve Size No.200"]
["Glassy","CUSTOM RECORD","Glassy Particles",{"$f":"Glassy!E25","v":"n/a"}]
["Agg. S. G.","CUSTOM RECORD","Fine Agg T84 Gsb",{"$f":"'Agg. S. G.'!F17","v":""}]
["Agg. S. G.","CUSTOM RECORD","Fine Agg T84 Gsa",{"$f":"'Agg. S. G.'!F20","v":""}]
["Agg. S. G.","CUSTOM RECORD","Course Agg T85 Gsb",{"$f":"'Agg. S. G.'!D30","v":""}]
["Agg. S. G.","CUSTOM RECORD","Course Agg T85 Gsa",{"$f":"'Agg. S. G.'!D33","v":""}]
["Stuff","CUSTOM RECORD","Gsb",{"$f":"Stuff!B322","v":""}]
["Stuff","CUSTOM RECORD","Gsa",{"$f":"Stuff!B323","v":""}]
["Stuff","CUSTOM RECORD","Water Absorption",{"$f":"Stuff!B324","v":""}]
["Stuff","CUSTOM RECORD","Gsb Method",{"$f":"Stuff!B325","v":"Blended Sample"}]
["Fract. Face","CUSTOM RECORD","Fract. Face",{"$f":"'Fract. Face'!D23","v":"n/a"}]
["JMF1","CUSTOM RECORD","LOI",{"$f":"'JMF1'!C33","v":""}]
["JMF1","CUSTOM RECORD","NCAT CF",{"$f":"'JMF1'!I33","v":""}]
["Rice SG","CUSTOM RECORD","Effective Gravity, Gse",{"$f":"'Rice SG'!H39","v":""}]
["JMF1","CUSTOM RECORD","rap Gmm",{"$f":"'JMF1'!D30","v":0}]
["Mix Des. Data","CUSTOM RECORD","Marshall Blows",{"$f":"'Mix Des. Data'!P5","v":75}]
["Mix Des. Data","CUSTOM RECORD","Des AC1",{"$f":"'Mix Des. Data'!B9","v":0}]
["Mix Des. Data","CUSTOM RECORD","Des AC2",{"$f":"'Mix Des. Data'!B14","v":0}]
["Mix Des. Data","CUSTOM RECORD","Des AC3",{"$f":"'Mix Des. Data'!B19","v":0}]
["Mix Des. Data","CUSTOM RECORD","Des AC4",{"$f":"'Mix Des. Data'!B24","v":0}]
["Mix Des. Data","CUSTOM RECORD","Des AC5",{"$f":"'Mix Des. Data'!B29","v":0}]
["Mix Des. Data","CUSTOM RECORD","Des OPT",{"$f":"'Mix Des. Data'!B34","v":0}]
["Mix Des. Data","CUSTOM RECORD","Des Gmb 1",{"$f":"'Mix Des. Data'!H12","v":""}]
["Mix Des. Data","CUSTOM RECORD","Des Gmb 2",{"$f":"'Mix Des. Data'!H17","v":""}]
["Mix Des. Data","CUSTOM RECORD","Des Gmb 3",{"$f":"'Mix Des. Data'!H22","v":""}]
["Mix Des. Data","CUSTOM RECORD","Des Gmb 4",{"$f":"'Mix Des. Data'!H27","v":""}]
["Mix Des. Data","CUSTOM RECORD","Des Gmb 5",{"$f":"'Mix Des. Data'!H32","v":""}]
["Mix Des. Data","CUSTOM RECORD","Des Gmb OPT",{"$f":"'Mix Des. Data'!H37","v":""}]
["Mix Des. Data","CUSTOM RECORD","VTM1",{"$f":"'Mix Des. Data'!J9","v":""}]
["Mix Des. Data","CUSTOM RECORD","VTM2",{"$f":"'Mix Des. Data'!J14","v":""}]
["Mix Des. Data","CUSTOM RECORD","VTM3",{"$f":"'Mix Des. Data'!J19","v":""}]
["Mix Des. Data","CUSTOM RECORD","VTM4",{"$f":"'Mix Des. Data'!J24","v":""}]
["Mix Des. Data","CUSTOM RECORD","VTM5",{"$f":"'Mix Des. Data'!J29","v":""}]
["Mix Des. Data","CUSTOM RECORD","VTM OPT",{"$f":"'Mix Des. Data'!J34","v":""}]
["Mix Des. Data","CUSTOM RECORD","VMAeff1",{"$f":"'Mix Des. Data'!K9","v":""}]
["Mix Des. Data","CUSTOM RECORD","VMAeff2",{"$f":"'Mix Des. Data'!K14","v":""}]
["Mix Des. Data","CUSTOM RECORD","VMAeff3",{"$f":"'Mix Des. Data'!K19","v":""}]
["Mix Des. Data","CUSTOM RECORD","VMAeff4",{"$f":"'Mix Des. Data'!K24","v":""}]
["Mix Des. Data","CUSTOM RECORD","VMAeff5",{"$f":"'Mix Des. Data'!K29","v":""}]
["Mix Des. Data","CUSTOM RECORD","VMAeff OPT",{"$f":"'Mix Des. Data'!K34","v":""}]
["Mix Des. Data","CUSTOM RECORD","VMAbulk1",{"$f":"'Mix Des. Data'!L9","v":""}]
["Mix Des. Data","CUSTOM RECORD","VMAbulk2",{"$f":"'Mix Des. Data'!L14","v":""}]
["Mix Des. Data","CUSTOM RECORD","VMAbulk3",{"$f":"'Mix Des. Data'!L19","v":""}]
["Mix Des. Data","CUSTOM RECORD","VMAbulk4",{"$f":"'Mix Des. Data'!L24","v":""}]
["Mix Des. Data","CUSTOM RECORD","VMAbulk5",{"$f":"'Mix Des. Data'!L29","v":""}]
["Mix Des. Data","CUSTOM RECORD","VMAbulk OPT",{"$f":"'Mix Des. Data'!L34","v":""}]
["Mix Des. Data","CUSTOM RECORD","VFA1",{"$f":"'Mix Des. Data'!M9","v":""}]
["Mix Des. Data","CUSTOM RECORD","VFA2",{"$f":"'Mix Des. Data'!M14","v":""}]
["Mix Des. Data","CUSTOM RECORD","VFA3",{"$f":"'Mix Des. Data'!M19","v":""}]
["Mix Des. Data","CUSTOM RECORD","VFA4",{"$f":"'Mix Des. Data'!M24","v":""}]
["Mix Des. Data","CUSTOM RECORD","VFA5",{"$f":"'Mix Des. Data'!M29","v":""}]
["Mix Des. Data","CUSTOM RECORD","VFA OPT",{"$f":"'Mix Des. Data'!M34","v":""}]
["Mix Des. Data","CUSTOM RECORD","Stability 1",{"$f":"'Mix Des. Data'!O12","v":""}]
["Mix Des. Data","CUSTOM RECORD","Stability 2",{"$f":"'Mix Des. Data'!O17","v":""}]
["Mix Des. Data","CUSTOM RECORD","Stability 3",{"$f":"'Mix Des. Data'!O22","v":""}]
["Mix Des. Data","CUSTOM RECORD","Stability 4",{"$f":"'Mix Des. Data'!O27","v":""}]
["Mix Des. Data","CUSTOM RECORD","Stability 5",{"$f":"'Mix Des. Data'!O32","v":""}]
["Mix Des. Data","CUSTOM RECORD","Stability  OPT",{"$f":"'Mix Des. Data'!O37","v":""}]
["Mix Des. Data","CUSTOM RECORD","Flow 1",{"$f":"'Mix Des. Data'!P12","v":""}]
["Mix Des. Data","CUSTOM RECORD","Flow 2",{"$f":"'Mix Des. Data'!P17","v":""}]
["Mix Des. Data","CUSTOM RECORD","Flow 3",{"$f":"'Mix Des. Data'!P22","v":""}]
["Mix Des. Data","CUSTOM RECORD","Flow 4",{"$f":"'Mix Des. Data'!P27","v":""}]
["Mix Des. Data","CUSTOM RECORD","Flow 5",{"$f":"'Mix Des. Data'!P32","v":""}]
["Mix Des. Data","CUSTOM RECORD","Flow OPT",{"$f":"'Mix Des. Data'!P37","v":""}]
["TSR","CUSTOM RECORD","TSR Blow Ct",{"$f":"TSR!F8","v":0}]
["TSR","CUSTOM RECORD","Conditioned Strength",{"$f":"TSR!D44","v":""}]
["TSR","CUSTOM RECORD","Unconditioned Strength",{"$f":"TSR!G44","v":""}]
["TSR","CUSTOM RECORD","TSR",{"$f":"TSR!C40","v":""}]
["TSR","CUSTOM RECORD","Visual Moisture Damage",{"$f":"TSR!C41","v":0}]
["TSR","CUSTOM RECORD","Visual Agg Damage",{"$f":"TSR!D42","v":0}]
["OGFC","CUSTOM RECORD","OGFC Des Gmb 1",{"$f":"OGFC!O13","v":""}]
["OGFC","CUSTOM RECORD","OGFC Des Gmb 2",{"$f":"OGFC!O18","v":""}]
["OGFC","CUSTOM RECORD","OGFC Des Gmb 3",{"$f":"OGFC!O23","v":""}]
["OGFC","CUSTOM RECORD","OGFC Des Gmb 4",{"$f":"OGFC!O28","v":""}]
["OGFC","CUSTOM RECORD","OGFC Des Gmb 5",{"$f":"OGFC!O33","v":""}]
["OGFC","CUSTOM RECORD","OGFC Des Gmb OPT",{"$f":"OGFC!O38","v":""}]
["OGFC","CUSTOM RECORD","OGFC VTM1",{"$f":"OGFC!Q10","v":""}]
["OGFC","CUSTOM RECORD","OGFC VTM2",{"$f":"OGFC!Q15","v":""}]
["OGFC","CUSTOM RECORD","OGFC VTM3",{"$f":"OGFC!Q20","v":""}]
["OGFC","CUSTOM RECORD","OGFC VTM4",{"$f":"OGFC!Q25","v":""}]
["OGFC","CUSTOM RECORD","OGFC VTM5",{"$f":"OGFC!Q30","v":""}]
["OGFC","CUSTOM RECORD","OGFC VTM OPT",{"$f":"OGFC!Q35","v":""}]
["OGFC","CUSTOM RECORD","OGFC VMAeff1",{"$f":"OGFC!R10","v":""}]
["OGFC","CUSTOM RECORD","OGFC VMAeff2",{"$f":"OGFC!R15","v":""}]
["OGFC","CUSTOM RECORD","OGFC VMAeff3",{"$f":"OGFC!R20","v":""}]
["OGFC","CUSTOM RECORD","OGFC VMAeff4",{"$f":"OGFC!R25","v":""}]
["OGFC","CUSTOM RECORD","OGFC VMAeff5",{"$f":"OGFC!R30","v":""}]
["OGFC","CUSTOM RECORD","OGFC VMAeff OPT",{"$f":"OGFC!R35","v":""}]
["OGFC","CUSTOM RECORD","OGFC VMAbulk1",{"$f":"OGFC!S10","v":""}]
["OGFC","CUSTOM RECORD","OGFC VMAbulk2",{"$f":"OGFC!S15","v":""}]
["OGFC","CUSTOM RECORD","OGFC VMAbulk3",{"$f":"OGFC!S20","v":""}]
["OGFC","CUSTOM RECORD","OGFC VMAbulk4",{"$f":"OGFC!S25","v":""}]
["OGFC","CUSTOM RECORD","OGFC VMAbulk5",{"$f":"OGFC!S30","v":""}]
["OGFC","CUSTOM RECORD","OGFC VMAbulk OPT",{"$f":"OGFC!S35","v":""}]
["OGFC","CUSTOM RECORD","OGFC VFA1",{"$f":"OGFC!T10","v":""}]
["OGFC","CUSTOM RECORD","OGFC VFA2",{"$f":"OGFC!T15","v":""}]
["OGFC","CUSTOM RECORD","OGFC VFA3",{"$f":"OGFC!T20","v":""}]
["OGFC","CUSTOM RECORD","OGFC VFA4",{"$f":"OGFC!T25","v":""}]
["OGFC","CUSTOM RECORD","OGFC VFA5",{"$f":"OGFC!T30","v":""}]
["OGFC","CUSTOM RECORD","OGFC VFA OPT",{"$f":"OGFC!T35","v":""}]
["OGFC","CUSTOM RECORD","Cantabro Loss 1",{"$f":"OGFC!U10","v":""}]
["OGFC","CUSTOM RECORD","Cantabro Loss 2",{"$f":"OGFC!U15","v":""}]
["OGFC","CUSTOM RECORD","Cantabro Loss 3",{"$f":"OGFC!U20","v":""}]
["OGFC","CUSTOM RECORD","Cantabro Loss 4",{"$f":"OGFC!U25","v":""}]
["OGFC","CUSTOM RECORD","Cantabro Loss 5",{"$f":"OGFC!U30","v":""}]
["OGFC","CUSTOM RECORD","Cantabro Loss OPT",{"$f":"OGFC!U35","v":""}]
["OGFC","CUSTOM RECORD","VCA(DRC)",{"$f":"OGFC!G64","v":""}]
["OGFC","CUSTOM RECORD","VCA (mix) 1",{"$f":"OGFC!X10","v":""}]
["OGFC","CUSTOM RECORD","VCA (mix) 2",{"$f":"OGFC!X15","v":""}]
["OGFC","CUSTOM RECORD","VCA (mix) 3",{"$f":"OGFC!X20","v":""}]
["OGFC","CUSTOM RECORD","VCA (mix) 4",{"$f":"OGFC!X25","v":""}]
["OGFC","CUSTOM RECORD","VCA (mix) 5",{"$f":"OGFC!X30","v":""}]
["OGFC","CUSTOM RECORD","VCA (mix) opt",{"$f":"OGFC!X35","v":""}]
["OGFC","CUSTOM RECORD","Drain Down",{"$f":"OGFC!P81","v":""}]
["OGFC","CUSTOM RECORD","Fiber %",{"$f":"OGFC!L4","v":0}]
["JMF1","CUSTOM RECORD","Source 1 %Pass 2\"",{"$f":"'JMF1'!B43","v":""}]
["JMF1","CUSTOM RECORD","Source 1 %Pass 1.5\"",{"$f":"'JMF1'!B44","v":""}]
["JMF1","CUSTOM RECORD","Source 1 %Pass 1.25\"",{"$f":"'JMF1'!B45","v":""}]
["JMF1","CUSTOM RECORD","Source 1 %Pass 1\"",{"$f":"'JMF1'!B46","v":""}]
["JMF1","CUSTOM RECORD","Source 1 %Pass 3/4\"",{"$f":"'JMF1'!B47","v":""}]
["JMF1","CUSTOM RECORD","Source 1 %Pass 5/8\"",{"$f":"'JMF1'!B48","v":""}]
["JMF1","CUSTOM RECORD","Source 1 %Pass 1/2\"",{"$f":"'JMF1'!B49","v":""}]
["JMF1","CUSTOM RECORD","Source 1 %Pass 3/8\"",{"$f":"'JMF1'!B50","v":""}]
["JMF1","CUSTOM RECORD","Source 1 %Pass No.4",{"$f":"'JMF1'!B51","v":""}]
["JMF1","CUSTOM RECORD","Source 1 %Pass No.8",{"$f":"'JMF1'!B52","v":""}]
["JMF1","CUSTOM RECORD","Source 1 %Pass No.16",{"$f":"'JMF1'!B53","v":""}]
["JMF1","CUSTOM RECORD","Source 1 %Pass No.30",{"$f":"'JMF1'!B54","v":""}]
["JMF1","CUSTOM RECORD","Source 1 %Pass No.50",{"$f":"'JMF1'!B55","v":""}]
["JMF1","CUSTOM RECORD","Source 1 %Pass No.100",{"$f":"'JMF1'!B56","v":""}]
["JMF1","CUSTOM RECORD","Source 1 %Pass No.200",{"$f":"'JMF1'!B57","v":""}]
["JMF1","CUSTOM RECORD","Source 2 %Pass 2\"",{"$f":"'JMF1'!C43","v":""}]
["JMF1","CUSTOM RECORD","Source 2 %Pass 1.5\"",{"$f":"'JMF1'!C44","v":""}]
["JMF1","CUSTOM RECORD","Source 2 %Pass 1.25\"",{"$f":"'JMF1'!C45","v":""}]
["JMF1","CUSTOM RECORD","Source 2 %Pass 1\"",{"$f":"'JMF1'!C46","v":""}]
["JMF1","CUSTOM RECORD","Source 2 %Pass 3/4\"",{"$f":"'JMF1'!C47","v":""}]
["JMF1","CUSTOM RECORD","Source 2 %Pass 5/8\"",{"$f":"'JMF1'!C48","v":""}]
["JMF1","CUSTOM RECORD","Source 2 %Pass 1/2\"",{"$f":"'JMF1'!C49","v":""}]
["JMF1","CUSTOM RECORD","Source 2 %Pass 3/8\"",{"$f":"'JMF1'!C50","v":""}]
["JMF1","CUSTOM RECORD","Source 2 %Pass No.4",{"$f":"'JMF1'!C51","v":""}]
["JMF1","CUSTOM RECORD","Source 2 %Pass No.8",{"$f":"'JMF1'!C52","v":""}]
["JMF1","CUSTOM RECORD","Source 2 %Pass No.16",{"$f":"'JMF1'!C53","v":""}]
["JMF1","CUSTOM RECORD","Source 2 %Pass No.30",{"$f":"'JMF1'!C54","v":""}]
["JMF1","CUSTOM RECORD","Source 2 %Pass No.50",{"$f":"'JMF1'!C55","v":""}]
["JMF1","CUSTOM RECORD","Source 2 %Pass No.100",{"$f":"'JMF1'!C56","v":""}]
["JMF1","CUSTOM RECORD","Source 2 %Pass No.200",{"$f":"'JMF1'!C57","v":""}]
["JMF1","CUSTOM RECORD","Source 3 %Pass 2\"",{"$f":"'JMF1'!D43","v":""}]
["JMF1","CUSTOM RECORD","Source 3 %Pass 1.5\"",{"$f":"'JMF1'!D44","v":""}]
["JMF1","CUSTOM RECORD","Source 3 %Pass 1.25\"",{"$f":"'JMF1'!D45","v":""}]
["JMF1","CUSTOM RECORD","Source 3 %Pass 1\"",{"$f":"'JMF1'!D46","v":""}]
["JMF1","CUSTOM RECORD","Source 3 %Pass 3/4\"",{"$f":"'JMF1'!D47","v":""}]
["JMF1","CUSTOM RECORD","Source 3 %Pass 5/8\"",{"$f":"'JMF1'!D48","v":""}]
["JMF1","CUSTOM RECORD","Source 3 %Pass 1/2\"",{"$f":"'JMF1'!D49","v":""}]
["JMF1","CUSTOM RECORD","Source 3 %Pass 3/8\"",{"$f":"'JMF1'!D50","v":""}]
["JMF1","CUSTOM RECORD","Source 3 %Pass No.4",{"$f":"'JMF1'!D51","v":""}]
["JMF1","CUSTOM RECORD","Source 3 %Pass No.8",{"$f":"'JMF1'!D52","v":""}]
["JMF1","CUSTOM RECORD","Source 3 %Pass No.16",{"$f":"'JMF1'!D53","v":""}]
["JMF1","CUSTOM RECORD","Source 3 %Pass No.30",{"$f":"'JMF1'!D54","v":""}]
["JMF1","CUSTOM RECORD","Source 3 %Pass No.50",{"$f":"'JMF1'!D55","v":""}]
["JMF1","CUSTOM RECORD","Source 3 %Pass No.100",{"$f":"'JMF1'!D56","v":""}]
["JMF1","CUSTOM RECORD","Source 3 %Pass No.200",{"$f":"'JMF1'!D57","v":""}]
["JMF1","CUSTOM RECORD","Source 4 %Pass 2\"",{"$f":"'JMF1'!E43","v":""}]
["JMF1","CUSTOM RECORD","Source 4 %Pass 1.5\"",{"$f":"'JMF1'!E44","v":""}]
["JMF1","CUSTOM RECORD","Source 4 %Pass 1.25\"",{"$f":"'JMF1'!E45","v":""}]
["JMF1","CUSTOM RECORD","Source 4 %Pass 1\"",{"$f":"'JMF1'!E46","v":""}]
["JMF1","CUSTOM RECORD","Source 4 %Pass 3/4\"",{"$f":"'JMF1'!E47","v":""}]
["JMF1","CUSTOM RECORD","Source 4 %Pass 5/8\"",{"$f":"'JMF1'!E48","v":""}]
["JMF1","CUSTOM RECORD","Source 4 %Pass 1/2\"",{"$f":"'JMF1'!E49","v":""}]
["JMF1","CUSTOM RECORD","Source 4 %Pass 3/8\"",{"$f":"'JMF1'!E50","v":""}]
["JMF1","CUSTOM RECORD","Source 4 %Pass No.4",{"$f":"'JMF1'!E51","v":""}]
["JMF1","CUSTOM RECORD","Source 4 %Pass No.8",{"$f":"'JMF1'!E52","v":""}]
["JMF1","CUSTOM RECORD","Source 4 %Pass No.16",{"$f":"'JMF1'!E53","v":""}]
["JMF1","CUSTOM RECORD","Source 4 %Pass No.30",{"$f":"'JMF1'!E54","v":""}]
["JMF1","CUSTOM RECORD","Source 4 %Pass No.50",{"$f":"'JMF1'!E55","v":""}]
["JMF1","CUSTOM RECORD","Source 4 %Pass No.100",{"$f":"'JMF1'!E56","v":""}]
["JMF1","CUSTOM RECORD","Source 4 %Pass No.200",{"$f":"'JMF1'!E57","v":""}]
["JMF1","CUSTOM RECORD","Source 5 %Pass 2\"",{"$f":"'JMF1'!F43","v":""}]
["JMF1","CUSTOM RECORD","Source 5 %Pass 1.5\"",{"$f":"'JMF1'!F44","v":""}]
["JMF1","CUSTOM RECORD","Source 5 %Pass 1.25\"",{"$f":"'JMF1'!F45","v":""}]
["JMF1","CUSTOM RECORD","Source 5 %Pass 1\"",{"$f":"'JMF1'!F46","v":""}]
["JMF1","CUSTOM RECORD","Source 5 %Pass 3/4\"",{"$f":"'JMF1'!F47","v":""}]
["JMF1","CUSTOM RECORD","Source 5 %Pass 5/8\"",{"$f":"'JMF1'!F48","v":""}]
["JMF1","CUSTOM RECORD","Source 5 %Pass 1/2\"",{"$f":"'JMF1'!F49","v":""}]
["JMF1","CUSTOM RECORD","Source 5 %Pass 3/8\"",{"$f":"'JMF1'!F50","v":""}]
["JMF1","CUSTOM RECORD","Source 5 %Pass No.4",{"$f":"'JMF1'!F51","v":""}]
["JMF1","CUSTOM RECORD","Source 5 %Pass No.8",{"$f":"'JMF1'!F52","v":""}]
["JMF1","CUSTOM RECORD","Source 5 %Pass No.16",{"$f":"'JMF1'!F53","v":""}]
["JMF1","CUSTOM RECORD","Source 5 %Pass No.30",{"$f":"'JMF1'!F54","v":""}]
["JMF1","CUSTOM RECORD","Source 5 %Pass No.50",{"$f":"'JMF1'!F55","v":""}]
["JMF1","CUSTOM RECORD","Source 5 %Pass No.100",{"$f":"'JMF1'!F56","v":""}]
["JMF1","CUSTOM RECORD","Source 5 %Pass No.200",{"$f":"'JMF1'!F57","v":""}]
["JMF1","CUSTOM RECORD","Source 6 %Pass 2\"",{"$f":"'JMF1'!G43","v":""}]
["JMF1","CUSTOM RECORD","Source 6 %Pass 1.5\"",{"$f":"'JMF1'!G44","v":""}]
["JMF1","CUSTOM RECORD","Source 6 %Pass 1.25\"",{"$f":"'JMF1'!G45","v":""}]
["JMF1","CUSTOM RECORD","Source 6 %Pass 1\"",{"$f":"'JMF1'!G46","v":""}]
["JMF1","CUSTOM RECORD","Source 6 %Pass 3/4\"",{"$f":"'JMF1'!G47","v":""}]
["JMF1","CUSTOM RECORD","Source 6 %Pass 5/8\"",{"$f":"'JMF1'!G48","v":""}]
["JMF1","CUSTOM RECORD","Source 6 %Pass 1/2\"",{"$f":"'JMF1'!G49","v":""}]
["JMF1","CUSTOM RECORD","Source 6 %Pass 3/8\"",{"$f":"'JMF1'!G50","v":""}]
["JMF1","CUSTOM RECORD","Source 6 %Pass No.4",{"$f":"'JMF1'!G51","v":""}]
["JMF1","CUSTOM RECORD","Source 6 %Pass No.8",{"$f":"'JMF1'!G52","v":""}]
["JMF1","CUSTOM RECORD","Source 6 %Pass No.16",{"$f":"'JMF1'!G53","v":""}]
["JMF1","CUSTOM RECORD","Source 6 %Pass No.30",{"$f":"'JMF1'!G54","v":""}]
["JMF1","CUSTOM RECORD","Source 6 %Pass No.50",{"$f":"'JMF1'!G55","v":""}]
["JMF1","CUSTOM RECORD","Source 6 %Pass No.100",{"$f":"'JMF1'!G56","v":""}]
["JMF1","CUSTOM RECORD","Source 6 %Pass No.200",{"$f":"'JMF1'!G57","v":""}]
["JMF1","CUSTOM RECORD","Source 7 %Pass 2\"",{"$f":"'JMF1'!H43","v":""}]
["JMF1","CUSTOM RECORD","Source 7 %Pass 1.5\"",{"$f":"'JMF1'!H44","v":""}]
["JMF1","CUSTOM RECORD","Source 7 %Pass 1.25\"",{"$f":"'JMF1'!H45","v":""}]
["JMF1","CUSTOM RECORD","Source 7 %Pass 1\"",{"$f":"'JMF1'!H46","v":""}]
["JMF1","CUSTOM RECORD","Source 7 %Pass 3/4\"",{"$f":"'JMF1'!H47","v":""}]
["JMF1","CUSTOM RECORD","Source 7 %Pass 5/8\"",{"$f":"'JMF1'!H48","v":""}]
["JMF1","CUSTOM RECORD","Source 7 %Pass 1/2\"",{"$f":"'JMF1'!H49","v":""}]
["JMF1","CUSTOM RECORD","Source 7 %Pass 3/8\"",{"$f":"'JMF1'!H50","v":""}]
["JMF1","CUSTOM RECORD","Source 7 %Pass No.4",{"$f":"'JMF1'!H51","v":""}]
["JMF1","CUSTOM RECORD","Source 7 %Pass No.8",{"$f":"'JMF1'!H52","v":""}]
["JMF1","CUSTOM RECORD","Source 7 %Pass No.16",{"$f":"'JMF1'!H53","v":""}]
["JMF1","CUSTOM RECORD","Source 7 %Pass No.30",{"$f":"'JMF1'!H54","v":""}]
["JMF1","CUSTOM RECORD","Source 7 %Pass No.50",{"$f":"'JMF1'!H55","v":""}]
["JMF1","CUSTOM RECORD","Source 7 %Pass No.100",{"$f":"'JMF1'!H56","v":""}]
["JMF1","CUSTOM RECORD","Source 7 %Pass No.200",{"$f":"'JMF1'!H57","v":""}]
["ASA Suppliers","CUSTOM RECORD","ASA Supplier Code",{"$f":"'ASA Suppliers'!H1","v":0}]
["ASA Suppliers","CUSTOM RECORD","ASA Supplier",{"$f":"'ASA Suppliers'!F1","v":0}]
["JMF1","CUSTOM RECORD","ASA Dosage",{"$f":"'JMF1'!I25*100","v":{"$error":"#VALUE!"}}]
["JMF1","CUSTOM RECORD","ASA Additive",{"$f":"'ASA Suppliers'!G1","v":0}]
["JMF1","CUSTOM RECORD","Warm Mix",{"$f":"'JMF1'!H34","v":0}]
["Mix Des. Data","---","R^2 value from VTM graph",{"$f":"IF(ISBLANK('Mix Des. Data'!B34),\"\",(CORREL('Mix Des. Data'!J9:J34,'Mix Des. Data'!B9:B34))^2)","v":""}]
["Stuff",null,"Agg Size 1",{"$f":"Stuff!F65","v":0}]
["Stuff",null,"Agg Size 2",{"$f":"Stuff!F66","v":0}]
["Stuff",null,"Agg Size 3",{"$f":"Stuff!F67","v":0}]
["Stuff",null,"Agg Size 4",{"$f":"Stuff!F68","v":0}]
["Stuff",null,"Agg Size 5",{"$f":"Stuff!F69","v":0}]
["Stuff",null,"Agg Size 6",{"$f":"Stuff!F70","v":0}]
["Stuff",null,"Agg Size 7",{"$f":"Stuff!F71","v":0}]
["JMF1",null,"Mixing Temperature Range",{"$f":"'JMF1'!I36:J36","v":0},0]
["JMF1",null,"Delivery Temperature Range",{"$f":"'JMF1'!I37:J37","v":0},0]
["Stuff",null,"RAP 1 AC Content",{"$f":"Stuff!H93","v":0}]
["Stuff",null,"RAP 2 AC Content",{"$f":"Stuff!I93","v":0}]

{"sheet":"AWP Gradations","index":3,"n_rows":54,"n_cols":24,"rows_kept":54,"cut":false,"hidden":true,"merged":[]}
["Sieve Size","Target","Lower Limit 1","Upper Limit 1","Lower Limit","Upper Limit",null,"Upper Limit",null,"2\"","1.5\"","1.25\"","1\"","3/4\"","5/8\"","1/2\"","3/8\"","No.4","No.8","No.16","No.30","No.50","No.100","No.200"]
["2\"",{"$f":"IF(Stuff!$K$78=0,\"\",Stuff!$J$78)","v":""},{"$f":"VLOOKUP(Stuff!$C$27,'AWP Gradations'!$H$29:$X$54,3)","v":0},{"$f":"VLOOKUP(Stuff!$C$27,'AWP Gradations'!$H$2:$X$27,3)","v":0},{"$f":"IF(C2>0,C2,\"\")","v":""},{"$f":"IF(D2>0,D2,\"\")","v":""},null,1," "]
["1.5\"",{"$f":"IF(Stuff!$K$79=0,\"\",Stuff!$J$79)","v":""},{"$f":"VLOOKUP(Stuff!$C$27,'AWP Gradations'!$H$29:$X$54,4)","v":0},{"$f":"VLOOKUP(Stuff!$C$27,'AWP Gradations'!$H$2:$X$27,4)","v":0},{"$f":"IF(C3>0,C3,\"\")","v":""},{"$f":"IF(D3>0,D3,\"\")","v":""},null,2,"307-A",100,100,null,null,71,null,null,50,36,27,null,17,null,10,4.5]
["1.25\"",{"$f":"IF(Stuff!$K$80=0,\"\",Stuff!$J$80)","v":""},{"$f":"VLOOKUP(Stuff!$C$27,'AWP Gradations'!$H$29:$X$54,5)","v":0},{"$f":"VLOOKUP(Stuff!$C$27,'AWP Gradations'!$H$2:$X$27,5)","v":0},"","",null,3,"307-AS",100,100,null,null,80,null,null,null,11,null,null,null,null,6,4.5]
["1\"",{"$f":"IF(Stuff!$K$81=0,\"\",Stuff!$J$81)","v":""},{"$f":"VLOOKUP(Stuff!$C$27,'AWP Gradations'!$H$29:$X$54,6)","v":0},{"$f":"VLOOKUP(Stuff!$C$27,'AWP Gradations'!$H$2:$X$27,6)","v":0},"","",null,4,"307ACRL",100,93,null,null,75,null,null,null,16,null,null,null,null,4,3.5]
["3/4\"",{"$f":"IF(Stuff!$K$82=0,\"\",Stuff!$J$82)","v":""},{"$f":"VLOOKUP(Stuff!$C$27,'AWP Gradations'!$H$29:$X$54,7)","v":0},{"$f":"VLOOKUP(Stuff!$C$27,'AWP Gradations'!$H$2:$X$27,7)","v":0},"","",null,5,"307-B",100,100,null,null,85,null,null,72,51,42,null,22,14,10,6.5]
["5/8\"",{"$f":"IF(Stuff!$K$83=0,\"\",Stuff!$J$83)","v":""},{"$f":"VLOOKUP(Stuff!$C$27,'AWP Gradations'!$H$29:$X$54,8)","v":0},{"$f":"VLOOKUP(Stuff!$C$27,'AWP Gradations'!$H$2:$X$27,8)","v":0},"","",null,6,"307-BM",null,null,null,100,100,null,null,79,61,47,null,27,20,10,6.5]
["1/2\"",{"$f":"IF(Stuff!$K$84=0,\"\",Stuff!$J$84)","v":""},{"$f":"VLOOKUP(Stuff!$C$27,'AWP Gradations'!$H$29:$X$54,9)","v":0},{"$f":"VLOOKUP(Stuff!$C$27,'AWP Gradations'!$H$2:$X$27,9)","v":0},"","",null,7,"307-BM2",null,null,100,null,93,null,null,73,56,43,null,25,19,10,6.5]
["3/8\"",{"$f":"IF(Stuff!$K$85=0,\"\",Stuff!$J$85)","v":""},{"$f":"VLOOKUP(Stuff!$C$27,'AWP Gradations'!$H$29:$X$54,10)","v":0},{"$f":"VLOOKUP(Stuff!$C$27,'AWP Gradations'!$H$2:$X$27,10)","v":0},"","",null,8,"307-C",null,null,null,null,100,null,null,90,66,47,null,27,15,8,6.5]
["No.4",{"$f":"IF(Stuff!$K$86=0,\"\",Stuff!$J$86)","v":""},{"$f":"VLOOKUP(Stuff!$C$27,'AWP Gradations'!$H$29:$X$54,11)","v":0},{"$f":"VLOOKUP(Stuff!$C$27,'AWP Gradations'!$H$2:$X$27,11)","v":0},"","",null,9,"307-CW",null,null,null,null,100,null,null,100,null,67,null,47,null,10,6.5]
["No.8",{"$f":"IF(Stuff!$K$87=0,\"\",Stuff!$J$87)","v":""},{"$f":"VLOOKUP(Stuff!$C$27,'AWP Gradations'!$H$29:$X$54,12)","v":0},{"$f":"VLOOKUP(Stuff!$C$27,'AWP Gradations'!$H$2:$X$27,12)","v":0},"","",null,10,"307-CS",null,null,null,null,null,null,null,100,94,77,null,42,null,18,13.5]
["No.16",{"$f":"IF(Stuff!$K$88=0,\"\",Stuff!$J$88)","v":""},{"$f":"VLOOKUP(Stuff!$C$27,'AWP Gradations'!$H$29:$X$54,13)","v":0},{"$f":"VLOOKUP(Stuff!$C$27,'AWP Gradations'!$H$2:$X$27,13)","v":0},"","",null,11,"307-CAM",null,null,null,null,100,null,null,100]
["No.30",{"$f":"IF(Stuff!$K$89=0,\"\",Stuff!$J$89)","v":""},{"$f":"VLOOKUP(Stuff!$C$27,'AWP Gradations'!$H$29:$X$54,14)","v":0},{"$f":"VLOOKUP(Stuff!$C$27,'AWP Gradations'!$H$2:$X$27,14)","v":0},"","",null,12,"313-TPB",100,100,null,null,80,null,null,null,11,null,null,null,null,4,3]
["No.50",{"$f":"IF(Stuff!$K$90=0,\"\",Stuff!$J$90)","v":""},{"$f":"VLOOKUP(Stuff!$C$27,'AWP Gradations'!$H$29:$X$54,15)","v":0},{"$f":"VLOOKUP(Stuff!$C$27,'AWP Gradations'!$H$2:$X$27,15)","v":0},"","",null,13,"411-D",null,null,null,null,null,100,100,93,76,57,null,29,18,10,6.5]
["No.100",{"$f":"IF(Stuff!$K$91=0,\"\",Stuff!$J$91)","v":""},{"$f":"VLOOKUP(Stuff!$C$27,'AWP Gradations'!$H$29:$X$54,16)","v":0},{"$f":"VLOOKUP(Stuff!$C$27,'AWP Gradations'!$H$2:$X$27,16)","v":0},"","",null,14,"411-E",null,null,null,null,null,100,100,93,76,57,null,29,18,11,8]
["No.200",{"$f":"IF(Stuff!$K$92=0,\"\",Stuff!$J$92)","v":""},{"$f":"VLOOKUP(Stuff!$C$27,'AWP Gradations'!$H$29:$X$54,17)","v":0},{"$f":"VLOOKUP(Stuff!$C$27,'AWP Gradations'!$H$2:$X$27,17)","v":0},"","",null,15,"411-E (shoulders)",null,null,null,null,null,100,100,93,76,57,null,29,18,11,8]
[null,null,null,null,null,null,null,16,"411-TL",null,null,null,null,null,null,null,100,94,77,null,42,null,18,14]
[null,null,null,null,null,null,null,17,"411-TLD",null,null,null,null,null,null,100,100,76,57,null,33,18,10,7]
[null,null,null,null,null,null,null,18,"411-OGFC",null,null,null,null,100,null,100,75,25,10,null,null,null,null,4]
[null,null,null,null,null,null,null,19,"411-OGFC (shoulders)",null,null,null,null,100,null,100,75,25,10,null,null,null,null,4]
[null,null,null,null,null,null,null,20,"307-CM",null,null,null,null,100,null,null,100,null,57,null,35,null,10,6.5]
[null,null,null,null,null,null,null,21,"411-NC (A)",null,null,null,null,null,null,null,100,55,32,25,18,13,10,6]
[null,null,null,null,null,null,null,22,"411-NC (B)",null,null,null,null,null,100,100,100,38,27,23,18,13,10,6]
[null,null,null,null,null,null,null,23,"411-NC (C)",null,null,null,null,100,null,100,80,38,27,23,18,13,10,6]
[null,null,null,null,null,null,null,24,"411-SMA",null,null,null,null,100,null,100,80,35,24,null,null,null,null,11]
[null,null,null,null,null,null,null,25,"411-TLE",null,null,null,null,null,null,100,100,76,57,null,33,18,10,7]
[null,null,null,null,null,null,null,26,"411-TLE (shoulders)",null,null,null,null,null,null,100,100,76,57,null,33,18,10,7]
[null,null,null,null,null,null,null,"Lower Limit",null,"2\"","1.5\"","1.25\"","1\"","3/4\"","5/8\"","1/2\"","3/8\"","No.4","No.8","No.16","No.30","No.50","No.100","No.200"]
[null,null,null,null,null,null,null,1," "]
[null,null,null,null,null,null,null,2,"307-A",null,81,null,null,50,null,null,35,24,13,null,7,null,0,0]
[null,null,null,null,null,null,null,3,"307-AS",null,75,null,null,55,null,null,null,7,null,null,null,null,0,0]
[null,null,null,null,null,null,null,4,"307ACRL",null,80,null,null,60,null,null,null,12,null,null,null,null,0,0]
[null,null,null,null,null,null,null,5,"307-B",null,95,null,null,70,null,null,49,34,23,null,11,9,4,2.5]
[null,null,null,null,null,null,null,6,"307-BM",null,null,null,null,85,null,null,59,42,29,null,13,7,4,0]
[null,null,null,null,null,null,null,7,"307-BM2",null,null,null,null,81,null,null,57,40,28,null,13,9,6,2.5]
[null,null,null,null,null,null,null,8,"307-C",null,null,null,null,null,null,null,70,39,23,null,10,8,4,2.5]
[null,null,null,null,null,null,null,9,"307-CW",null,null,null,null,null,null,null,75,null,43,null,23,null,4,2.5]
[null,null,null,null,null,null,null,10,"307-CS",null,null,null,null,null,null,null,null,89,53,null,23,null,9,6]
[null,null,null,null,null,null,null,11,"307-CAM",null,null,null,null,null,null,null,75]
[null,null,null,null,null,null,null,12,"313-TPB",null,70,null,null,55,null,null,null,null,null,null,null,null,null,0]
[null,null,null,null,null,null,null,13,"411-D",null,null,null,null,null,null,95,80,54,35,null,17,10,3,0]
[null,null,null,null,null,null,null,14,"411-E",null,null,null,null,null,null,95,80,54,35,null,17,10,3,0]
[null,null,null,null,null,null,null,15,"411-E (shoulders)",null,null,null,null,null,null,95,80,54,35,null,17,10,3,0]
[null,null,null,null,null,null,null,16,"411-TL",null,null,null,null,null,null,null,null,89,53,null,23,null,9,6]
[null,null,null,null,null,null,null,17,"411-TLD",null,null,null,null,null,null,null,90,54,35,null,17,10,3,4]
[null,null,null,null,null,null,null,18,"411-OGFC",null,null,null,null,null,null,85,55,10,5,null,null,null,null,2]
[null,null,null,null,null,null,null,19,"411-OGFC (shoulders)",null,null,null,null,null,null,85,55,10,5,null,null,null,null,2]
[null,null,null,null,null,null,null,20,"307-CM",null,null,null,null,null,null,null,75,null,35,null,18,null,4,2.5]
[null,null,null,null,null,null,null,21,"411-NC (A)",null,null,null,null,null,null,null,null,40,22,15,10,8,6,4]
[null,null,null,null,null,null,null,22,"411-NC (B)",null,null,null,null,null,null,95,75,25,19,15,10,8,6,4]
[null,null,null,null,null,null,null,23,"411-NC (C)",null,null,null,null,null,null,75,50,25,19,15,10,8,6,4]
[null,null,null,null,null,null,null,24,"411-SMA",null,null,null,null,null,null,90,50,20,16,null,null,null,null,8]
[null,null,null,null,null,null,null,25,"411-TLE",null,null,null,null,null,null,null,90,54,35,null,17,10,3,4]
[null,null,null,null,null,null,null,26,"411-TLE (shoulders)",null,null,null,null,null,null,null,90,54,35,null,17,10,3,4]

{"sheet":"Contractors Gradations","index":4,"n_rows":57,"n_cols":31,"rows_kept":57,"cut":false,"hidden":false,"merged":[[23,1,23,5]]}
[]
[null,1,2,3,{"$f":"1+D2","v":4},5,6,7,8,9,10,11,12,13,14,15,16,17,18,19,20,21,22,23,24,25,26,27,28,29,30]
["Size",null,{"$f":"'Aggregate Suppliers'!G16","v":0},{"$f":"VLOOKUP(Stuff!$C158,Stuff!$A$157:$B$190,2)","v":"#57"},{"$f":"VLOOKUP(Stuff!$C159,Stuff!$A$157:$B$190,2)","v":"#10 (Soft)"},{"$f":"VLOOKUP(Stuff!$C160,Stuff!$A$157:$B$190,2)","v":"RAP"},{"$f":"VLOOKUP(Stuff!$C161,Stuff!$A$157:$B$190,2)","v":"#5"},{"$f":"VLOOKUP(Stuff!$C162,Stuff!$A$157:$B$190,2)","v":"#57"},{"$f":"VLOOKUP(Stuff!$C163,Stuff!$A$157:$B$190,2)","v":"#78"},{"$f":"VLOOKUP(Stuff!$C164,Stuff!$A$157:$B$190,2)","v":"#10 (Soft)"},{"$f":"VLOOKUP(Stuff!$C165,Stuff!$A$157:$B$190,2)","v":0},{"$f":"VLOOKUP(Stuff!$C166,Stuff!$A$157:$B$190,2)","v":0},{"$f":"VLOOKUP(Stuff!$C167,Stuff!$A$157:$B$190,2)","v":0},{"$f":"VLOOKUP(Stuff!$C168,Stuff!$A$157:$B$190,2)","v":0},{"$f":"VLOOKUP(Stuff!$C169,Stuff!$A$157:$B$190,2)","v":0},{"$f":"VLOOKUP(Stuff!$C170,Stuff!$A$157:$B$190,2)","v":0},{"$f":"VLOOKUP(Stuff!$C171,Stuff!$A$157:$B$190,2)","v":0},{"$f":"VLOOKUP(Stuff!$C172,Stuff!$A$157:$B$190,2)","v":0},{"$f":"VLOOKUP(Stuff!$C173,Stuff!$A$157:$B$190,2)","v":0},{"$f":"VLOOKUP(Stuff!$C174,Stuff!$A$157:$B$190,2)","v":0},{"$f":"VLOOKUP(Stuff!$C175,Stuff!$A$157:$B$190,2)","v":0},{"$f":"VLOOKUP(Stuff!$C176,Stuff!$A$157:$B$190,2)","v":0},{"$f":"VLOOKUP(Stuff!$C177,Stuff!$A$157:$B$190,2)","v":0},{"$f":"VLOOKUP(Stuff!$C178,Stuff!$A$157:$B$190,2)","v":0},{"$f":"VLOOKUP(Stuff!$C179,Stuff!$A$157:$B$190,2)","v":0},{"$f":"VLOOKUP(Stuff!$C180,Stuff!$A$157:$B$190,2)","v":0},{"$f":"VLOOKUP(Stuff!$C181,Stuff!$A$157:$B$190,2)","v":0},{"$f":"VLOOKUP(Stuff!$C182,Stuff!$A$157:$B$190,2)","v":0},{"$f":"VLOOKUP(Stuff!$C183,Stuff!$A$157:$B$190,2)","v":0},{"$f":"VLOOKUP(Stuff!$C184,Stuff!$A$157:$B$190,2)","v":0},{"$f":"VLOOKUP(Stuff!$C185,Stuff!$A$157:$B$190,2)","v":0}]
["Material",null,{"$f":"VLOOKUP(Stuff!$C2,Stuff!$A$2:$B$15,2)","v":0},{"$f":"VLOOKUP(Stuff!$C3,Stuff!$A$2:$B$15,2)","v":"Mineral Filler"},{"$f":"VLOOKUP(Stuff!$C4,Stuff!$A$2:$B$15,2)","v":"Screenings"},{"$f":"VLOOKUP(Stuff!$C5,Stuff!$A$2:$B$15,2)","v":"Minus 3/4 inch Rap"},{"$f":"VLOOKUP(Stuff!$C6,Stuff!$A$2:$B$15,2)","v":"Coarse Aggregate"},{"$f":"VLOOKUP(Stuff!$C7,Stuff!$A$2:$B$15,2)","v":"Coarse Aggregate"},{"$f":"VLOOKUP(Stuff!$C8,Stuff!$A$2:$B$15,2)","v":"Medium Coarse Aggregate"},{"$f":"VLOOKUP(Stuff!$C9,Stuff!$A$2:$B$15,2)","v":"Screenings"},{"$f":"VLOOKUP(Stuff!$D2,Stuff!$A$2:$B$15,2)","v":0},{"$f":"VLOOKUP(Stuff!$D3,Stuff!$A$2:$B$15,2)","v":0},{"$f":"VLOOKUP(Stuff!$D4,Stuff!$A$2:$B$15,2)","v":0},{"$f":"VLOOKUP(Stuff!$D5,Stuff!$A$2:$B$15,2)","v":0},{"$f":"VLOOKUP(Stuff!$D6,Stuff!$A$2:$B$15,2)","v":0},{"$f":"VLOOKUP(Stuff!$D7,Stuff!$A$2:$B$15,2)","v":0},{"$f":"VLOOKUP(Stuff!$D8,Stuff!$A$2:$B$15,2)","v":0},{"$f":"VLOOKUP(Stuff!$D9,Stuff!$A$2:$B$15,2)","v":0},{"$f":"VLOOKUP(Stuff!$E2,Stuff!$A$2:$B$15,2)","v":0},{"$f":"VLOOKUP(Stuff!$E3,Stuff!$A$2:$B$15,2)","v":0},{"$f":"VLOOKUP(Stuff!$E4,Stuff!$A$2:$B$15,2)","v":0},{"$f":"VLOOKUP(Stuff!$E5,Stuff!$A$2:$B$15,2)","v":0},{"$f":"VLOOKUP(Stuff!$E6,Stuff!$A$2:$B$15,2)","v":0},{"$f":"VLOOKUP(Stuff!$E7,Stuff!$A$2:$B$15,2)","v":0},{"$f":"VLOOKUP(Stuff!$E8,Stuff!$A$2:$B$15,2)","v":0},{"$f":"VLOOKUP(Stuff!$E9,Stuff!$A$2:$B$15,2)","v":0},{"$f":"VLOOKUP(Stuff!$F2,Stuff!$A$2:$B$15,2)","v":0},{"$f":"VLOOKUP(Stuff!$F3,Stuff!$A$2:$B$15,2)","v":0},{"$f":"VLOOKUP(Stuff!$F4,Stuff!$A$2:$B$15,2)","v":0},{"$f":"VLOOKUP(Stuff!$F5,Stuff!$A$2:$B$15,2)","v":0},{"$f":"VLOOKUP(Stuff!$F6,Stuff!$A$2:$B$15,2)","v":0}]
["Producer and Location (As shown in TDOT's Producer Listing)",null,"='Aggregate Suppliers'!F13","='Aggregate Suppliers'!F13","='Aggregate Suppliers'!F13","='Aggregate Suppliers'!F13","='Aggregate Suppliers'!F13","='Aggregate Suppliers'!F13","='Aggregate Suppliers'!F13","='Aggregate Suppliers'!F13","='Aggregate Suppliers'!F13","='Aggregate Suppliers'!F13","='Aggregate Suppliers'!F13","='Aggregate Suppliers'!F13","='Aggregate Suppliers'!F13","='Aggregate Suppliers'!F13","='Aggregate Suppliers'!F13","='Aggregate Suppliers'!F13","='Aggregate Suppliers'!F13","='Aggregate Suppliers'!F13","='Aggregate Suppliers'!F13","='Aggregate Suppliers'!F13","='Aggregate Suppliers'!F13","='Aggregate Suppliers'!F13","='Aggregate Suppliers'!F13","='Aggregate Suppliers'!F13","='Aggregate Suppliers'!F13","='Aggregate Suppliers'!F13","='Aggregate Suppliers'!F13","='Aggregate Suppliers'!F13","='Aggregate Suppliers'!F13"]
["2\""]
["1.5\""]
["1.25\""]
["1\""]
["3/4\""]
["5/8\""]
["1/2\""]
["3/8\""]
["#4"]
["#8"]
["#16"]
["#30"]
["#50"]
["#100"]
["#200"]
["RAP AC Content"]
[]
[]
[null,"Current listing of TDOT Approved Surface Aggregates"]
[]
[]
[]
[null,"Material"]
[2,"#10 (Soft)"]
[3,"#7"]
[4,"Natural Sand"]
[5,"RAP"]
[6,"RAP"]
[7,"#57"]
[8,0]
[9,0]
[10,0]
[11,0]
[12,0]
[13,0]
[14,0]
[15,0]
[16,0]
[17,0]
[18,0]
[19,0]
[20,0]
[21,0]
[22,0]
[23,0]
[24,0]
[25,0]
[26,0]
[27,0]
[28,0]
[29,0]
[30,0]

{"sheet":"45","index":5,"n_rows":74,"n_cols":176,"rows_kept":74,"cut":false,"hidden":false,"merged":[[22,174,22,175],[22,172,22,173],[22,170,22,171],[22,168,22,169],[22,166,22,167],[47,18,47,34],[0,0,0,3],[1,0,1,3],[22,158,22,159],[22,156,22,157],[22,154,22,155],[22,152,22,153],[22,150,22,151],[19,18,19,34],[19,139,19,142],[22,164,22,165],[22,162,22,163],[22,160,22,161],[21,143,21,144],[22,146,22,147],[22,148,22,149]]}
["Mix Type"]
[{"$f":"VLOOKUP(Stuff!C27,Stuff!A28:B53,2)","v":" "}]
["Sieve (in)","% Pass","LSL","USL"]
["2\"",{"$f":"'JMF1'!I43","v":""},{"$f":"VLOOKUP(Stuff!$C$27,'45'!$S$50:$AI$74,3)","v":0},{"$f":"VLOOKUP(Stuff!$C$27,'45'!$S$23:$AI$47,3)","v":0}]
["1.5\"",{"$f":"'JMF1'!I44","v":""},{"$f":"VLOOKUP(Stuff!$C$27,'45'!$S$50:$AI$74,4)","v":0},{"$f":"VLOOKUP(Stuff!$C$27,'45'!$S$23:$AI$47,4)","v":0}]
["1.25\"",{"$f":"'JMF1'!I45","v":""},{"$f":"VLOOKUP(Stuff!$C$27,'45'!$S$50:$AI$74,5)","v":0},{"$f":"VLOOKUP(Stuff!$C$27,'45'!$S$23:$AI$47,5)","v":0}]
["1\"",{"$f":"'JMF1'!I46","v":""},{"$f":"VLOOKUP(Stuff!$C$27,'45'!$S$50:$AI$74,6)","v":0},{"$f":"VLOOKUP(Stuff!$C$27,'45'!$S$23:$AI$47,6)","v":0}]
["3/4\"",{"$f":"'JMF1'!I47","v":""},{"$f":"VLOOKUP(Stuff!$C$27,'45'!$S$50:$AI$74,7)","v":0},{"$f":"VLOOKUP(Stuff!$C$27,'45'!$S$23:$AI$47,7)","v":0}]
["5/8\"",{"$f":"'JMF1'!I48","v":""},{"$f":"VLOOKUP(Stuff!$C$27,'45'!$S$50:$AI$74,8)","v":0},{"$f":"VLOOKUP(Stuff!$C$27,'45'!$S$23:$AI$47,8)","v":0}]
["1/2\"",{"$f":"'JMF1'!I49","v":""},{"$f":"VLOOKUP(Stuff!$C$27,'45'!$S$50:$AI$74,9)","v":0},{"$f":"VLOOKUP(Stuff!$C$27,'45'!$S$23:$AI$47,9)","v":0}]
["3/8\"",{"$f":"'JMF1'!I50","v":""},{"$f":"VLOOKUP(Stuff!$C$27,'45'!$S$50:$AI$74,10)","v":0},{"$f":"VLOOKUP(Stuff!$C$27,'45'!$S$23:$AI$47,10)","v":0}]
["No.4",{"$f":"'JMF1'!I51","v":""},{"$f":"VLOOKUP(Stuff!$C$27,'45'!$S$50:$AI$74,11)","v":0},{"$f":"VLOOKUP(Stuff!$C$27,'45'!$S$23:$AI$47,11)","v":0}]
["No.8",{"$f":"'JMF1'!I52","v":""},{"$f":"VLOOKUP(Stuff!$C$27,'45'!$S$50:$AI$74,12)","v":0},{"$f":"VLOOKUP(Stuff!$C$27,'45'!$S$23:$AI$47,12)","v":0}]
["No.16",{"$f":"'JMF1'!I53","v":""},{"$f":"VLOOKUP(Stuff!$C$27,'45'!$S$50:$AI$74,13)","v":0},{"$f":"VLOOKUP(Stuff!$C$27,'45'!$S$23:$AI$47,13)","v":0}]
["No.30",{"$f":"'JMF1'!I54","v":""},{"$f":"VLOOKUP(Stuff!$C$27,'45'!$S$50:$AI$74,14)","v":0},{"$f":"VLOOKUP(Stuff!$C$27,'45'!$S$23:$AI$47,14)","v":0}]
["No.50",{"$f":"'JMF1'!I55","v":""},{"$f":"VLOOKUP(Stuff!$C$27,'45'!$S$50:$AI$74,15)","v":0},{"$f":"VLOOKUP(Stuff!$C$27,'45'!$S$23:$AI$47,15)","v":0}]
["No.100",{"$f":"'JMF1'!I56","v":""},{"$f":"VLOOKUP(Stuff!$C$27,'45'!$S$50:$AI$74,16)","v":0},{"$f":"VLOOKUP(Stuff!$C$27,'45'!$S$23:$AI$47,16)","v":0}]
["No.200",{"$f":"'JMF1'!I57","v":""},{"$f":"VLOOKUP(Stuff!$C$27,'45'!$S$50:$AI$74,17)","v":0},{"$f":"VLOOKUP(Stuff!$C$27,'45'!$S$23:$AI$47,17)","v":0}]
[]
[null,null,null,null,null,null,null,null,null,null,null,null,null,null,null,null,null,null,"UPPER SPECIFICATION LIMITS",null,null,null,null,null,null,null,null,null,null,null,null,null,null,null,null,null,null,null,"Sieve Size(mm)^0.45",null,null,null,null,null,null,null,null,null,null,null,null,null,null,null,null,null,null,null,null,null,null,null,null,"LSL",null,null,null,null,null,null,null,null,null,null,null,null,null,null,null,null,null,null,null,null,null,null,null,null,"USL",null,null,null,null,null,null,null,null,null,null,null,null,null,null,null,null,null,null,null,null,null,null,null,null,"BLEND"]
[null,null,null,null,null,null,null,null,null,null,null,null,null,null,null,null,null,null,null,null,"2.0\"","1.5\"","1.25\"","1\"","3/4\"","5/8\"","1/2\"","3/8\"","#4","#8","#16","#30","#50","#100","#200",null,null,null,1,2,3,4,5,6,7,8,9,10,11,12,13,14,15,16,17,18,19,20,21,22,23,24,25,1,2,3,4,5,6,7,8,9,10,11,12,13,14,15,16,17,18,19,20,21,22,23,24,25,1,2,3,4,5,6,7,8,9,10,11,12,13,14,15,16,17,18,19,20,21,22,23,24,25,1,2,3,4,5,6,7,8,9,10,11,12,13,14,15,16,17,18,19,20,21,22,23,24,25]
[null,null,null,null,null,null,null,null,null,null,null,null,null,null,null,null,null,null,null,"Sieve^0.45",5.8148230317277987,5.1087431744234335,4.7060000000000004,4.2569999999999997,3.762,3.4430000000000001,3.1160000000000001,2.754,2.016,1.472,1.077,0.79500000000000004,0.58199999999999996,0.42599999999999999,0.312,null,null,null,null,"A","AS","ACRL","B","BM","BM2","C","CW","CS","CAM","TPB","D","E","Es","TL","TLD","OGFC","OGFCs","CM","NC (A)","NC (B)","NC (C) ","SMA","TLE",null,"A","AS","ACRL","B","BM","BM2","C","CW","CS","CAM","TPB","D","E","Es","TL","TLD","OGFC","OGFCs","CM","NC (A)","NC (B)","NC (C)","SMA","TLE",null,"A","AS","ACRL","B","BM","BM2","C","CW","CS","CAM","TPB","D","E","Es","TL","TLD","OGFC","OGFCs","CM","NC (A)","NC (B)","NC (C) ","SMA","TLE",null,"A","AS","ACRL","B","BM","BM2","C","CW","CS","CAM","TPB","D","E","Es","TL","TLD","OGFC","OGFCs","CM","NC (A)","NC (B)","NC (C) ","SMA","TLE",null,"X","LSL","USL","BLEND","MDL",null,null,"SIEVE GRID LINES"]
[null,null,null,null,null,null,null,null,null,null,null,null,null,null,null,null,null,null,1," ",null,null,null,null,null,null,null,null,null,null,null,null,null,null,null,null,null,3,null,5.8148230317277987,5.8148230317277987,5.8148230317277987,5.8148230317277987,4.2566996126039234,4.7063314504370792,3.7621761023862978,3.7621761023862978,2.754074108566122,3.7621761023862978,5.8148230317277987,3.4427546160074298,3.4427546160074298,3.4427546160074298,2.754074108566122,3.116086507375345,3.762,3.762,3.7621761023862978,2.754,3.4430000000000001,3.762,3.762,3.116086507375345,null,null,null,null,null,null,null,null,null,null,null,null,null,null,null,null,null,null,null,null,null,null,null,null,null,null,100,100,100,100,100,100,100,100,100,100,100,100,100,100,100,100,100,100,100,100,100,100,100,100,null,{"$f":"B4","v":""},{"$f":"B4","v":""},{"$f":"B4","v":""},{"$f":"B4","v":""},{"$f":"B7","v":""},{"$f":"B6","v":""},{"$f":"B8","v":""},{"$f":"B8","v":""},{"$f":"B11","v":""},{"$f":"B8","v":""},{"$f":"B4","v":""},{"$f":"B9","v":""},{"$f":"B9","v":""},{"$f":"B9","v":""},{"$f":"B11","v":""},{"$f":"B10","v":""},{"$f":"B8","v":""},{"$f":"B8","v":""},{"$f":"B8","v":""},{"$f":"B11","v":""},{"$f":"B9","v":""},{"$f":"B8","v":""},100,{"$f":"B10","v":""},null,{"$f":"HLOOKUP(Stuff!$C$27,'45'!$AM$21:$BK$32,AL23)","v":0},{"$f":"HLOOKUP(Stuff!$C$27,'45'!$BL$21:$CJ$32,AL23)","v":0},{"$f":"HLOOKUP(Stuff!$C$27,'45'!$CK$21:$DI$32,AL23)","v":0},{"$f":"HLOOKUP(Stuff!$C$27,'45'!$DJ$21:$EH$32,'45'!AL23)","v":0},0,0,null,"2.0\"",null,"1.5\"",null,"1.25\"",null,"1.0\"",null,"3/4\"",null,"5/8\"",null,"1/2\"",null,"3/8\"",null,4,null,8,null,16,null,30,null,50,null,100,null,200]
[null,null,null,null,null,null,null,null,null,null,null,null,null,null,null,null,null,null,2,"307-A",100,100,null,null,71,null,null,50,36,27,null,17,null,10,4.5,null,null,4,null,5.1087431744234335,5.1087431744234335,5.1087431744234335,5.1087431744234335,3.7621761023862978,3.7621761023862978,2.754074108566122,2.754074108566122,2.0161002539629291,2.754,5.1087431744234335,3.116086507375345,3.116086507375345,3.116086507375345,2.0161002539629291,2.754074108566122,3.1160000000000001,3.1160000000000001,2.754074108566122,2.016,3.1160000000000001,3.1160000000000001,3.1160000000000001,2.754074108566122,null,81,75,80,95,85,81,70,75,89,75,70,95,95,95,89,90,85,85,75,40,95,75,90,90,null,100,100,93,100,100,93,90,100,94,100,100,100,100,100,94,100,100,100,100,55,100,100,100,100,null,{"$f":"B5","v":""},{"$f":"B5","v":""},{"$f":"B5","v":""},{"$f":"B5","v":""},{"$f":"B8","v":""},{"$f":"B8","v":""},{"$f":"B11","v":""},{"$f":"B11","v":""},{"$f":"B12","v":""},{"$f":"B11","v":""},{"$f":"B5","v":""},{"$f":"B10","v":""},{"$f":"B10","v":""},{"$f":"B10","v":""},{"$f":"B12","v":""},{"$f":"B11","v":""},{"$f":"B10","v":""},{"$f":"B10","v":""},{"$f":"B11","v":""},{"$f":"B12","v":""},{"$f":"B10","v":""},{"$f":"B10","v":""},93,{"$f":"B11","v":""},null,{"$f":"HLOOKUP(Stuff!$C$27,'45'!$AM$21:$BK$32,AL24)","v":0},{"$f":"HLOOKUP(Stuff!$C$27,'45'!$BL$21:$CJ$32,AL24)","v":0},{"$f":"HLOOKUP(Stuff!$C$27,'45'!$CK$21:$DI$32,AL24)","v":0},{"$f":"HLOOKUP(Stuff!$C$27,'45'!$DJ$21:$EH$32,'45'!AL24)","v":0},{"$f":"EJ23","v":0},100,null,5.8148230317277987,0,5.1087431744234335,0,4.7060000000000004,0,4.2569999999999997,0,3.762,0,3.4430000000000001,0,3.1160000000000001,0,2.754,0,2.016,0,1.472,0,1.077,0,0.79500000000000004,0,0.58199999999999996,0,0.42599999999999999,0,0.312,0]
[null,null,null,null,null,null,null,null,null,null,null,null,null,null,null,null,null,null,3,"307-AS",100,100,null,null,80,null,null,null,11,null,null,null,null,6,4.5,null,null,5,null,3.762,3.762,3.762,3.762,2.754074108566122,2.754074108566122,2.0161002539629291,1.4716698795820382,1.4716698795820382,2.016,3.762,2.754074108566122,2.754074108566122,2.754074108566122,1.4716698795820382,2.0161002539629291,2.754,2.754,1.4716698795820382,1.472,2.754,2.754,2.754,2.0161002539629291,null,50,55,60,70,59,57,39,43,53,0,55,80,80,80,53,54,55,55,35,22,75,50,50,54,null,71,80,75,85,79,73,66,67,77,100,80,93,93,93,77,76,75,75,57,32,100,80,80,76,null,{"$f":"B8","v":""},{"$f":"B8","v":""},{"$f":"B8","v":""},{"$f":"B8","v":""},{"$f":"B11","v":""},{"$f":"B11","v":""},{"$f":"B12","v":""},{"$f":"B13","v":""},{"$f":"B13","v":""},{"$f":"B12","v":""},{"$f":"B8","v":""},{"$f":"B11","v":""},{"$f":"B11","v":""},{"$f":"B11","v":""},{"$f":"B13","v":""},{"$f":"B12","v":""},{"$f":"B11","v":""},{"$f":"B11","v":""},{"$f":"B13","v":""},"","",{"$f":"B11","v":""},68,{"$f":"B12","v":""},null,{"$f":"HLOOKUP(Stuff!$C$27,'45'!$AM$21:$BK$32,AL25)","v":0},{"$f":"HLOOKUP(Stuff!$C$27,'45'!$BL$21:$CJ$32,AL25)","v":0},{"$f":"HLOOKUP(Stuff!$C$27,'45'!$CK$21:$DI$32,AL25)","v":0},{"$f":"HLOOKUP(Stuff!$C$27,'45'!$DJ$21:$EH$32,'45'!AL25)","v":0}," - "," - ",null,5.8148230317277987,100,5.1087431744234335,100,4.7060000000000004,100,4.2569999999999997,100,3.762,100,3.4430000000000001,100,3.1160000000000001,100,2.754,100,2.016,100,1.472,100,1.077,100,0.79500000000000004,100,0.58199999999999996,100,0.42599999999999999,100,0.312,100]
[null,null,null,null,null,null,null,null,null,null,null,null,null,null,null,null,null,null,4,"307-ACRL",100,93,null,null,75,null,null,null,16,null,null,null,null,4,3.5,null,null,6,null,2.754,2.016,2.016,2.754,2.0161002539629291,2.0161002539629291,1.4716698795820382,0.79463568224020453,0.79463568224020453,1.472,2.016,2.0161002539629291,2.0161002539629291,2.0161002539629291,0.79463568224020453,1.4716698795820382,2.016,2.016,0.79463568224020453,1.077,2.016,2.016,2.016,1.4716698795820382,null,35,7,12,49,42,40,23,23,23,0,0,54,54,54,23,35,10,10,18,15,25,25,20,35,null,50,11,16,72,61,56,47,47,42,100,11,76,76,76,42,57,25,25,35,25,38,38,35,57,null,{"$f":"B11","v":""},{"$f":"B12","v":""},{"$f":"B12","v":""},{"$f":"B11","v":""},{"$f":"B12","v":""},{"$f":"B12","v":""},{"$f":"B13","v":""},{"$f":"B15","v":""},{"$f":"B15","v":""},{"$f":"B13","v":""},{"$f":"B12","v":""},{"$f":"B12","v":""},{"$f":"B12","v":""},{"$f":"B12","v":""},{"$f":"B15","v":""},{"$f":"B13","v":""},{"$f":"B12","v":""},{"$f":"B12","v":""},{"$f":"B15","v":""},"","","",16,{"$f":"B13","v":""},null,{"$f":"HLOOKUP(Stuff!$C$27,'45'!$AM$21:$BK$32,AL26)","v":0},{"$f":"HLOOKUP(Stuff!$C$27,'45'!$BL$21:$CJ$32,AL26)","v":0},{"$f":"HLOOKUP(Stuff!$C$27,'45'!$CK$21:$DI$32,AL26)","v":0},{"$f":"HLOOKUP(Stuff!$C$27,'45'!$DJ$21:$EH$32,'45'!AL26)","v":0}," - "," - "]
[null,null,null,null,null,null,null,null,null,null,null,null,null,null,null,null,null,null,5,"307-B",100,100,null,null,85,null,null,72,51,42,null,22,14,10,6.5,null,null,7,null,2.016,0.42599999999999999,0.42599999999999999,2.016,1.4716698795820382,1.4716698795820382,0.79463568224020453,0.42583471830473674,0.42583471830473674,1.077,0.42599999999999999,1.4716698795820382,1.4716698795820382,1.4716698795820382,0.42583471830473674,0.79463568224020453,1.472,1.472,0.42583471830473674,0.79500000000000004,1.472,1.472,1.472,0.79463568224020453,null,24,0,0,34,29,28,10,4,9,null,0,35,35,35,9,17,5,5,4,10,19,19,16,17,null,36,6,4,51,47,43,27,10,18,100,4,57,57,57,18,33,10,10,10,18,27,27,24,33,null,{"$f":"B12","v":""},{"$f":"B17","v":""},{"$f":"B17","v":""},{"$f":"B12","v":""},{"$f":"B13","v":""},{"$f":"B13","v":""},{"$f":"B15","v":""},{"$f":"B17","v":""},{"$f":"B17","v":""},"",{"$f":"B17","v":""},{"$f":"B13","v":""},{"$f":"B13","v":""},{"$f":"B13","v":""},{"$f":"B17","v":""},{"$f":"B15","v":""},{"$f":"B13","v":""},{"$f":"B13","v":""},{"$f":"B17","v":""},"","","",7,{"$f":"B15","v":""},null,{"$f":"HLOOKUP(Stuff!$C$27,'45'!$AM$21:$BK$32,AL27)","v":0},{"$f":"HLOOKUP(Stuff!$C$27,'45'!$BL$21:$CJ$32,AL27)","v":0},{"$f":"HLOOKUP(Stuff!$C$27,'45'!$CK$21:$DI$32,AL27)","v":0},{"$f":"HLOOKUP(Stuff!$C$27,'45'!$DJ$21:$EH$32,'45'!AL27)","v":0}," - "," - "]
[null,null,null,null,null,null,null,null,null,null,null,null,null,null,null,null,null,null,6,"307-BM",null,null,null,100,100,null,null,79,61,47,null,27,20,10,6.5,null,null,8,null,1.472,0.312,0.312,1.472,0.79463568224020453,0.79463568224020453,0.58170736792793831,0.31172925995349998,0.31172925995349998,0.73499999999999999,0.312,0.79463568224020453,0.79463568224020453,0.79463568224020453,0.31172925995349998,0.58170736792793831,0.312,0.312,0.31172925995349998,0.58199999999999996,1.077,1.077,0.312,0.58170736792793831,null,13,0,0,23,13,13,8,2.5,6,null,0,17,17,17,6,10,2,2,2.5,8,15,15,8,10,null,27,4.5,3.5,42,27,25,15,6.5,13.5,100,3,29,29,29,13.5,18,4,4,6.5,13,23,23,11,18,null,{"$f":"B13","v":""},{"$f":"B18","v":""},{"$f":"B18","v":""},{"$f":"B13","v":""},{"$f":"B15","v":""},{"$f":"B15","v":""},{"$f":"B16","v":""},{"$f":"B18","v":""},{"$f":"B18","v":""},"",{"$f":"B18","v":""},{"$f":"B15","v":""},{"$f":"B15","v":""},{"$f":"B15","v":""},{"$f":"B18","v":""},{"$f":"B16","v":""},{"$f":"B18","v":""},{"$f":"B18","v":""},{"$f":"B18","v":""},"","","",4,{"$f":"B16","v":""},null,{"$f":"HLOOKUP(Stuff!$C$27,'45'!$AM$21:$BK$32,AL28)","v":0},{"$f":"HLOOKUP(Stuff!$C$27,'45'!$BL$21:$CJ$32,AL28)","v":0},{"$f":"HLOOKUP(Stuff!$C$27,'45'!$CK$21:$DI$32,AL28)","v":0},{"$f":"HLOOKUP(Stuff!$C$27,'45'!$DJ$21:$EH$32,'45'!AL28)","v":0}," - "," - "]
[null,null,null,null,null,null,null,null,null,null,null,null,null,null,null,null,null,null,7,"307-BM2",null,null,100,null,93,null,null,73,56,43,null,25,19,10,6.5,null,null,9,null,0.79500000000000004,null,null,0.79500000000000004,0.58170736792793831,0.58170736792793831,0.42583471830473674,null,null,0.58199999999999996,null,0.58170736792793831,0.58170736792793831,0.58170736792793831,null,0.42583471830473674,null,null,null,0.42599999999999999,0.79500000000000004,0.79500000000000004,null,0.42583471830473674,null,7,null,null,11,7,9,4,null,null,null,null,10,10,10,null,3,null,null,null,6,10,10,null,3,null,17,null,null,22,20,19,8,null,null,100,null,18,18,18,null,10,null,null,null,10,18,18,null,10,null,{"$f":"B15","v":""},null,null,{"$f":"B15","v":""},{"$f":"B16","v":""},{"$f":"B16","v":""},{"$f":"B17","v":""},null,null,"",null,{"$f":"B16","v":""},{"$f":"B16","v":""},{"$f":"B16","v":""},null,{"$f":"B17","v":""},null,null,null,"","","",null,{"$f":"B17","v":""},null,{"$f":"HLOOKUP(Stuff!$C$27,'45'!$AM$21:$BK$32,AL29)","v":0},{"$f":"HLOOKUP(Stuff!$C$27,'45'!$BL$21:$CJ$32,AL29)","v":0},{"$f":"HLOOKUP(Stuff!$C$27,'45'!$CK$21:$DI$32,AL29)","v":0},{"$f":"HLOOKUP(Stuff!$C$27,'45'!$DJ$21:$EH$32,'45'!AL29)","v":0}," - "," - ",null,"2.0\"",5.8148230317277987]
[null,null,null,null,null,null,null,null,null,null,null,null,null,null,null,null,null,null,8,"307-C",null,null,null,null,100,null,null,90,66,47,null,27,15,8,6.5,null,null,10,null,0.42599999999999999,null,null,0.58199999999999996,0.42583471830473674,0.42583471830473674,0.31172925995349998,null,null,0.42599999999999999,null,0.42583471830473674,0.42583471830473674,0.42583471830473674,null,0.31172925995349998,null,null,null,0.312,0.58199999999999996,0.58199999999999996,null,0.31172925995349998,null,0,null,null,9,4,6,2.5,null,null,null,null,3,3,3,null,4,null,null,null,4,8,8,null,4,null,10,null,null,14,10,10,6.5,null,null,100,null,10,11,11,null,7,null,null,null,6,13,13,null,7,null,{"$f":"B17","v":""},null,null,{"$f":"B16","v":""},{"$f":"B17","v":""},{"$f":"B17","v":""},{"$f":"B18","v":""},null,null,"",null,{"$f":"B17","v":""},{"$f":"B17","v":""},{"$f":"B17","v":""},null,{"$f":"B18","v":""},null,null,null,"","","",null,{"$f":"B18","v":""},null,{"$f":"HLOOKUP(Stuff!$C$27,'45'!$AM$21:$BK$32,AL30)","v":0},{"$f":"HLOOKUP(Stuff!$C$27,'45'!$BL$21:$CJ$32,AL30)","v":0},{"$f":"HLOOKUP(Stuff!$C$27,'45'!$CK$21:$DI$32,AL30)","v":0},{"$f":"HLOOKUP(Stuff!$C$27,'45'!$DJ$21:$EH$32,'45'!AL30)","v":0}," - "," - ",null,"1.5\"",5.1087431744234335]
[null,null,null,null,null,null,null,null,null,null,null,null,null,null,null,null,null,null,9,"307-CW",null,null,null,null,100,null,null,100,null,67,null,47,null,10,6.5,null,null,11,null,0.312,null,null,0.42599999999999999,0.31172925995349998,0.31172925995349998,null,null,null,0.312,null,0.31172925995349998,0.31172925995349998,0.31172925995349998,null,null,null,null,null,null,0.42599999999999999,0.42599999999999999,null,null,null,0,null,null,4,0,2.5,null,null,null,null,null,0,0,0,null,null,null,null,null,null,6,6,null,null,null,4.5,null,null,10,6.5,6.5,null,null,null,100,null,6.5,8,8,null,null,null,null,null,null,10,10,null,null,null,{"$f":"B18","v":""},null,null,{"$f":"B17","v":""},{"$f":"B18","v":""},{"$f":"B18","v":""},null,null,null,"",null,{"$f":"B18","v":""},{"$f":"B18","v":""},{"$f":"B18","v":""},null,null,null,null,null,null,"","",null,null,null,{"$f":"HLOOKUP(Stuff!$C$27,'45'!$AM$21:$BK$32,AL31)","v":0},{"$f":"HLOOKUP(Stuff!$C$27,'45'!$BL$21:$CJ$32,AL31)","v":0},{"$f":"HLOOKUP(Stuff!$C$27,'45'!$CK$21:$DI$32,AL31)","v":0},{"$f":"HLOOKUP(Stuff!$C$27,'45'!$DJ$21:$EH$32,'45'!AL31)","v":0}," - "," - ",null,"1.25\"",4.7060000000000004]
[null,null,null,null,null,null,null,null,null,null,null,null,null,null,null,null,null,null,10,"307-CS",null,null,null,null,null,null,null,100,94,77,null,42,null,18,13.5,null,null,12,null,null,null,null,0.312,null,null,null,null,null,null,null,null,null,null,null,null,null,null,null,null,0.312,0.312,null,null,null,null,null,null,2.5,null,null,null,null,null,null,null,null,null,null,null,null,null,null,null,null,4,4,null,null,null,null,null,null,6.5,null,null,null,null,null,null,null,null,null,null,null,null,null,null,null,null,6,6,null,null,null,null,null,null,{"$f":"B18","v":""},null,null,null,null,null,null,null,null,null,null,null,null,null,null,null,null,"","",null,null,null,{"$f":"HLOOKUP(Stuff!$C$27,'45'!$AM$21:$BK$32,AL32)","v":0},{"$f":"HLOOKUP(Stuff!$C$27,'45'!$BL$21:$CJ$32,AL32)","v":0},{"$f":"HLOOKUP(Stuff!$C$27,'45'!$CK$21:$DI$32,AL32)","v":0},{"$f":"HLOOKUP(Stuff!$C$27,'45'!$DJ$21:$EH$32,'45'!AL32)","v":0},null,null,null,"1.0\"",4.2569999999999997]
[null,null,null,null,null,null,null,null,null,null,null,null,null,null,null,null,null,null,11,"307-CAM",null,null,null,null,100,null,null,100]
[null,null,null,null,null,null,null,null,null,null,null,null,null,null,null,null,null,null,12,"313-TPB",100,100,null,null,80,null,null,null,11,null,null,null,null,4,3,null,null,null,null,null,null,null,null,null,null,null,null,null,null,null,null,null,null,null,null,null,null,null,null,null,null,null,null,null,null,null,null,null,null,null,null,null,null,null,null,null,null,null,null,null,null,null,null,null,null,null,null,null,null,null,null,null,null,null,null,null,null,null,null,null,null,null,null,null,null,null,null,null,null,null,null,null,null,null,null,null,null,null,null,null,null,null,null,null,null,null,null,null,null,null,null,null,null,null,null,null,null,null,null,null,null,null,null,null,null,null,"3/4\"",3.762]
[null,null,null,null,null,null,null,null,null,null,null,null,null,null,null,null,null,null,13,"411-D",null,null,null,null,null,100,100,93,76,57,null,29,18,10,6.5,null,null,null,null,null,null,null,null,null,null,null,null,null,null,null,null,null,null,null,null,null,null,null,null,null,null,null,null,null,null,null,null,null,null,null,null,null,null,null,null,null,null,null,null,null,null,null,null,null,null,null,null,null,null,null,null,null,null,null,null,null,null,null,null,null,null,null,null,null,null,null,null,null,null,null,null,null,null,null,null,null,null,null,null,null,null,null,null,null,null,null,null,null,null,null,null,null,null,null,null,null,null,null,null,null,null,null,null,null,null,null,"5/8\"",3.4430000000000001]
[null,null,null,null,null,null,null,null,null,null,null,null,null,null,null,null,null,null,14,"411-E",null,null,null,null,null,100,100,93,76,57,null,29,18,11,8,null,null,null,null,null,null,null,null,null,null,null,null,null,null,null,null,null,null,null,null,null,null,null,null,null,null,null,null,null,null,null,null,null,null,null,null,null,null,null,null,null,null,null,null,null,null,null,null,null,null,null,null,null,null,null,null,null,null,null,null,null,null,null,null,null,null,null,null,null,null,null,null,null,null,null,null,null,null,null,null,null,null,null,null,null,null,null,null,null,null,null,null,null,null,null,null,null,null,null,null,null,null,null,null,null,null,null,null,null,null,null,"1/2\"",3.1160000000000001]
[null,null,null,null,null,null,null,null,null,null,null,null,null,null,null,null,null,null,15,"411-E (shoulders)",null,null,null,null,null,100,100,93,76,57,null,29,18,11,8,null,null,null,null,null,null,null,null,null,null,null,null,null,null,null,null,null,null,null,null,null,null,null,null,null,null,null,null,null,null,null,null,null,null,null,null,null,null,null,null,null,null,null,null,null,null,null,null,null,null,null,null,null,null,null,null,null,null,null,null,null,null,null,null,null,null,null,null,null,null,null,null,null,null,null,null,null,null,null,null,null,null,null,null,null,null,null,null,null,null,null,null,null,null,null,null,null,null,null,null,null,null,null,null,null,null,null,null,null,null,null,"3/8\"",2.754]
[null,null,null,null,null,null,null,null,null,null,null,null,null,null,null,null,null,null,16,"411-TL",null,null,null,null,null,null,null,100,94,77,null,42,null,18,14,null,null,null,null,null,null,null,null,null,null,null,null,null,null,null,null,null,null,null,null,null,null,null,null,null,null,null,null,null,null,null,null,null,null,null,null,null,null,null,null,null,null,null,null,null,null,null,null,null,null,null,null,null,null,null,null,null,null,null,null,null,null,null,null,null,null,null,null,null,null,null,null,null,null,null,null,null,null,null,null,null,null,null,null,null,null,null,null,null,null,null,null,null,null,null,null,null,null,null,null,null,null,null,null,null,null,null,null,null,null,null,4,2.016]
[null,null,null,null,null,null,null,null,null,null,null,null,null,null,null,null,null,null,17,"411-TLD",null,null,null,null,null,null,100,100,76,57,null,33,18,10,7,null,null,null,null,null,null,null,null,null,null,null,null,null,null,null,null,null,null,null,null,null,null,null,null,null,null,null,null,null,null,null,null,null,null,null,null,null,null,null,null,null,null,null,null,null,null,null,null,null,null,null,null,null,null,null,null,null,null,null,null,null,null,null,null,null,null,null,null,null,null,null,null,null,null,null,null,null,null,null,null,null,null,null,null,null,null,null,null,null,null,null,null,null,null,null,null,null,null,null,null,null,null,null,null,null,null,null,null,null,null,null,8,1.472]
[null,null,null,null,null,null,null,null,null,null,null,null,null,null,null,null,null,null,18,"411-OGFC",null,null,null,null,100,null,100,75,25,10,null,null,null,null,4,null,null,null,null,null,null,null,null,null,null,null,null,null,null,null,null,null,null,null,null,null,null,null,null,null,null,null,null,null,null,null,null,null,null,null,null,null,null,null,null,null,null,null,null,null,null,null,null,null,null,null,null,null,null,null,null,null,null,null,null,null,null,null,null,null,null,null,null,null,null,null,null,null,null,null,null,null,null,null,null,null,null,null,null,null,null,null,null,null,null,null,null,null,null,null,null,null,null,null,null,null,null,null,null,null,null,null,null,null,null,null,16,1.077]
[null,null,null,null,null,null,null,null,null,null,null,null,null,null,null,null,null,null,19,"411-OGFC(shoulders)",null,null,null,null,100,null,100,75,25,10,null,null,null,null,4,null,null,null,null,null,null,null,null,null,null,null,null,null,null,null,null,null,null,null,null,null,null,null,null,null,null,null,null,null,null,null,null,null,null,null,null,null,null,null,null,null,null,null,null,null,null,null,null,null,null,null,null,null,null,null,null,null,null,null,null,null,null,null,null,null,null,null,null,null,null,null,null,null,null,null,null,null,null,null,null,null,null,null,null,null,null,null,null,null,null,null,null,null,null,null,null,null,null,null,null,null,null,null,null,null,null,null,null,null,null,null,30,0.79500000000000004]
[null,null,null,null,null,null,null,null,null,null,null,null,null,null,null,null,null,null,20,"307-CM",null,null,null,null,100,null,null,100,null,57,null,35,null,10,6.5]
[null,null,null,null,null,null,null,null,null,null,null,null,null,null,null,null,null,null,21,"411-NC (A)",null,null,null,null,null,null,null,100,55,32,25,18,13,10,6,null,null,null,null,null,null,null,null,null,null,null,null,null,null,null,null,null,null,null,null,null,null,null,null,null,null,null,null,null,null,null,null,null,null,null,null,null,null,null,null,null,null,null,null,null,null,null,null,null,null,null,null,null,null,null,null,null,null,null,null,null,null,null,null,null,null,null,null,null,null,null,null,null,null,null,null,null,null,null,null,null,null,null,null,null,null,null,null,null,null,null,null,null,null,null,null,null,null,null,null,null,null,null,null,null,null,null,null,null,null,null,50,0.58199999999999996]
[null,null,null,null,null,null,null,null,null,null,null,null,null,null,null,null,null,null,22,"411-NC (B)",null,null,null,null,null,100,100,100,38,27,23,18,13,10,6,null,null,null,null,null,null,null,null,null,null,null,null,null,null,null,null,null,null,null,null,null,null,null,null,null,null,null,null,null,null,null,null,null,null,null,null,null,null,null,null,null,null,null,null,null,null,null,null,null,null,null,null,null,null,null,null,null,null,null,null,null,null,null,null,null,null,null,null,null,null,null,null,null,null,null,null,null,null,null,null,null,null,null,null,null,null,null,null,null,null,null,null,null,null,null,null,null,null,null,null,null,null,null,null,null,null,null,null,null,null,null,100,0.42599999999999999]
[null,null,null,null,null,null,null,null,null,null,null,null,null,null,null,null,null,null,23,"411-NC (C)",null,null,null,null,100,null,100,80,38,27,23,18,13,10,6,null,null,null,null,null,null,null,null,null,null,null,null,null,null,null,null,null,null,null,null,null,null,null,null,null,null,null,null,null,null,null,null,null,null,null,null,null,null,null,null,null,null,null,null,null,null,null,null,null,null,null,null,null,null,null,null,null,null,null,null,null,null,null,null,null,null,null,null,null,null,null,null,null,null,null,null,null,null,null,null,null,null,null,null,null,null,null,null,null,null,null,null,null,null,null,null,null,null,null,null,null,null,null,null,null,null,null,null,null,null,null,200,0.312]
[null,null,null,null,null,null,null,null,null,null,null,null,null,null,null,null,null,null,24,"411-SMA",null,null,null,null,100,null,100,80,35,24,null,null,null,null,11,null,null,null,null,null,null,null,null,null,null,null,null,null,null,null,null,null,null,null,null,null,null,null,null,null,null,null,null,null,null,null,null,null,null,null,null,null,null,null,null,null,null,null,null,null,null,null,null,null,null,null,null,null,null,null,null,null,null,null,null,null,null,null,null,null,null,null,null,null,null,null,null,null,null,null,null,null,null,null,null,null,null,null,null,null,null,null,null,null,null,null,null,null,null,null,null,null,null,null,null,null,null,null,null,null,null,null,null,null,null,null,null,0]
[null,null,null,null,null,null,null,null,null,null,null,null,null,null,null,null,null,null,25,"411-TLE",null,null,null,null,null,null,100,100,76,57,null,33,18,10,7]
[null,null,null,null,null,null,null,null,null,null,null,null,null,null,null,null,null,null,"LOWER SPECIFICATION LIMITS"]
[null,null,null,null,null,null,null,null,null,null,null,null,null,null,null,null,null,null,null,null,"2.0\"","1.5\"","1.25\"","1\"","3/4\"","5/8\"","1/2\"","3/8\"","#4","#8","#16","#30","#50","#100","#200"]
[null,null,null,null,null,null,null,null,null,null,null,null,null,null,null,null,null,null,1," "]
[null,null,null,null,null,null,null,null,null,null,null,null,null,null,null,null,null,null,2,"307-A",null,81,null,null,50,null,null,35,24,13,null,7,null,0,0]
[null,null,null,null,null,null,null,null,null,null,null,null,null,null,null,null,null,null,3,"307-AS",null,75,null,null,55,null,null,null,7,null,null,null,null,0,0]
[null,null,null,null,null,null,null,null,null,null,null,null,null,null,null,null,null,null,4,"307-ACRL",null,80,null,null,60,null,null,null,12,null,null,null,null,0,0]
[null,null,null,null,null,null,null,null,null,null,null,null,null,null,null,null,null,null,5,"307-B",null,95,null,null,70,null,null,49,34,23,null,11,9,4,2.5]
[null,null,null,null,null,null,null,null,null,null,null,null,null,null,null,null,null,null,6,"307-BM",null,null,null,null,85,null,null,59,42,29,null,13,7,4,0]
[null,null,null,null,null,null,null,null,null,null,null,null,null,null,null,null,null,null,7,"307-BM2",null,null,null,null,81,null,null,57,40,28,null,13,9,6,2.5]
[null,null,null,null,null,null,null,null,null,null,null,null,null,null,null,null,null,null,8,"307-C",null,null,null,null,null,null,null,70,39,23,null,10,8,4,2.5]
[null,null,null,null,null,null,null,null,null,null,null,null,null,null,null,null,null,null,9,"307-CW",null,null,null,null,null,null,null,75,null,43,null,23,null,4,2.5]
[null,null,null,null,null,null,null,null,null,null,null,null,null,null,null,null,null,null,10,"307-CS",null,null,null,null,null,null,null,null,89,53,null,23,null,9,6]
[null,null,null,null,null,null,null,null,null,null,null,null,null,null,null,null,null,null,11,"307-CAM",null,null,null,null,null,null,null,75]
[null,null,null,null,null,null,null,null,null,null,null,null,null,null,null,null,null,null,12,"313-TPB",null,70,null,null,55,null,null,null,null,null,null,null,null,null,0]
[null,null,null,null,null,null,null,null,null,null,null,null,null,null,null,null,null,null,13,"411-D",null,null,null,null,null,null,95,80,54,35,null,17,10,3,0]
[null,null,null,null,null,null,null,null,null,null,null,null,null,null,null,null,null,null,14,"411-E",null,null,null,null,null,null,95,80,54,35,null,17,10,3,0]
[null,null,null,null,null,null,null,null,null,null,null,null,null,null,null,null,null,null,15,"411-E (shoulders)",null,null,null,null,null,null,95,80,54,35,null,17,10,3,0]
[null,null,null,null,null,null,null,null,null,null,null,null,null,null,null,null,null,null,16,"411-TL",null,null,null,null,null,null,null,null,89,53,null,23,null,9,6]
[null,null,null,null,null,null,null,null,null,null,null,null,null,null,null,null,null,null,17,"411-TLD",null,null,null,null,null,null,null,90,54,35,null,17,10,3,4]
[null,null,null,null,null,null,null,null,null,null,null,null,null,null,null,null,null,null,18,"411-OGFC",null,null,null,null,null,null,85,55,10,5,null,null,null,null,2]
[null,null,null,null,null,null,null,null,null,null,null,null,null,null,null,null,null,null,19,"411-OGFC(shoulders)",null,null,null,null,null,null,85,55,10,5,null,null,null,null,2]
[null,null,null,null,null,null,null,null,null,null,null,null,null,null,null,null,null,null,20,"307-CM",null,null,null,null,null,null,null,75,null,35,null,18,null,4,2.5]
[null,null,null,null,null,null,null,null,null,null,null,null,null,null,null,null,null,null,21,"411-NC (A)",null,null,null,null,null,null,null,null,40,22,15,10,8,6,4]
[null,null,null,null,null,null,null,null,null,null,null,null,null,null,null,null,null,null,22,"411-NC (B)",null,null,null,null,null,null,95,75,25,19,15,10,8,6,4]
[null,null,null,null,null,null,null,null,null,null,null,null,null,null,null,null,null,null,23,"411-NC (C)",null,null,null,null,null,null,75,50,25,19,15,10,8,6,4]
[null,null,null,null,null,null,null,null,null,null,null,null,null,null,null,null,null,null,24,"411-SMA",null,null,null,null,null,null,90,50,20,16,null,null,null,null,8]
[null,null,null,null,null,null,null,null,null,null,null,null,null,null,null,null,null,null,25,"411-TLE",null,null,null,null,null,null,null,90,54,35,null,17,10,3,4]

{"sheet":"Glassy","index":6,"n_rows":25,"n_cols":12,"rows_kept":25,"cut":false,"hidden":false,"merged":[]}
["Glassy Particles (Slag)"]
["Subsection 903.11(a)(4)"]
[]
["Does mix contain slag used as coarse aggregate?",null,null,null,null,"Yes",null,null,null,null,null,2]
[null,null,null,null,null,"No"]
[]
[]
[]
[]
[]
[]
[]
[]
[]
[]
[]
[]
[]
[]
[]
[null,"Mass of Glassy Particles",null,null,null,"g"]
[null,"Total Mass of Sample Used",null,null,null,"g"]
[]
[]
[null,"% Glassy Particles =",null,null,{"$f":"IF($L$4=1,ROUND(E21/E22*100,1),\"n/a\")","v":"n/a"},"%"]

{"sheet":"Agg. S. G.","index":7,"n_rows":47,"n_cols":18,"rows_kept":47,"cut":false,"hidden":false,"merged":[[39,10,39,13]]}
["Specific Gravity and Absorption of Aggregates",null,null,null,null,null,null,null,null,"Specific Gravity and Absorption of Aggregates"]
["AASHTO T-84 AND T-85"]
["Blended Aggregates",null,null,null,null,null,null,null,null,"Stockpile Method"]
[]
["From the Job Mix Formula:",null,null,"% Passing #4 Sieve",null,null,{"$f":"Stuff!J86","v":0}]
[null,null,null,"% Retained on #4 Sieve",null,null,{"$f":"IF(G5=0,\"\",100-G5)","v":""},null,null,null,null,null,null,1]
[]
[null,null,null,null,null,null,null,null,null,null,"Material"]
["Fine Aggregate:  (-4 Matl.)  AASHTO T-84",null,null,null,null,null,null,null,null,null,"#1",{"$f":"'JMF1'!A15&\", \"&'JMF1'!E15","v":"0, 0"}]
[null,null,null,null,null,null,null,null,null,null,"#2",{"$f":"'JMF1'!A16&\", \"&'JMF1'!E16","v":"0, 0"}]
["A--Mass of Oven Dried Sample",null,null,null,null,null,"grams",null,null,null,"#3",{"$f":"'JMF1'!A17&\", \"&'JMF1'!E17","v":"0, 0"}]
["B--Mass of Flask and Water",null,null,null,null,null,"grams",null,null,null,"#4",{"$f":"'JMF1'!A18&\", \"&'JMF1'!E18","v":"0, 0"}]
["C--Mass of Flask and Water and Sample",null,null,null,null,null,"grams",null,null,null,"#5",{"$f":"'JMF1'!A19&\", \"&'JMF1'!E19","v":"0, 0"}]
["D--Mass of Saturated Surface Dried Sample",null,null,null,null,null,"grams",null,null,null,"#6",{"$f":"'JMF1'!A20&\", \"&'JMF1'!E20","v":"0, 0"}]
[null,null,null,null,null,null,null,null,null,null,"#7",{"$f":"'JMF1'!A21&\", \"&'JMF1'!E21","v":"0, 0"}]
[]
[null,null,null,null,null,{"$f":"IF(ISBLANK(F11),\"\",F11/(F12+F14-F13))","v":""},null,null,null,null,"Material","#1","#2","#3","#4","#5","#6","#7"]
[null,null,null,null,null,null,null,null,null,null,"Blended Percentage",{"$f":"'JMF1'!B42","v":0},{"$f":"'JMF1'!C42","v":0},{"$f":"'JMF1'!D42","v":0},{"$f":"'JMF1'!E42","v":0},{"$f":"'JMF1'!F42","v":0},{"$f":"'JMF1'!G42","v":0},{"$f":"'JMF1'!H42","v":0}]
[]
[null,null,null,null,null,{"$f":"IF(ISBLANK(F11),\"\",F11/(F12+F11-F13))","v":""},null,null,null,null,"Stockpile Gravities"]
[]
[null,null,null,null,null,null,null,null,null,null,"Bulk"]
[null,null,null,null,null,null,null,null,null,null,null,{"$f":"IF(ISBLANK(L22),\"0\",L18/L22)","v":"0"},{"$f":"IF(ISBLANK(M22),\"0\",M18/M22)","v":"0"},"0","0","0","0","0"]
["Coarse Aggregate:  (+4 Matl.)  AASHTO T-85",null,null,null,null,null,null,null,null,null,"Apparent"]
[null,null,null,null,null,null,null,null,null,null,null,{"$f":"IF(ISBLANK(L24),\"0\",L18/L24)","v":"0"},{"$f":"IF(ISBLANK(M24),\"0\",M18/M24)","v":"0"},"0","0","0","0","0"]
["A--Mass of Oven Dried Sample",null,null,null,null,null,"grams"]
["B--Mass of Saturated Surface Dried Sample",null,null,null,null,null,"grams"]
["C--Mass of Sample in Water",null,null,null,null,null,"grams"]
[null,null,null,null,null,null,null,null,null,null,null,"Approximate Combined Blend Specific Gravities"]
[null,null,null,{"$f":"IF(ISBLANK(F28),\"\",F26/(F27-F28))","v":""}]
[null,null,null,null,null,null,null,null,null,null,null,null,"Agg. Bulk Specific Gravity (Gsb)",{"$f":"IF(ISBLANK(L22),\"\",(100/(L23+M23+N23+O23+P23+Q23+R23)))","v":""}]
[]
[null,null,null,{"$f":"IF(ISBLANK(F28),\"\",F26/(F26-F28))","v":""},null,null,"=",{"$f":"IF(ISBLANK(F26),\"\",(F27-F26)/F26*100)","v":""},"%",null,null,null,"Agg. Apparent Specific Gravity (Gsa)",{"$f":"IF(ISBLANK(L22),\"\",(100/(L25+M25+N25+O25+P25+Q25+R25)))","v":""},{"$f":"100/(L25+M25+N25+O25+P25+Q25+R25)","v":{"$error":"#DIV/0!"}}]
[]
[null,null,null,null,null,null,null,null,null,null,null,null,"Combined Blend Absorption",{"$f":"IF(ISBLANK(L22),\"\",(100/N31-100/N33))","v":""}]
[]
["Combined Specific Gravity"]
[]
[]
[null,null,null,null,null,null,null,null,null,null,"TDOT Coarse Blend Absorption Estimate",null,null,null,{"$f":"Stuff!S85","v":{"$error":"#DIV/0!"}}]
[]
[]
["Combined Bulk Specific Gravity (Gsb)",null,null,null,{"$f":"IF(ISBLANK(F11),\"\",100/((G5/F17)+(G6/D30)))","v":""}]
[]
["Combined Apparent Specific Gravity (Gsa)",null,null,null,{"$f":"IF(ISBLANK(F28),\"\",100/((G5/F20)+(G6/D33)))","v":""}]
[]
["Combined Blend Absorption",null,null,null,{"$f":"IF(ISBLANK(F28),\"\",100/E43-100/E45)","v":""}]

{"sheet":"Fract. Face","index":8,"n_rows":23,"n_cols":12,"rows_kept":23,"cut":false,"hidden":false,"merged":[]}
["Fractured Face Count"]
["Subsection 903.11(a)(3)"]
[]
["Is Crushed Gravel used as a coarse aggregate in this mix?",null,null,null,null,null,"Yes",null,null,null,null,2]
[null,null,null,null,null,null,"No"]
[]
[]
[]
[]
[]
[]
[]
[]
[]
[null,null,null,null,null,null,"x 100"]
[]
[]
[]
[null,"No. of Particles Fractured"]
[null,"Total No. of Particles Inspected"]
[]
[]
[null,"% Fractured =",null,{"$f":"IF($L$4=1,ROUND(E19/E20*100,1),\"n/a\")","v":"n/a"},"%"]

{"sheet":"Batch","index":9,"n_rows":85,"n_cols":11,"rows_kept":85,"cut":false,"hidden":false,"merged":[[2,8,2,10],[3,9,3,10],[4,9,4,10]]}
["Worksheet for Determining the Aggregate Quantities and their"]
["Corresponding sized fractions for an Aggregate Blend"]
[null,null,null,null,null,null,null,"Mix Type",{"$f":"'JMF1'!E10","v":"  "}]
["Wt. Total Aggregate Blend",null,null,null,"grams",null,null,null,"Blend Name"]
[null,null,null,null,null,null,null,null,"Contract No.",{"$f":"'JMF1'!#REF!","v":{"$error":"#REF!"}}]
[null,"Aggregate",null,null,"% Used",null,"Wt. (gms)"]
["1)",{"$f":"'JMF1'!A15","v":0},null,null,{"$f":"'JMF1'!B42","v":0},null,{"$f":"E7*$D$4/100","v":0}]
["2)",{"$f":"'JMF1'!A16","v":0},null,null,{"$f":"'JMF1'!C42","v":0},null,{"$f":"E8*$D$4/100","v":0}]
["3)",{"$f":"'JMF1'!A17","v":0},null,null,{"$f":"'JMF1'!D42","v":0},null,{"$f":"E9*$D$4/100","v":0}]
["4)",{"$f":"'JMF1'!A18","v":0},null,null,{"$f":"'JMF1'!E42","v":0},null,{"$f":"E10*$D$4/100","v":0}]
["5)",{"$f":"'JMF1'!A19","v":0},null,null,{"$f":"'JMF1'!F42","v":0},null,{"$f":"E11*$D$4/100","v":0}]
["6)",{"$f":"'JMF1'!A20","v":0},null,null,{"$f":"'JMF1'!G42","v":0},null,{"$f":"IF('JMF1'!$C$23=0,E12*$D$4/100,$E$12*$D$4/(100-'JMF1'!$C$23))","v":0}]
["7)",{"$f":"'JMF1'!A21","v":0},null,null,{"$f":"'JMF1'!H42","v":0},null,{"$f":"IF('JMF1'!$C$24=0,E13*$D$4/100,$E$13*$D$4/(100-'JMF1'!$C$24))","v":0}]
[]
[null,"Sized",null,"%",null,"Ind. %",null,"Ind wt.",null,"Accum.","Accum."]
[null,"Fractions",null,"Passing",null,"Retained",null,"Retained",null,"wt.","wt."]
[null,"1.5\"/1.25\"",null,{"$f":"IF(Stuff!C79=0,100,Stuff!C79)","v":100},null,{"$f":"100-D17","v":0},null,{"$f":"F17*$G$7/100","v":0},null,{"$f":"IF(H17=0,\"\",ROUND(K17,1))","v":""},{"$f":"H17","v":0}]
[null,"1\"",null,{"$f":"IF(Stuff!C81=0,D17,Stuff!C81)","v":100},null,{"$f":"D17-D18","v":0},null,{"$f":"F18*$G$7/100","v":0},null,{"$f":"IF(H18=0,\"\",ROUND(K18,1))","v":""},{"$f":"K17+H18","v":0}]
[null,"3/4\"",null,{"$f":"IF(Stuff!C82=0,D18,Stuff!C82)","v":100},null,{"$f":"D18-D19","v":0},null,0,null,"",{"$f":"K18+H19","v":0}]
["1)","1/2\"",null,{"$f":"IF(Stuff!C84=0,D19,Stuff!C84)","v":100},null,0,null,0,null,"",0]
[null,"3/8\"",null,{"$f":"IF(Stuff!C85=0,D20,Stuff!C85)","v":100},null,0,null,0,null,"",0]
[null,"#4",null,{"$f":"IF(Stuff!C86=0,D21,Stuff!C86)","v":100},null,0,null,0,null,"",0]
[null,"#8",null,{"$f":"IF(Stuff!C87=0,D22,Stuff!C87)","v":100},null,0,null,0,null,"",0]
[null,"-#8",null,0,null,100,null,0,null,"",0]
[null,null,null,null,null,null,null,null,{"$f":"SUM(H17:H24)","v":0}]
[]
[null,"1.5\"/1.25\"",null,{"$f":"IF(Stuff!D79=0,100,Stuff!D79)","v":100},null,{"$f":"100-D27","v":0},null,{"$f":"F27*$G$8/100","v":0},null,{"$f":"IF(H27=0,\"\",ROUND(K27,1))","v":""},{"$f":"K24+H27","v":0}]
[null,"1\"",null,{"$f":"IF(Stuff!D81=0,D27,Stuff!D81)","v":100},null,{"$f":"D27-D28","v":0},null,{"$f":"F28*$G$8/100","v":0},null,"",{"$f":"K27+H28","v":0}]
[null,"3/4\"",null,{"$f":"IF(Stuff!D82=0,D28,Stuff!D82)","v":100},null,0,null,0,null,"",{"$f":"K28+H29","v":0}]
[null,"1/2\"",null,{"$f":"IF(Stuff!D84=0,D29,Stuff!D84)","v":100},null,0,null,0,null,"",0]
["2)","3/8\"",null,{"$f":"IF(Stuff!D85=0,D30,Stuff!D85)","v":100},null,0,null,0,null,"",0]
[null,"#4",null,{"$f":"IF(Stuff!D86=0,D31,Stuff!D86)","v":100},null,0,null,0,null,"",0]
[null,"#8",null,{"$f":"IF(Stuff!D87=0,D32,Stuff!D87)","v":100},null,0,null,0,null,"",0]
[null,"-#8",null,0,null,100,null,0,null,"",0]
[null,null,null,null,null,null,null,null,{"$f":"SUM(H27:H34)","v":0}]
[]
[null,"1/2\"",null,{"$f":"IF(Stuff!E84=0,100,Stuff!E84)","v":100},null,{"$f":"100-D37","v":0},null,{"$f":"F37*$G$9/100","v":0},null,{"$f":"IF(H37=0,\"\",ROUND(K37,1))","v":""},{"$f":"K34+H37","v":0}]
[null,"3/8\"",null,{"$f":"IF(Stuff!E85=0,D37,Stuff!E85)","v":100},null,{"$f":"D37-D38","v":0},null,{"$f":"F38*$G$9/100","v":0},null,{"$f":"IF(H38=0,\"\",ROUND(K38,1))","v":""},{"$f":"K37+H38","v":0}]
["3)","#4",null,{"$f":"IF(Stuff!E86=0,D38,Stuff!E86)","v":100},null,{"$f":"D38-D39","v":0},null,{"$f":"F39*$G$9/100","v":0},null,{"$f":"IF(H39=0,\"\",ROUND(K39,1))","v":""},{"$f":"K38+H39","v":0}]
[null,"#8",null,{"$f":"IF(Stuff!E87=0,D39,Stuff!E87)","v":100},null,{"$f":"D39-D40","v":0},null,{"$f":"F40*$G$9/100","v":0},null,{"$f":"IF(H40=0,\"\",ROUND(K40,1))","v":""},{"$f":"K39+H40","v":0}]
[null,"-#8",null,0,null,{"$f":"D40-D41","v":100},null,{"$f":"F41*$G$9/100","v":0},null,{"$f":"IF(H41=0,\"\",ROUND(K41,1))","v":""},{"$f":"K40+H41","v":0}]
[null,null,null,null,null,null,null,null,{"$f":"SUM(H37:H41)","v":0}]
[]
[null,"1/2\"",null,{"$f":"IF(Stuff!F84=0,100,Stuff!F84)","v":100},null,{"$f":"100-D44","v":0},null,{"$f":"F44*$G$10/100","v":0},null,{"$f":"IF(H44=0,\"\",ROUND(K44,1))","v":""},{"$f":"K41+H44","v":0}]
[null,"3/8\"",null,{"$f":"IF(Stuff!F85=0,D44,Stuff!F85)","v":100},null,{"$f":"D44-D45","v":0},null,{"$f":"F45*$G$10/100","v":0},null,{"$f":"IF(H45=0,\"\",ROUND(K45,1))","v":""},{"$f":"K44+H45","v":0}]
["4)","#4",null,{"$f":"IF(Stuff!F86=0,D45,Stuff!F86)","v":100},null,{"$f":"D45-D46","v":0},null,{"$f":"F46*$G$10/100","v":0},null,{"$f":"IF(H46=0,\"\",ROUND(K46,1))","v":""},{"$f":"K45+H46","v":0}]
[null,"#8",null,{"$f":"IF(Stuff!F87=0,D46,Stuff!F87)","v":100},null,{"$f":"D46-D47","v":0},null,{"$f":"F47*$G$10/100","v":0},null,{"$f":"IF(H47=0,\"\",ROUND(K47,1))","v":""},{"$f":"K46+H47","v":0}]
[null,"-#8",null,0,null,{"$f":"D47-D48","v":100},null,{"$f":"F48*$G$10/100","v":0},null,{"$f":"IF(H48=0,\"\",ROUND(K48,1))","v":""},{"$f":"K47+H48","v":0}]
[null,null,null,null,null,null,null,null,{"$f":"SUM(H44:H48)","v":0}]
[]
[null,"1/2\"",null,{"$f":"IF(Stuff!G84=0,100,Stuff!G84)","v":100},null,{"$f":"100-D51","v":0},null,{"$f":"F51*$G$11/100","v":0},null,{"$f":"IF(H51=0,\"\",ROUND(K51,1))","v":""},{"$f":"K48+H51","v":0}]
[null,"3/8\"",null,{"$f":"IF(Stuff!G85=0,D51,Stuff!G85)","v":100},null,{"$f":"D51-D52","v":0},null,{"$f":"F52*$G$11/100","v":0},null,{"$f":"IF(H52=0,\"\",ROUND(K52,1))","v":""},{"$f":"K51+H52","v":0}]
["5)","#4",null,{"$f":"IF(Stuff!G86=0,D52,Stuff!G86)","v":100},null,{"$f":"D52-D53","v":0},null,{"$f":"F53*$G$11/100","v":0},null,{"$f":"IF(H53=0,\"\",ROUND(K53,1))","v":""},{"$f":"K52+H53","v":0}]
[null,"#8",null,{"$f":"IF(Stuff!G87=0,D53,Stuff!G87)","v":100},null,{"$f":"D53-D54","v":0},null,{"$f":"F54*$G$11/100","v":0},null,{"$f":"IF(H54=0,\"\",ROUND(K54,1))","v":""},{"$f":"K53+H54","v":0}]
[null,"-#8",null,0,null,{"$f":"D54-D55","v":100},null,{"$f":"F55*$G$11/100","v":0},null,{"$f":"IF(H55=0,\"\",ROUND(K55,1))","v":""},{"$f":"K54+H55","v":0}]
[null,null,null,null,null,null,null,null,{"$f":"SUM(H51:H55)","v":0}]
[]
[null,"3/8\"",null,{"$f":"IF(Stuff!H85=0,100,Stuff!H85)","v":100},null,{"$f":"100-D58","v":0},null,{"$f":"F58*$G$12/100","v":0},null,{"$f":"IF(H58=0,\"\",ROUND(K58,1))","v":""},{"$f":"K55+H58","v":0}]
[null,"#4",null,{"$f":"IF(Stuff!H86=0,D58,Stuff!H86)","v":100},null,{"$f":"D58-D59","v":0},null,{"$f":"F59*$G$12/100","v":0},null,{"$f":"IF(H59=0,\"\",ROUND(K59,1))","v":""},{"$f":"K58+H59","v":0}]
["6)","#8",null,{"$f":"IF(Stuff!H87=0,D59,Stuff!H87)","v":100},null,{"$f":"D59-D60","v":0},null,{"$f":"F60*$G$12/100","v":0},null,{"$f":"IF(H60=0,\"\",ROUND(K60,1))","v":""},{"$f":"K59+H60","v":0}]
[null,"#30",null,{"$f":"IF(Stuff!H89=0,D60,Stuff!H89)","v":100},null,{"$f":"D60-D61","v":0},null,{"$f":"F61*$G$12/100","v":0},null,{"$f":"IF(H61=0,\"\",ROUND(K61,1))","v":""},{"$f":"K60+H61","v":0}]
[null,"-#30",null,0,null,{"$f":"D61-D62","v":100},null,{"$f":"F62*$G$12/100","v":0},null,{"$f":"IF(H62=0,\"\",ROUND(K62,1))","v":""},{"$f":"K61+H62","v":0}]
[null,null,null,null,null,null,null,null,{"$f":"SUM(H58:H62)","v":0}]
[]
[null,"1/2\"",null,{"$f":"IF(Stuff!I84=0,100,Stuff!I84)","v":100},null,{"$f":"100-D65","v":0},null,{"$f":"F65*$G$13/100","v":0},null,{"$f":"IF(H65=0,\"\",ROUND(K65,1))","v":""},{"$f":"K62+H65","v":0}]
[null,"3/8\"",null,{"$f":"IF(Stuff!I85=0,D65,Stuff!I85)","v":100},null,{"$f":"D65-D66","v":0},null,{"$f":"F66*$G$13/100","v":0},null,{"$f":"IF(H66=0,\"\",ROUND(K66,1))","v":""},{"$f":"K65+H66","v":0}]
["7)","#4",null,{"$f":"IF(Stuff!I86=0,D66,Stuff!I86)","v":100},null,{"$f":"D66-D67","v":0},null,{"$f":"F67*$G$13/100","v":0},null,{"$f":"IF(H67=0,\"\",ROUND(K67,1))","v":""},{"$f":"K66+H67","v":0}]
[null,"#8",null,{"$f":"IF(Stuff!I87=0,D67,Stuff!I87)","v":100},null,{"$f":"D67-D68","v":0},null,{"$f":"F68*$G$13/100","v":0},null,{"$f":"IF(H68=0,\"\",ROUND(K68,1))","v":""},{"$f":"K67+H68","v":0}]
[null,"-#8",null,0,null,{"$f":"D68-D69","v":100},null,{"$f":"F69*$G$13/100","v":0},null,{"$f":"IF(H69=0,\"\",ROUND(K69,1))","v":""},{"$f":"K68+H69","v":0}]
[null,null,null,null,null,null,null,null,{"$f":"SUM(H65:H69)","v":0}]
[]
[]
[null,"Fiber Additive (if OGFC)",null,null,{"$f":"D4*OGFC!L4","v":0}]
[]
[]
[]
["Asphalt Liquid Calculation"]
[]
[null,"Desired AC Content",null,null,"Binder Weight"]
[null,null,null,null,{"$f":"$D$4/((100-B80)/100)-$D$4-$G$12*'JMF1'!$C$23/100-$G$13*'JMF1'!$C$24/100","v":0}]
[null,null,null,null,{"$f":"$D$4/((100-B81)/100)-$D$4-$G$12*'JMF1'!$C$23/100-$G$13*'JMF1'!$C$24/100","v":0}]
[null,null,null,null,{"$f":"$D$4/((100-B82)/100)-$D$4-$G$12*'JMF1'!$C$23/100-$G$13*'JMF1'!$C$24/100","v":0}]
[null,null,null,null,{"$f":"$D$4/((100-B83)/100)-$D$4-$G$12*'JMF1'!$C$23/100-$G$13*'JMF1'!$C$24/100","v":0}]
[null,null,null,null,{"$f":"$D$4/((100-B84)/100)-$D$4-$G$12*'JMF1'!$C$23/100-$G$13*'JMF1'!$C$24/100","v":0}]
[null,null,null,null,{"$f":"$D$4/((100-B85)/100)-$D$4-$G$12*'JMF1'!$C$23/100-$G$13*'JMF1'!$C$24/100","v":0}]

{"sheet":"Washed Grad.","index":10,"n_rows":42,"n_cols":7,"rows_kept":42,"cut":false,"hidden":false,"merged":[]}
["SIEVE ANALYSIS (WASHED)"]
["AASHTO T-11 & AASHTO T-27"]
[]
["T-27 RESULTS"]
[]
["U.S.",null,null,null,"JMF"]
["STANDARDS","WEIGHT","PERCENT","PERCENT","OR"]
["SIEVES","RETAINED","RETAINED","PASSING","SPECIFICATION"]
["2\"",null,{"$f":"IF(ISBLANK(B9),\"\",(B9/$D$34)*100)","v":""},{"$f":"IF(ISBLANK(B9),,(100-C9))","v":0},{"$f":"'JMF1'!I43","v":""},{"$f":"IF(ABS(D9-E9)>5.7,\"x\",\"\")","v":""},37.5]
["1 1/2\"",null,{"$f":"IF(ISBLANK(B10),\"\",(B10/$D$34)*100)","v":""},{"$f":"IF(ISBLANK(B10),,(100-C10))","v":0},{"$f":"'JMF1'!I44","v":""},""]
["1 1/4\"",null,"",0,{"$f":"'JMF1'!I45","v":""},""]
["1\"",null,"",0,{"$f":"'JMF1'!I46","v":""},"",25]
["3/4\"",0,{"$error":"#DIV/0!"},{"$error":"#DIV/0!"},{"$f":"'JMF1'!I47","v":""},{"$error":"#DIV/0!"},19]
["5/8\"",null,"",0,{"$f":"'JMF1'!I48","v":""},""]
["1/2\"",null,"",0,{"$f":"'JMF1'!I49","v":""},"",12.5]
["3/8\"",null,"",0,{"$f":"'JMF1'!I50","v":""},"",9.5]
["NO. 4",null,"",0,{"$f":"'JMF1'!I51","v":""},{"$f":"IF(ABS(D17-E17)>4,\"x\",\"\")","v":""},4.75]
["NO. 8",null,"",0,{"$f":"'JMF1'!I52","v":""},{"$f":"IF(ABS(D18-E18)>3.3,\"x\",\"\")","v":""},2.36]
["NO. 16",null,"",0,{"$f":"'JMF1'!I53","v":""},{"$f":"IF(ABS(D19-E19)>3.3,\"x\",\"\")","v":""}]
["NO. 30",null,"",0,{"$f":"'JMF1'!I54","v":""},{"$f":"IF(ABS(D20-E20)>3.3,\"x\",\"\")","v":""},0.6]
["NO. 50",null,"",0,{"$f":"'JMF1'!I55","v":""},{"$f":"IF(ABS(D21-E21)>3.3,\"x\",\"\")","v":""},0.3]
["NO. 100",null,"",0,{"$f":"'JMF1'!I56","v":""},{"$f":"IF(ABS(D22-E22)>1.6,\"x\",\"\")","v":""},0.15]
["NO. 200",null,"",0,{"$f":"'JMF1'!I57","v":""},{"$f":"IF(ABS(D23-E23)>1.6,\"x\",\"\")","v":""},7.4999999999999997E-2]
["Minus #200 ",{"$f":"IF(ISBLANK(D42),\"\",D42)","v":""},{"$f":"IF(ISBLANK(D39),\"\",(B24/$D$34)*100)","v":""}]
["TOTAL",{"$f":"IF(ISBLANK(B23),\"\",B23+B24)","v":""},{"$f":"IF(ISBLANK(D34),\"\",(B25/$D$34)*100)","v":""},{"$f":"IF(OR(C25<=99.7,C25>=100.3),\"UNACCEPTABLE\",\"ACCEPTABLE\")","v":"UNACCEPTABLE"},"99.7-100.3"]
[]
[]
[]
[]
[]
["Material Passing #200 Sieve"]
[]
["T-11"]
["ORIGINAL DRY SAMPLE WEIGHT (A)",null,null,null,"grams"]
["WEIGHT OF SAMPLE AFTER WASH (B)",null,null,null,"grams"]
["WASH LOSS (A-B)",null,null,{"$f":"IF(ISBLANK(D34),\"\",D34-D35)","v":""},"grams"]
[]
["T-27"]
["PAN WEIGHT (C)",null,null,null,"grams"]
["Add'l -#200 Material (C-weight retained #200)",null,null,{"$f":"IF(ISBLANK(D39),\"\",D39-B23)","v":""},"grams"]
[]
["Total Material Passing #200 Sieve",null,null,{"$f":"IF(ISBLANK(D39),\"\",D36+D40)","v":""},"grams"]

{"sheet":"LOI","index":11,"n_rows":38,"n_cols":12,"rows_kept":38,"cut":false,"hidden":false,"merged":[[37,4,37,5]]}
["Loss on Ignition (L. O. I.)"]
["T. D. O. T. Procedures"]
["Serial #"]
["Design #"]
[null,null,null,null,"(1)",null,"(2)",null,"(3)",null,"(4)"]
["Mass Crucible & Test Sample",null,null,null,null,"g",null,"g",null,"g",null,"g"]
[null,"(before ignition)"]
[]
["Mass Crucible",null,null,"(-)",null,"g",null,"g",null,"g",null,"g"]
[]
[]
["Mass Test Sample",null,null,null,{"$f":"E6-E9","v":0},"g",{"$f":"G6-G9","v":0},"g",{"$f":"I6-I9","v":0},"g",{"$f":"K6-K9","v":0},"g"]
[]
[]
[]
["Mass Crucible & Test Sample",null,null,null,{"$f":"E6","v":0},"g",{"$f":"G6","v":0},"g",{"$f":"I6","v":0},"g",{"$f":"K6","v":0},"g"]
[null,"(before ignition)"]
[]
["Mass Crucible & Test Sample",null,null,null,null,"g",null,"g",null,"g",null,"g"]
[null,"(after ignition)"]
[]
["Mass Loss",null,null,null,{"$f":"E16-E19","v":0},"g",{"$f":"G16-G19","v":0},"g",{"$f":"I16-I19","v":0},"g",{"$f":"K16-K19","v":0},"g"]
[]
[]
[]
["Combined Masses from above:"]
[]
[null,"Mass of Test Samples",null,null,{"$f":"SUM(E12,G12,I12,K12)","v":0},null,"g"]
[]
[null,"Mass of Losses",null,null,{"$f":"SUM(E22,G22,I22,K22)","v":0},null,"g"]
[]
[]
[]
[]
[]
[]
[]
[null,"% L. O. I.",null,null,{"$f":"IF(ISBLANK(E6),\"\",(E30/E28)*100)","v":""}]

{"sheet":"Furnace","index":12,"n_rows":30,"n_cols":15,"rows_kept":30,"cut":false,"hidden":false,"merged":[[7,10,7,12],[9,2,9,10],[8,2,8,10],[6,2,6,5],[5,0,5,1],[6,0,6,1],[5,9,5,12],[6,9,6,12],[3,6,3,8],[4,6,4,8],[5,6,5,8],[6,6,6,8],[3,9,3,12],[4,9,4,12],[13,1,13,8],[7,0,7,1],[3,0,3,1],[19,1,19,8],[20,1,20,8],[15,1,15,8],[16,1,16,8],[17,1,17,8],[18,1,18,8],[3,2,3,5],[4,2,4,5],[5,2,5,5],[14,1,14,8],[8,0,8,1],[7,2,7,5],[4,0,4,1]]}
["NCAT FURNACE METHOD A CALIBRATION WORKSHEET"]
[]
[]
[]
[]
[]
[]
[null,null,null,null,null,null,"Furnace used to accept?",null,null,null,"Yes           No",null,null,null,2]
["Mix Type",null,{"$f":"'JMF1'!E10","v":"  "}]
["HMA Producer",null,{"$f":"'JMF1'!C8","v":0}]
[]
[]
[null,"Material",null,null,null,null,null,null,null,"Percentage of Total Mix"]
["1)",{"$f":"'JMF1'!A15&\", \"&'JMF1'!E15","v":"0, 0"},null,null,null,null,null,null,null,"1)",{"$f":"'JMF1'!I15","v":0}]
["2)",{"$f":"'JMF1'!A16&\", \"&'JMF1'!E16","v":"0, 0"},null,null,null,null,null,null,null,"2)",{"$f":"'JMF1'!I16","v":0}]
["3)",{"$f":"'JMF1'!A17&\", \"&'JMF1'!E17","v":"0, 0"},null,null,null,null,null,null,null,"3)",{"$f":"'JMF1'!I17","v":0}]
["4)",{"$f":"'JMF1'!A18&\", \"&'JMF1'!E18","v":"0, 0"},null,null,null,null,null,null,null,"4)",{"$f":"'JMF1'!I18","v":0}]
["5)",{"$f":"'JMF1'!A19&\", \"&'JMF1'!E19","v":"0, 0"},null,null,null,null,null,null,null,"5)",{"$f":"'JMF1'!I19","v":0}]
["6)",{"$f":"'JMF1'!A20&\", \"&'JMF1'!E20","v":"0, 0"},null,null,null,null,null,null,null,"6)"]
["7)",{"$f":"'JMF1'!A21&\", \"&'JMF1'!E21","v":"0, 0"},null,null,null,null,null,null,null,"7)",{"$f":"'JMF1'!I21","v":0}]
["Asphalt",{"$f":"'JMF1'!C22&\", \"&'JMF1'!E22","v":"0, 0"},null,null,null,null,null,null,null,"AC",{"$f":"'JMF1'!I22","v":0}]
[]
[null,null,null,null,null,null,null,null,null,"Optimum AC Content",{"$f":"'JMF1'!G23","v":0}]
[]
["Mixed @ %AC"]
[]
["%AC on ticket"]
[]
[null,null,null,{"$f":"$D$27-$D$25","v":0},{"$f":"$E$27-$E$25","v":0},null,{"$f":"$G$27-$G$25","v":0},{"$f":"$H$27-$H$25","v":0},null,{"$f":"$J$27-$J$25","v":0},{"$f":"$K$27-$K$25","v":0}]
["AC Calib. Factor",null,null,{"$f":"IF((ISBLANK(D25)),\"\",D29)","v":""},{"$f":"IF((ISBLANK(E25)),\"\",E29)","v":""},null,{"$f":"IF((ISBLANK(G25)),\"\",G29)","v":""},{"$f":"IF((ISBLANK(H25)),\"\",H29)","v":""},null,{"$f":"IF((ISBLANK(J25)),\"\",J29)","v":""},{"$f":"IF((ISBLANK(K25)),\"\",K29)","v":""},null,{"$f":"IF($O$8=1,AVERAGE(D30,E30,G30,H30,J30,K30),\"\")","v":""}]

{"sheet":"Rice SG","index":13,"n_rows":51,"n_cols":10,"rows_kept":51,"cut":false,"hidden":false,"merged":[[4,2,4,9],[3,0,3,1],[2,2,2,9],[3,2,3,9],[2,0,2,1]]}
["MAXIMUM SPECIFIC GRAVITY OF BITUMINOUS PAVING MIXTURES (AASHTO T-209)"]
[]
["Mix Type",null,{"$f":"'JMF1'!E10","v":"  "}]
["HMA Producer",null,{"$f":"'JMF1'!C8","v":0}]
["Design No. ",null,{"$f":"'JMF1'!H12","v":0}]
[]
[null,"CALCULATION OF MAXIMUM SPECIFIC GRAVITY:",null,null,null,null,null,"(1)","(2)","(3)"]
[]
["FLASK"," % AC"]
[]
[]
[null,"WT. DRY SAMPLE + FLASK (grams)"]
[]
[null,"WT. FLASK (grams)"]
[]
[null,"WT. DRY SAMPLE (A) (grams)",null,null,null,null,null,{"$f":"H12-H14","v":0},{"$f":"I12-I14","v":0},{"$f":"J12-J14","v":0}]
[]
[]
[]
[null,"WT. FLASK FILLED WITH WATER (D) (grams)"]
[]
[null,"WT. FLASK FILLED WITH WATER & DRY SAMPLE (E) (grams)"]
[]
[]
[null,null,null,null,null,null,null,{"$f":"IF(ISBLANK(H9),\"\",H16/(H16+H20-H22))","v":""},{"$f":"IF(ISBLANK(I9),\"\",I16/(I16+I20-I22))","v":""},{"$f":"IF(ISBLANK(J9),\"\",J16/(J16+J20-J22))","v":""}]
[]
[]
[]
[]
["CALCULATION OF THE EFFECTIVE GRAVITY OF THE AGGREGATES:"]
[]
[null,"% AGGREGATES",null,null,null,null,null,{"$f":"100-H9","v":100},{"$f":"100-I9","v":100},{"$f":"100-J9","v":100}]
[null,"SPECIFIC GRAVITY OF ASPHALT CEMENT",null,null,null,null,null,1.03,{"$f":"H33","v":1.03},{"$f":"I33","v":1.03}]
[]
[null,null,null,null,null,null,null,{"$f":"IF(ISBLANK(H9),\"\",H32/((100/H25)-(H9/H33)))","v":""},{"$f":"IF(ISBLANK(I9),\"\",I32/((100/I25)-(I9/I33)))","v":""},{"$f":"IF(ISBLANK(J9),\"\",J32/((100/J25)-(J9/J33)))","v":""}]
[null,"Effective Specific Gravity of Aggregates (Gse)"]
[]
[]
[null,null,null,null,null,null,"Avg. Effective Gravity",{"$f":"IF(ISBLANK(H9),\"\",AVERAGE(H35,I35,J35))","v":""}]
[]
[]
[]
["RICE VALUES AT OTHER ASPHALT CONTENTS"]
[]
[null,"Percent Asphalt",null,null,"Theoretical Maximum Density"]
[null,null,null,null,{"$f":"IF(ISBLANK(B46),\" \",100/(((100-B46)/$H$39)+(B46/$H$33)))","v":" "}]
[null,null,null,null,{"$f":"IF(ISBLANK(B47),\" \",100/(((100-B47)/$H$39)+(B47/$H$33)))","v":" "}]
[null,null,null,null,{"$f":"IF(ISBLANK(B48),\" \",100/(((100-B48)/$H$39)+(B48/$H$33)))","v":" "}]
[null,null,null,null,{"$f":"IF(ISBLANK(B49),\" \",100/(((100-B49)/$H$39)+(B49/$H$33)))","v":" "}]
[null,null,null,null,{"$f":"IF(ISBLANK(B50),\" \",100/(((100-B50)/$H$39)+(B50/$H$33)))","v":" "}]
[null,null,null,null,{"$f":"IF(ISBLANK(B51),\" \",100/(((100-B51)/$H$35)+(B51/1.03)))","v":" "}]

{"sheet":"Mix Des. Data","index":14,"n_rows":37,"n_cols":16,"rows_kept":37,"cut":false,"hidden":false,"merged":[[3,2,3,8],[5,10,7,10],[5,11,7,11],[2,2,2,4]]}
["State of Tennessee Marshall Mix Design Sheet"]
[]
["Type of Mix",null,{"$f":"'JMF1'!E10","v":"  "},null,null,null,"Date",{"$f":"'JMF1'!C3","v":"00:00:00"},null,null,"Effective Gravity of Aggregate",null,null,null,{"$f":"'Rice SG'!H39","v":""}]
["HMA Producer",null,{"$f":"'JMF1'!C8","v":0},null,null,null,null,null,null,null,"SG of Asphalt",null,null,null,{"$f":"'Rice SG'!H33","v":1.03}]
["Region",{"$f":"'JMF1'!C4","v":0},null,null,null,null,null,null,null,null,"Number of Blows w/ Marshall Hammer",null,null,null,null,75]
[null,null,null,"Mass (grams)",null,null,null,null,null,null,"VMA     %","VMA (Gsb)    %",null,"Unit"]
["Sample",null,null,null,null,"In","Volume",null,"Rice SG","VTM",null,null,"VFA","Weight","Stability","Flow"]
["No.","% AC","% Agg.","In Air","SSD","Water","(ml)","Bulk SG","or TMD","(%)",null,null,"(%)","(pcf)","(lb)","(0.01\")"]
["1-1",null,{"$f":"IF(ISBLANK(B9),\"\",100-B9)","v":""},null,null,null,{"$f":"E9-F9","v":0},{"$f":"IF(ISBLANK(D9),\"\",D9/G9)","v":""},{"$f":"IF(ISBLANK(B9),\"\",100/((C9/$O$3)+(B9/$O$4)))","v":""},{"$f":"IF(ISBLANK(B9),\"\",(I9-H12)/I9*100)","v":""},{"$f":"IF(ISBLANK(B9),\"\",100-((C9*H12)/$O$3))","v":""},{"$f":"IF(ISBLANK(B9),\"\",100-((H12*C9)/Stuff!$B$322))","v":""},{"$f":"IF(ISBLANK(B9),\"\",((B9*H12)/$O$4)/K9*100)","v":""},{"$f":"IF(ISBLANK(B9),\"\",H12*62.4)","v":""}]
["1-2",null,null,null,null,null,{"$f":"E10-F10","v":0},{"$f":"IF(ISBLANK(D10),\"\",D10/G10)","v":""}]
["1-3",null,null,null,null,null,{"$f":"E11-F11","v":0},{"$f":"IF(ISBLANK(D11),\"\",D11/G11)","v":""}]
[null,null,null,null,null,null,"Avg",{"$f":"IF(ISBLANK(B9),\"\",AVERAGE(H9,H10,H11))","v":""},null,null,null,null,null,"Avg",{"$f":"IF(ISBLANK(O9),\"\",AVERAGE(O9,O10,O11))","v":""},{"$f":"IF(ISBLANK(P9),\"\",AVERAGE(P9,P10,P11))","v":""}]
[]
["2-1",null,{"$f":"IF(ISBLANK(B14),\"\",100-B14)","v":""},null,null,null,{"$f":"E14-F14","v":0},{"$f":"IF(ISBLANK(D14),\"\",D14/G14)","v":""},{"$f":"IF(ISBLANK(B14),\"\",100/((C14/$O$3)+(B14/$O$4)))","v":""},{"$f":"IF(ISBLANK(B14),\"\",(I14-H17)/I14*100)","v":""},{"$f":"IF(ISBLANK(B14),\"\",100-((C14*H17)/$O$3))","v":""},{"$f":"IF(ISBLANK(B14),\"\",100-((H17*C14)/Stuff!$B$322))","v":""},{"$f":"IF(ISBLANK(B14),\"\",((B14*H17)/$O$4)/K14*100)","v":""},{"$f":"IF(ISBLANK(B14),\"\",H17*62.4)","v":""}]
["2-2",null,null,null,null,null,{"$f":"E15-F15","v":0},{"$f":"IF(ISBLANK(D15),\"\",D15/G15)","v":""}]
["2-3",null,null,null,null,null,{"$f":"E16-F16","v":0},{"$f":"IF(ISBLANK(D16),\"\",D16/G16)","v":""}]
[null,null,null,null,null,null,"Avg",{"$f":"IF(ISBLANK(B14),\"\",AVERAGE(H14,H15,H16))","v":""},null,null,null,null,null,"Avg",{"$f":"IF(ISBLANK(O14),\"\",AVERAGE(O14,O15,O16))","v":""},{"$f":"IF(ISBLANK(P14),\"\",AVERAGE(P14,P15,P16))","v":""}]
[]
["3-1",null,{"$f":"IF(ISBLANK(B19),\"\",100-B19)","v":""},null,null,null,{"$f":"E19-F19","v":0},{"$f":"IF(ISBLANK(D19),\"\",D19/G19)","v":""},{"$f":"IF(ISBLANK(B19),\"\",100/((C19/$O$3)+(B19/$O$4)))","v":""},{"$f":"IF(ISBLANK(B19),\"\",(I19-H22)/I19*100)","v":""},{"$f":"IF(ISBLANK(B19),\"\",100-((C19*H22)/$O$3))","v":""},{"$f":"IF(ISBLANK(B19),\"\",100-((H22*C19)/Stuff!$B$322))","v":""},{"$f":"IF(ISBLANK(B19),\"\",((B19*H22)/$O$4)/K19*100)","v":""},{"$f":"IF(ISBLANK(B19),\"\",H22*62.4)","v":""}]
["3-2",null,null,null,null,null,{"$f":"E20-F20","v":0},{"$f":"IF(ISBLANK(D20),\"\",D20/G20)","v":""}]
["3-3",null,null,null,null,null,{"$f":"E21-F21","v":0},{"$f":"IF(ISBLANK(D21),\"\",D21/G21)","v":""}]
[null,null,null,null,null,null,"Avg",{"$f":"IF(ISBLANK(B19),\"\",AVERAGE(H19,H20,H21))","v":""},null,null,null,null,null,"Avg",{"$f":"IF(ISBLANK(O19),\"\",AVERAGE(O19,O20,O21))","v":""},{"$f":"IF(ISBLANK(P19),\"\",AVERAGE(P19,P20,P21))","v":""}]
[]
["4-1",null,{"$f":"IF(ISBLANK(B24),\"\",100-B24)","v":""},null,null,null,{"$f":"E24-F24","v":0},{"$f":"IF(ISBLANK(D24),\"\",D24/G24)","v":""},{"$f":"IF(ISBLANK(B24),\"\",100/((C24/$O$3)+(B24/$O$4)))","v":""},{"$f":"IF(ISBLANK(B24),\"\",(I24-H27)/I24*100)","v":""},{"$f":"IF(ISBLANK(B24),\"\",100-((C24*H27)/$O$3))","v":""},{"$f":"IF(ISBLANK(B24),\"\",100-((H27*C24)/Stuff!$B$322))","v":""},{"$f":"IF(ISBLANK(B24),\"\",((B24*H27)/$O$4)/K24*100)","v":""},{"$f":"IF(ISBLANK(B24),\"\",H27*62.4)","v":""}]
["4-2",null,null,null,null,null,{"$f":"E25-F25","v":0},{"$f":"IF(ISBLANK(D25),\"\",D25/G25)","v":""}]
["4-3",null,null,null,null,null,{"$f":"E26-F26","v":0},{"$f":"IF(ISBLANK(D26),\"\",D26/G26)","v":""}]
[null,null,null,null,null,null,"Avg",{"$f":"IF(ISBLANK(B24),\"\",AVERAGE(H24,H25,H26))","v":""},null,null,null,null,null,"Avg",{"$f":"IF(ISBLANK(O24),\"\",AVERAGE(O24,O25,O26))","v":""},{"$f":"IF(ISBLANK(P24),\"\",AVERAGE(P24,P25,P26))","v":""}]
[]
["5-1",null,{"$f":"IF(ISBLANK(B29),\"\",100-B29)","v":""},null,null,null,{"$f":"E29-F29","v":0},{"$f":"IF(ISBLANK(D29),\"\",D29/G29)","v":""},{"$f":"IF(ISBLANK(B29),\"\",100/((C29/$O$3)+(B29/$O$4)))","v":""},{"$f":"IF(ISBLANK(B29),\"\",(I29-H32)/I29*100)","v":""},{"$f":"IF(ISBLANK(B29),\"\",100-((C29*H32)/$O$3))","v":""},{"$f":"IF(ISBLANK(B29),\"\",100-((H32*C29)/Stuff!$B$322))","v":""},{"$f":"IF(ISBLANK(B29),\"\",((B29*H32)/$O$4)/K29*100)","v":""},{"$f":"IF(ISBLANK(B29),\"\",H32*62.4)","v":""}]
["5-2",null,null,null,null,null,{"$f":"E30-F30","v":0},{"$f":"IF(ISBLANK(D30),\"\",D30/G30)","v":""}]
["5-3",null,null,null,null,null,{"$f":"E31-F31","v":0},{"$f":"IF(ISBLANK(D31),\"\",D31/G31)","v":""}]
[null,null,null,null,null,null,"Avg",{"$f":"IF(ISBLANK(B29),\"\",AVERAGE(H29,H30,H31))","v":""},null,null,null,null,null,"Avg",{"$f":"IF(ISBLANK(O29),\"\",AVERAGE(O29,O30,O31))","v":""},{"$f":"IF(ISBLANK(P29),\"\",AVERAGE(P29,P30,P31))","v":""}]
[]
["Opt-1",null,{"$f":"IF(ISBLANK(B34),\"\",100-B34)","v":""},null,null,null,{"$f":"E34-F34","v":0},{"$f":"IF(ISBLANK(D34),\"\",D34/G34)","v":""},{"$f":"IF(ISBLANK(B34),\"\",IF(OR(Stuff!C27=3,Stuff!C27=4,Stuff!C27=12),100/((B34/'Rice SG'!H33)+(C34/'Agg. S. G.'!N31)),100/((C34/$O$3)+(B34/$O$4))))","v":""},{"$f":"IF(ISBLANK(D34),\"\",(I34-H37)/I34*100)","v":""},{"$f":"IF(ISBLANK(D34),\"\",100-((C34*H37)/$O$3))","v":""},{"$f":"IF(ISBLANK(B34),\"\",100-((H37*C34)/Stuff!$B$322))","v":""},{"$f":"IF(ISBLANK(D34),\"\",((B34*H37)/$O$4)/K34*100)","v":""},{"$f":"IF(ISBLANK(D34),\"\",H37*62.4)","v":""}]
["Opt-2",null,null,null,null,null,{"$f":"E35-F35","v":0},{"$f":"IF(ISBLANK(D35),\"\",D35/G35)","v":""}]
["Opt-3",null,null,null,null,null,{"$f":"E36-F36","v":0},{"$f":"IF(ISBLANK(D36),\"\",D36/G36)","v":""}]
[null,null,null,null,null,null,"Avg",{"$f":"IF(ISBLANK(B34),\"\",AVERAGE(H34,H35,H36))","v":""},null,null,null,null,null,"Avg",{"$f":"IF(ISBLANK(O34),\"\",AVERAGE(O34,O35,O36))","v":""},{"$f":"IF(ISBLANK(P34),\"\",AVERAGE(P34,P35,P36))","v":""}]

{"sheet":"Mix Des. Graphs","index":15,"n_rows":1,"n_cols":1,"rows_kept":1,"cut":false,"hidden":false,"merged":[[0,0,0,9]]}
["State of Tennessee Marshall Mix Design Graphs"]

{"sheet":"TSR","index":16,"n_rows":46,"n_cols":14,"rows_kept":46,"cut":false,"hidden":false,"merged":[[9,5,9,7],[7,5,7,6],[9,2,9,3],[30,3,30,4],[30,6,30,7]]}
["ASTM D 4867"]
["MOISTURE DAMAGE LABORATORY DATA"]
["SHEET"]
[]
[]
[null,"Mix Type",{"$f":"'JMF1'!E10","v":"  "}]
[null,"Additive:  ",{"$f":"'JMF1'!G24","v":0},null,"Dosage:  ",{"$f":"'JMF1'!I25","v":" "}]
[null,"Compaction Method:  ","Marshall Hammer",null,"Effort:  "]
[null,"Aggregate Effective Gravity:  ",{"$f":"'Rice SG'!H39","v":""},null,"Opt. AC content (%):  ",{"$f":"'Mix Des. Data'!B34","v":0}]
[null,"Date Tested:  ",null,null,"By:  "]
["Sample I.D.",null,"1","2","3","4","5","6"]
["Diameter, inches (D)",null,4,4,4,4,4,4]
["Thickness, inches (t)"]
["Dry mass in air (A)"]
["SSD mass (B)"]
["Mass in water (C)"]
["Volume(E)","B-C",{"$f":"C15-C16","v":0},0,0,0,0,0]
["Bulk Sp. Gr. (F)","A/E",{"$f":"IF(C17=0,\"\",C14/C17)","v":""},"","","","",""]
["Max. Sp. Gravity (G)",null,{"$f":"IF(ISBLANK(F8),\"\",100/(((100-$F$9)/$C$9)+($F$9/'Rice SG'!H33)))","v":""},{"$f":"$C$19","v":""},{"$f":"$C$19","v":""},{"$f":"$C$19","v":""},{"$f":"$C$19","v":""},{"$f":"$C$19","v":""}]
["% Air Void","(100(G-F)/G)",{"$f":"IF(ISBLANK(C14),\"\",100*(C19-C18)/C19)","v":""},"","","","",""]
["Deviation from Average",null,{"$f":"C20-AVERAGEA($C$20:$H$20)","v":0},0,0,0,0,0]
["Condition Specimen: (x)",null,null,null,null,null,null,null,false,false,false,false,false,false]
["Minimum Saturated Mass","55%",{"$f":"IF(I22=0,\" \",C17*C20/100*0.55+C14)","v":" "}," "," "," "," "," "]
["Maximum Saturated Mass","80%",{"$f":"IF(I22=0,\" \",C17*C20/100*0.8+C14)","v":" "}," "," "," "," "," "]
[]
["Saturated",null,"min. @ ",null,"in. Hg"]
[]
["SSD Mass"]
["Degree of Saturation 55<S<80",null,{"$f":"IF(I22=0,\" \",ROUND(((C28-C14)/(C17*C20/100))*100,1))","v":" "}," "," "," "," "," "]
[]
["Conditioned 24h in 140°F water.",null,"Time In",null,null,"Time Out"]
[" "]
["Thickness, inches (t)",null,{"$f":"C13","v":0},0,0,0,0,0]
["Load (P)"]
["Dry (STd)","see Note 1",{"$f":"IF(ISBLANK(C34),\"\",IF(I22=0,ROUND(2*C34/(3.14*C33*C12),1),\" \"))","v":""},"","","","",""]
["Wet (STm)","see Note 1",{"$f":"IF(I22=0,\" \",ROUND(2*C34/(3.14*C33*C12),1))","v":" "}," "," "," "," "," "]
[]
["Results"]
[]
["TSR",null,{"$f":"IF(ISBLANK(C34),\"\",100*D44/G44)","v":""}]
["Visual Moisture Damage"]
["Visual Aggregate Breakage "]
[]
[null,null,"CONDITIONED =",{"$f":"IF(ISBLANK(C34),\"\",AVERAGE(C36,D36,E36,F36,G36,H36))","v":""},null,"UNCONDITIONED =",{"$f":"IF(ISBLANK(C34),\"\",AVERAGE(C35,D35,E35,F35,G35,H35))","v":""}]
[]
[null,"Note 1:"]

{"sheet":"Des. Check","index":17,"n_rows":40,"n_cols":9,"rows_kept":40,"cut":false,"hidden":false,"merged":[[1,7,1,8],[2,0,2,1],[2,2,2,3],[3,0,3,1],[3,2,3,3],[2,5,2,6],[2,7,2,8],[3,5,3,6],[3,7,3,8],[4,0,4,1],[4,2,4,4],[4,5,4,6],[4,7,4,8],[5,0,5,1],[5,2,5,8],[6,2,6,3],[6,7,6,8],[10,4,10,5],[10,7,10,8],[11,4,11,5],[11,7,11,8],[12,4,12,5],[12,7,12,8],[13,4,13,5],[13,7,13,8],[14,4,14,5],[14,7,14,8],[17,4,17,5],[17,7,17,8],[20,4,20,5],[20,7,20,8],[21,4,21,5],[23,4,23,5],[23,7,23,8],[29,7,29,8],[24,4,24,5],[24,7,24,8],[25,4,25,5],[25,7,25,8],[26,4,26,5],[26,7,26,8],[27,4,27,5],[27,7,27,8],[28,4,28,5],[28,7,28,8],[29,4,29,5],[32,4,32,5],[32,7,32,8],[33,4,33,5],[33,7,33,8],[37,1,37,8]]}
["Summary of Mix Properties"]
[]
["Date",null,{"$f":"'JMF1'!C3","v":"00:00:00"},null,null,"County",null,{"$f":"'JMF1'!C5","v":"00:00:00"}]
["Region",null,{"$f":"'JMF1'!C4","v":"00:00:00"},null,null,"Date of Letting",null,{"$f":"'JMF1'!C6","v":"00:00:00"}]
["Type of Mix",null,{"$f":"'JMF1'!E10","v":"  "}]
["Hot-mix Producer",null,{"$f":"'JMF1'!C8","v":0}]
["Serial No.",null,{"$f":"'JMF1'!C12","v":0},null,null,"Design No.",null,{"$f":"'JMF1'!H12","v":0}]
[]
[null,null,null,null,"As Designed",null,null,"Lab Check"]
["Aggregate Properties"]
["Effective SG of Aggregate (Gse)",null,null,null,{"$f":"'Rice SG'!H39","v":""},null,null,{"$f":"IF(ISERROR('MARSHALL(TDOT)'!J14),\"\",'MARSHALL(TDOT)'!J14)","v":0}]
["Fractured Face Count",null,null,null,{"$f":"'Fract. Face'!D23","v":"n/a"},null,null,{"$f":"'F.FACE(TDOT)'!D23","v":"n/a"}]
["Glassy Particles",null,null,null,{"$f":"Glassy!E25","v":"n/a"},null,null,{"$f":"Glassy!E25","v":"n/a"}]
["NCAT Furnace Correction Factor",null,null,null,{"$f":"Furnace!M30","v":""},null,null,{"$f":"'N.C.A.T(TDOT)'!F39","v":""}]
["LOI",null,null,null,{"$f":"LOI!E38","v":""},null,null,{"$f":"'LOI (TDOT)'!E34","v":""}]
[]
["Asphalt Properties"]
["SG of Asphalt",null,null,null,{"$f":"'Rice SG'!H33","v":1.03}]
[]
["Mix Properties"]
["Bulk Specific Gravity (Gmb)",null,null,null,{"$f":"'Mix Des. Data'!H37","v":""},null,null,{"$f":"IF(ISERROR('MARSHALL(TDOT)'!H17),\"\",'MARSHALL(TDOT)'!H17)","v":""}]
["Rice Specific Gravity (Gmm)",null,null,null,{"$f":"'Mix Des. Data'!I34","v":""},null,null,{"$f":"IF('MARSHALL(TDOT)'!T6=1,'MARSHALL(TDOT)'!B30,(IF('MARSHALL(TDOT)'!T6=2,'MARSHALL(TDOT)'!G33,'MARSHALL(TDOT)'!L27)))","v":""},{"$f":"IF(ISBLANK('MARSHALL(TDOT)'!G27),'MARSHALL(TDOT)'!B30,'MARSHALL(TDOT)'!G33)","v":""}]
[null,null,null,null,null,null,null,"(Gmm used)     ","(Gmm tested )"]
["Optimum Asphalt Content (4% VTM)",null,null,null,{"$f":"IF('Mix Des. Data'!B34=0,\"\",'Mix Des. Data'!B34)","v":""}]
["VTM @ Optimum %AC",null,null,null,{"$f":"IF(Stuff!C27=18,OGFC!Q35,'Mix Des. Data'!J34)","v":""},null,null,{"$f":"IF(ISERROR('MARSHALL(TDOT)'!K14),\"\",'MARSHALL(TDOT)'!K14)","v":""}]
["VMA @ Optimum %AC",null,null,null,{"$f":"IF(Stuff!C27=18,OGFC!R35,'Mix Des. Data'!K34)","v":""},null,null,{"$f":"IF(ISERROR('MARSHALL(TDOT)'!L14),\"\",'MARSHALL(TDOT)'!L14)","v":""}]
["VFA @ Optimum %AC",null,null,null,{"$f":"IF(Stuff!C27=18,OGFC!T35,'Mix Des. Data'!M34)","v":""},null,null,{"$f":"IF(ISERROR('MARSHALL(TDOT)'!M14),\"\",'MARSHALL(TDOT)'!M14)","v":""}]
["Marshall Stability @ Opt. %AC",null,null,null,{"$f":"'Mix Des. Data'!O37","v":""},null,null,{"$f":"IF(ISBLANK('MARSHALL(TDOT)'!R17),\"\", (IF('MARSHALL(TDOT)'!$T$3=1,'MARSHALL(TDOT)'!R17,'MARSHALL(TDOT)'!O17)))","v":""}]
["Marshall Flow @ Opt. %AC",null,null,null,{"$f":"'Mix Des. Data'!P37","v":""},null,null,{"$f":"IF(ISERROR('MARSHALL(TDOT)'!P17),\"\",'MARSHALL(TDOT)'!P17)","v":""}]
["Dust to Asphalt Ratio (DAR)",null,null,null,{"$f":"'JMF1'!I27","v":""},null,null,{"$f":"'N.C.A.T(TDOT)'!D27","v":""}]
[]
["Moisture Damage"]
["Conditioned Tensile Strength (psi)",null,null,null,{"$f":"IF(Stuff!C27=18,'OGFC TSR'!E34,TSR!D44)","v":""},null,null,{"$f":"IF(ISERROR('TSR(TDOT)'!D42),\"\",'TSR(TDOT)'!D42)","v":""}]
["Tensile Strength Retained (%)",null,null,null,{"$f":"IF(Stuff!C27=18,'OGFC TSR'!D30,TSR!C40)","v":""},null,null,{"$f":"IF(ISERROR('TSR(TDOT)'!D38),\"\",'TSR(TDOT)'!D38)","v":""}]
[]
["Was design used on previous project?",null,null,null,null,null,null,"Contract #"]
["Any change(s) from original?",null,null,null,null,null,null,"Design #"]
["What?"]
["AC Source",null,{"$f":"Stuff!E54&\", \"&Stuff!B110","v":"0, 0"},null,null,null,null,"%AC",{"$f":"'Mix Des. Data'!B34","v":0}]
["Antistrip Source",null,{"$f":"'JMF1'!D25","v":0},null,{"$f":"'JMF1'!G24","v":0},null,null,"Dosage",{"$f":"'JMF1'!I25","v":" "}]

{"sheet":"Mix Summary","index":18,"n_rows":39,"n_cols":15,"rows_kept":39,"cut":false,"hidden":false,"merged":[[4,2,4,6],[16,1,16,9],[2,2,2,7]]}
["MARSHALL ASPHALT MIX DESIGN SUMMARY"]
[]
[]
[null,"TYPE OF MIX",{"$f":"'JMF1'!E10","v":"  "},null,null,null,null,null,"SERIAL NO.",{"$f":"IF(ISBLANK('JMF1'!C12),\"\",'JMF1'!C12)","v":""},null,null,"DATE",{"$f":"'JMF1'!C3","v":"00:00:00"}]
[null,"HMA PRODUCER",{"$f":"'JMF1'!C8","v":0},null,null,null,null,null,"REGION",{"$f":"'JMF1'!C4","v":0},null,null,"DESIGN NO.",{"$f":"IF(ISBLANK('JMF1'!H12),\"\",'JMF1'!H12)","v":""}]
[]
[]
["SAMPLE","ASPHALT",null,"SP. GR. of",null,"THEO. GR.",null,"% THEO.",null,"VOIDS IN","VOIDS IN","VOIDS FILLED","MARSHALL",null,"NO. BLOWS"]
["NO.","CONTENT",null,"MAR. SAMP.",null,"OF MIX",null,"GRAV.",null,"TOTAL MIX","MIN. AGG.","W/ ASPHALT","STABILITY","FLOW","MAR. HAM."]
[1,{"$f":"IF(ISBLANK('Mix Des. Data'!$B$9),\"\",'Mix Des. Data'!B9)","v":""},null,{"$f":"IF(ISBLANK('Mix Des. Data'!$B$9),\"\",'Mix Des. Data'!H12)","v":""},null,{"$f":"IF(ISBLANK('Mix Des. Data'!$B$9),\"\",'Mix Des. Data'!I9)","v":""},null,{"$f":"IF(ISBLANK('Mix Des. Data'!$B$9),\"\",100-'Mix Des. Data'!J9)","v":""},null,{"$f":"IF(ISBLANK('Mix Des. Data'!$B$9),\"\",'Mix Des. Data'!J9)","v":""},{"$f":"IF(ISBLANK('Mix Des. Data'!$B$9),\"\",'Mix Des. Data'!K9)","v":""},{"$f":"IF(ISBLANK('Mix Des. Data'!$B$9),\"\",'Mix Des. Data'!M9)","v":""},{"$f":"IF(ISBLANK('Mix Des. Data'!$B$9),\"\",'Mix Des. Data'!O12)","v":""},{"$f":"IF(ISBLANK('Mix Des. Data'!$B$9),\"\",'Mix Des. Data'!P12)","v":""},{"$f":"IF(ISBLANK('Mix Des. Data'!B9),\"\",'Mix Des. Data'!$P$5)","v":""}]
[2,{"$f":"IF(ISBLANK('Mix Des. Data'!$B$14),\"\",'Mix Des. Data'!B14)","v":""},null,{"$f":"IF(ISBLANK('Mix Des. Data'!$B$14),\"\",'Mix Des. Data'!H17)","v":""},null,{"$f":"IF(ISBLANK('Mix Des. Data'!$B$14),\"\",'Mix Des. Data'!I14)","v":""},null,{"$f":"IF(ISBLANK('Mix Des. Data'!$B$14),\"\",100-'Mix Des. Data'!J14)","v":""},null,{"$f":"IF(ISBLANK('Mix Des. Data'!$B$14),\"\",'Mix Des. Data'!J14)","v":""},{"$f":"IF(ISBLANK('Mix Des. Data'!$B$14),\"\",'Mix Des. Data'!K14)","v":""},{"$f":"IF(ISBLANK('Mix Des. Data'!$B$14),\"\",'Mix Des. Data'!M14)","v":""},{"$f":"IF(ISBLANK('Mix Des. Data'!$B$14),\"\",'Mix Des. Data'!O17)","v":""},{"$f":"IF(ISBLANK('Mix Des. Data'!$B$14),\"\",'Mix Des. Data'!P17)","v":""},{"$f":"IF(ISBLANK('Mix Des. Data'!B14),\"\",'Mix Des. Data'!$P$5)","v":""}]
[3,{"$f":"IF(ISBLANK('Mix Des. Data'!$B$19),\"\",'Mix Des. Data'!B19)","v":""},null,{"$f":"IF(ISBLANK('Mix Des. Data'!$B$19),\"\",'Mix Des. Data'!H22)","v":""},null,{"$f":"IF(ISBLANK('Mix Des. Data'!$B$19),\"\",'Mix Des. Data'!I19)","v":""},null,{"$f":"IF(ISBLANK('Mix Des. Data'!$B$19),\"\",100-'Mix Des. Data'!J19)","v":""},null,{"$f":"IF(ISBLANK('Mix Des. Data'!$B$19),\"\",'Mix Des. Data'!J19)","v":""},{"$f":"IF(ISBLANK('Mix Des. Data'!$B$19),\"\",'Mix Des. Data'!K19)","v":""},{"$f":"IF(ISBLANK('Mix Des. Data'!$B$19),\"\",'Mix Des. Data'!M19)","v":""},{"$f":"IF(ISBLANK('Mix Des. Data'!$B$19),\"\",'Mix Des. Data'!O22)","v":""},{"$f":"IF(ISBLANK('Mix Des. Data'!$B$19),\"\",'Mix Des. Data'!P22)","v":""},{"$f":"IF(ISBLANK('Mix Des. Data'!B19),\"\",'Mix Des. Data'!$P$5)","v":""}]
[4,{"$f":"IF(ISBLANK('Mix Des. Data'!$B$24),\"\",'Mix Des. Data'!B24)","v":""},null,{"$f":"IF(ISBLANK('Mix Des. Data'!$B$24),\"\",'Mix Des. Data'!H27)","v":""},null,{"$f":"IF(ISBLANK('Mix Des. Data'!$B$24),\"\",'Mix Des. Data'!I24)","v":""},null,{"$f":"IF(ISBLANK('Mix Des. Data'!$B$24),\"\",100-'Mix Des. Data'!J24)","v":""},null,{"$f":"IF(ISBLANK('Mix Des. Data'!$B$24),\"\",'Mix Des. Data'!J24)","v":""},{"$f":"IF(ISBLANK('Mix Des. Data'!$B$24),\"\",'Mix Des. Data'!K24)","v":""},{"$f":"IF(ISBLANK('Mix Des. Data'!$B$24),\"\",'Mix Des. Data'!M24)","v":""},{"$f":"IF(ISBLANK('Mix Des. Data'!$B$24),\"\",'Mix Des. Data'!O27)","v":""},{"$f":"IF(ISBLANK('Mix Des. Data'!$B$24),\"\",'Mix Des. Data'!P27)","v":""},{"$f":"IF(ISBLANK('Mix Des. Data'!B24),\"\",'Mix Des. Data'!$P$5)","v":""}]
[5,{"$f":"IF(ISBLANK('Mix Des. Data'!$B$29),\"\",'Mix Des. Data'!B29)","v":""},null,{"$f":"IF(ISBLANK('Mix Des. Data'!$B$29),\"\",'Mix Des. Data'!H32)","v":""},null,{"$f":"IF(ISBLANK('Mix Des. Data'!$B$29),\"\",'Mix Des. Data'!I29)","v":""},null,{"$f":"IF(ISBLANK('Mix Des. Data'!$B$29),\"\",100-'Mix Des. Data'!J29)","v":""},null,{"$f":"IF(ISBLANK('Mix Des. Data'!$B$29),\"\",'Mix Des. Data'!J29)","v":""},{"$f":"IF(ISBLANK('Mix Des. Data'!$B$29),\"\",'Mix Des. Data'!K29)","v":""},{"$f":"IF(ISBLANK('Mix Des. Data'!$B$29),\"\",'Mix Des. Data'!M29)","v":""},{"$f":"IF(ISBLANK('Mix Des. Data'!$B$29),\"\",'Mix Des. Data'!O32)","v":""},{"$f":"IF(ISBLANK('Mix Des. Data'!$B$29),\"\",'Mix Des. Data'!P32)","v":""},{"$f":"IF(ISBLANK('Mix Des. Data'!B29),\"\",'Mix Des. Data'!$P$5)","v":""}]
["OPT",{"$f":"IF(ISBLANK('Mix Des. Data'!$B$34),\"\",'Mix Des. Data'!B34)","v":""},null,{"$f":"IF(ISBLANK('Mix Des. Data'!$B$34),\"\",'Mix Des. Data'!H37)","v":""},null,{"$f":"IF(ISBLANK('Mix Des. Data'!$B$34),\"\",'Mix Des. Data'!I34)","v":""},null,{"$f":"IF(ISBLANK('Mix Des. Data'!$B$34),\"\",100-'Mix Des. Data'!J34)","v":""},null,{"$f":"IF(ISBLANK('Mix Des. Data'!$B$34),\"\",'Mix Des. Data'!J34)","v":""},{"$f":"IF(ISBLANK('Mix Des. Data'!$B$34),\"\",'Mix Des. Data'!K34)","v":""},{"$f":"IF(ISBLANK('Mix Des. Data'!$B$34),\"\",'Mix Des. Data'!M34)","v":""},{"$f":"IF(ISBLANK('Mix Des. Data'!$B$34),\"\",'Mix Des. Data'!O37)","v":""},{"$f":"IF(ISBLANK('Mix Des. Data'!$B$34),\"\",'Mix Des. Data'!P37)","v":""},{"$f":"IF(ISBLANK('Mix Des. Data'!B34),\"\",'Mix Des. Data'!$P$5)","v":""}]
[]
[null,"TOTAL % PASSING",null,null,null,null,null,null,null,null,"PRODUCERS"]
["MTLS.",1,2,3,4,5,6,7,"JMF","Design","1)",{"$f":"IF(Stuff!E65=1,\"\",'JMF1'!A15&\", \"&'JMF1'!E15)","v":"0, 0"}]
["%",{"$f":"IF(ISBLANK('JMF1'!B42),\"\",'JMF1'!B42)","v":""},{"$f":"IF(ISBLANK('JMF1'!C42),\"\",'JMF1'!C42)","v":""},{"$f":"IF(ISBLANK('JMF1'!D42),\"\",'JMF1'!D42)","v":""},{"$f":"IF(ISBLANK('JMF1'!E42),\"\",'JMF1'!E42)","v":""},{"$f":"IF(ISBLANK('JMF1'!F42),\"\",'JMF1'!F42)","v":""},{"$f":"IF(ISBLANK('JMF1'!G42),\"\",'JMF1'!G42)","v":""},{"$f":"IF(ISBLANK('JMF1'!H42),\"\",'JMF1'!H42)","v":""},{"$f":"IF(ISBLANK('JMF1'!I42),\"\",'JMF1'!I42)","v":0},{"$f":"IF(ISBLANK('JMF1'!J42),\"\",'JMF1'!J42)","v":"Range"},"2)",{"$f":"IF(Stuff!E66=1,\"\",'JMF1'!A16&\", \"&'JMF1'!E16)","v":""}]
["2\"(50mm)",{"$f":"IF(ISBLANK('JMF1'!B43),\"\",'JMF1'!B43)","v":""},{"$f":"IF(ISBLANK('JMF1'!C43),\"\",'JMF1'!C43)","v":""},{"$f":"IF(ISBLANK('JMF1'!D43),\"\",'JMF1'!D43)","v":""},{"$f":"IF(ISBLANK('JMF1'!E43),\"\",'JMF1'!E43)","v":""},{"$f":"IF(ISBLANK('JMF1'!F43),\"\",'JMF1'!F43)","v":""},{"$f":"IF(ISBLANK('JMF1'!G43),\"\",'JMF1'!G43)","v":""},{"$f":"IF(ISBLANK('JMF1'!H43),\"\",'JMF1'!H43)","v":""},{"$f":"IF(ISBLANK('JMF1'!I43),\"\",'JMF1'!I43)","v":""},{"$f":"IF(ISBLANK('JMF1'!J43),\"\",'JMF1'!J43)","v":""},"3)",{"$f":"IF(Stuff!E67=1,\"\",'JMF1'!A17&\", \"&'JMF1'!E17)","v":""}]
["1.5\" (37.5mm)",{"$f":"IF(ISBLANK('JMF1'!B44),\"\",'JMF1'!B44)","v":""},{"$f":"IF(ISBLANK('JMF1'!C44),\"\",'JMF1'!C44)","v":""},{"$f":"IF(ISBLANK('JMF1'!D44),\"\",'JMF1'!D44)","v":""},{"$f":"IF(ISBLANK('JMF1'!E44),\"\",'JMF1'!E44)","v":""},{"$f":"IF(ISBLANK('JMF1'!F44),\"\",'JMF1'!F44)","v":""},{"$f":"IF(ISBLANK('JMF1'!G44),\"\",'JMF1'!G44)","v":""},{"$f":"IF(ISBLANK('JMF1'!H44),\"\",'JMF1'!H44)","v":""},{"$f":"IF(ISBLANK('JMF1'!I44),\"\",'JMF1'!I44)","v":""},{"$f":"IF(ISBLANK('JMF1'!J44),\"\",'JMF1'!J44)","v":""},"4)",{"$f":"IF(Stuff!E68=1,\"\",'JMF1'!A18&\", \"&'JMF1'!E18)","v":""}]
["1.25\" (31.8mm)",{"$f":"IF(ISBLANK('JMF1'!B45),\"\",'JMF1'!B45)","v":""},{"$f":"IF(ISBLANK('JMF1'!C45),\"\",'JMF1'!C45)","v":""},{"$f":"IF(ISBLANK('JMF1'!D45),\"\",'JMF1'!D45)","v":""},{"$f":"IF(ISBLANK('JMF1'!E45),\"\",'JMF1'!E45)","v":""},{"$f":"IF(ISBLANK('JMF1'!F45),\"\",'JMF1'!F45)","v":""},{"$f":"IF(ISBLANK('JMF1'!G45),\"\",'JMF1'!G45)","v":""},{"$f":"IF(ISBLANK('JMF1'!H45),\"\",'JMF1'!H45)","v":""},{"$f":"IF(ISBLANK('JMF1'!I45),\"\",'JMF1'!I45)","v":""},{"$f":"IF(ISBLANK('JMF1'!J45),\"\",'JMF1'!J45)","v":""},"5)",{"$f":"IF(Stuff!E69=1,\"\",'JMF1'!A19&\", \"&'JMF1'!E19)","v":""}]
["1\" (25.0mm)",{"$f":"IF(ISBLANK('JMF1'!B46),\"\",'JMF1'!B46)","v":""},{"$f":"IF(ISBLANK('JMF1'!C46),\"\",'JMF1'!C46)","v":""},{"$f":"IF(ISBLANK('JMF1'!D46),\"\",'JMF1'!D46)","v":""},{"$f":"IF(ISBLANK('JMF1'!E46),\"\",'JMF1'!E46)","v":""},{"$f":"IF(ISBLANK('JMF1'!F46),\"\",'JMF1'!F46)","v":""},{"$f":"IF(ISBLANK('JMF1'!G46),\"\",'JMF1'!G46)","v":""},{"$f":"IF(ISBLANK('JMF1'!H46),\"\",'JMF1'!H46)","v":""},{"$f":"IF(ISBLANK('JMF1'!I46),\"\",'JMF1'!I46)","v":""},{"$f":"IF(ISBLANK('JMF1'!J46),\"\",'JMF1'!J46)","v":""},"6)",{"$f":"IF(Stuff!E70=1,\"\",'JMF1'!A20&\", \"&'JMF1'!E20)","v":""}]
["3/4\" (19.0mm)",{"$f":"IF(ISBLANK('JMF1'!B47),\"\",'JMF1'!B47)","v":""},{"$f":"IF(ISBLANK('JMF1'!C47),\"\",'JMF1'!C47)","v":""},{"$f":"IF(ISBLANK('JMF1'!D47),\"\",'JMF1'!D47)","v":""},{"$f":"IF(ISBLANK('JMF1'!E47),\"\",'JMF1'!E47)","v":""},{"$f":"IF(ISBLANK('JMF1'!F47),\"\",'JMF1'!F47)","v":""},{"$f":"IF(ISBLANK('JMF1'!G47),\"\",'JMF1'!G47)","v":""},{"$f":"IF(ISBLANK('JMF1'!H47),\"\",'JMF1'!H47)","v":""},{"$f":"IF(ISBLANK('JMF1'!I47),\"\",'JMF1'!I47)","v":""},{"$f":"IF(ISBLANK('JMF1'!J47),\"\",'JMF1'!J47)","v":""},"7)",{"$f":"IF(Stuff!E71=1,\"\",'JMF1'!A21&\", \"&'JMF1'!E21)","v":""}]
["5/8\"(16.0mm)",{"$f":"IF(ISBLANK('JMF1'!B48),\"\",'JMF1'!B48)","v":""},{"$f":"IF(ISBLANK('JMF1'!C48),\"\",'JMF1'!C48)","v":""},{"$f":"IF(ISBLANK('JMF1'!D48),\"\",'JMF1'!D48)","v":""},{"$f":"IF(ISBLANK('JMF1'!E48),\"\",'JMF1'!E48)","v":""},{"$f":"IF(ISBLANK('JMF1'!F48),\"\",'JMF1'!F48)","v":""},{"$f":"IF(ISBLANK('JMF1'!G48),\"\",'JMF1'!G48)","v":""},{"$f":"IF(ISBLANK('JMF1'!H48),\"\",'JMF1'!H48)","v":""},{"$f":"IF(ISBLANK('JMF1'!I48),\"\",'JMF1'!I48)","v":""},{"$f":"IF(ISBLANK('JMF1'!J48),\"\",'JMF1'!J48)","v":""},"Asphalt",{"$f":"'JMF1'!C22&\", \"&'JMF1'!E22","v":"0, 0"}]
["1/2\" (12.5mm)",{"$f":"IF(ISBLANK('JMF1'!B49),\"\",'JMF1'!B49)","v":""},{"$f":"IF(ISBLANK('JMF1'!C49),\"\",'JMF1'!C49)","v":""},{"$f":"IF(ISBLANK('JMF1'!D49),\"\",'JMF1'!D49)","v":""},{"$f":"IF(ISBLANK('JMF1'!E49),\"\",'JMF1'!E49)","v":""},{"$f":"IF(ISBLANK('JMF1'!F49),\"\",'JMF1'!F49)","v":""},{"$f":"IF(ISBLANK('JMF1'!G49),\"\",'JMF1'!G49)","v":""},{"$f":"IF(ISBLANK('JMF1'!H49),\"\",'JMF1'!H49)","v":""},{"$f":"IF(ISBLANK('JMF1'!I49),\"\",'JMF1'!I49)","v":""},{"$f":"IF(ISBLANK('JMF1'!J49),\"\",'JMF1'!J49)","v":""},"Anti-Strip",{"$f":"IF(ISBLANK('JMF1'!D25),\"\",'JMF1'!I25&\" of \"&'JMF1'!G24)","v":"  of 0"}]
["3/8\" (9.5mm)",{"$f":"IF(ISBLANK('JMF1'!B50),\"\",'JMF1'!B50)","v":""},{"$f":"IF(ISBLANK('JMF1'!C50),\"\",'JMF1'!C50)","v":""},{"$f":"IF(ISBLANK('JMF1'!D50),\"\",'JMF1'!D50)","v":""},{"$f":"IF(ISBLANK('JMF1'!E50),\"\",'JMF1'!E50)","v":""},{"$f":"IF(ISBLANK('JMF1'!F50),\"\",'JMF1'!F50)","v":""},{"$f":"IF(ISBLANK('JMF1'!G50),\"\",'JMF1'!G50)","v":""},{"$f":"IF(ISBLANK('JMF1'!H50),\"\",'JMF1'!H50)","v":""},{"$f":"IF(ISBLANK('JMF1'!I50),\"\",'JMF1'!I50)","v":""},{"$f":"IF(ISBLANK('JMF1'!J50),\"\",'JMF1'!J50)","v":""}]
["#4 (4.75mm)",{"$f":"IF(ISBLANK('JMF1'!B51),\"\",'JMF1'!B51)","v":""},{"$f":"IF(ISBLANK('JMF1'!C51),\"\",'JMF1'!C51)","v":""},{"$f":"IF(ISBLANK('JMF1'!D51),\"\",'JMF1'!D51)","v":""},{"$f":"IF(ISBLANK('JMF1'!E51),\"\",'JMF1'!E51)","v":""},{"$f":"IF(ISBLANK('JMF1'!F51),\"\",'JMF1'!F51)","v":""},{"$f":"IF(ISBLANK('JMF1'!G51),\"\",'JMF1'!G51)","v":""},{"$f":"IF(ISBLANK('JMF1'!H51),\"\",'JMF1'!H51)","v":""},{"$f":"IF(ISBLANK('JMF1'!I51),\"\",'JMF1'!I51)","v":""},{"$f":"IF(ISBLANK('JMF1'!J51),\"\",'JMF1'!J51)","v":""}]
["#8 (2.36mm)",{"$f":"IF(ISBLANK('JMF1'!B52),\"\",'JMF1'!B52)","v":""},{"$f":"IF(ISBLANK('JMF1'!C52),\"\",'JMF1'!C52)","v":""},{"$f":"IF(ISBLANK('JMF1'!D52),\"\",'JMF1'!D52)","v":""},{"$f":"IF(ISBLANK('JMF1'!E52),\"\",'JMF1'!E52)","v":""},{"$f":"IF(ISBLANK('JMF1'!F52),\"\",'JMF1'!F52)","v":""},{"$f":"IF(ISBLANK('JMF1'!G52),\"\",'JMF1'!G52)","v":""},{"$f":"IF(ISBLANK('JMF1'!H52),\"\",'JMF1'!H52)","v":""},{"$f":"IF(ISBLANK('JMF1'!I52),\"\",'JMF1'!I52)","v":""},{"$f":"IF(ISBLANK('JMF1'!J52),\"\",'JMF1'!J52)","v":""},null,"Recommended",{"$f":"'Mix Des. Data'!B34","v":0},"Asphalt Content"]
["#16 (1.18mm)",{"$f":"IF(ISBLANK('JMF1'!B53),\"\",'JMF1'!B53)","v":""},{"$f":"IF(ISBLANK('JMF1'!C53),\"\",'JMF1'!C53)","v":""},{"$f":"IF(ISBLANK('JMF1'!D53),\"\",'JMF1'!D53)","v":""},{"$f":"IF(ISBLANK('JMF1'!E53),\"\",'JMF1'!E53)","v":""},{"$f":"IF(ISBLANK('JMF1'!F53),\"\",'JMF1'!F53)","v":""},{"$f":"IF(ISBLANK('JMF1'!G53),\"\",'JMF1'!G53)","v":""},{"$f":"IF(ISBLANK('JMF1'!H53),\"\",'JMF1'!H53)","v":""},{"$f":"IF(ISBLANK('JMF1'!I53),\"\",'JMF1'!I53)","v":""},{"$f":"IF(ISBLANK('JMF1'!J53),\"\",'JMF1'!J53)","v":""},null,"Rice Specific Gravity",{"$f":"'Mix Des. Data'!I34","v":""}]
["#30 (600mm)",{"$f":"IF(ISBLANK('JMF1'!B54),\"\",'JMF1'!B54)","v":""},{"$f":"IF(ISBLANK('JMF1'!C54),\"\",'JMF1'!C54)","v":""},{"$f":"IF(ISBLANK('JMF1'!D54),\"\",'JMF1'!D54)","v":""},{"$f":"IF(ISBLANK('JMF1'!E54),\"\",'JMF1'!E54)","v":""},{"$f":"IF(ISBLANK('JMF1'!F54),\"\",'JMF1'!F54)","v":""},{"$f":"IF(ISBLANK('JMF1'!G54),\"\",'JMF1'!G54)","v":""},{"$f":"IF(ISBLANK('JMF1'!H54),\"\",'JMF1'!H54)","v":""},{"$f":"IF(ISBLANK('JMF1'!I54),\"\",'JMF1'!I54)","v":""},{"$f":"IF(ISBLANK('JMF1'!J54),\"\",'JMF1'!J54)","v":""}]
["#50 (300mm)",{"$f":"IF(ISBLANK('JMF1'!B55),\"\",'JMF1'!B55)","v":""},{"$f":"IF(ISBLANK('JMF1'!C55),\"\",'JMF1'!C55)","v":""},{"$f":"IF(ISBLANK('JMF1'!D55),\"\",'JMF1'!D55)","v":""},{"$f":"IF(ISBLANK('JMF1'!E55),\"\",'JMF1'!E55)","v":""},{"$f":"IF(ISBLANK('JMF1'!F55),\"\",'JMF1'!F55)","v":""},{"$f":"IF(ISBLANK('JMF1'!G55),\"\",'JMF1'!G55)","v":""},{"$f":"IF(ISBLANK('JMF1'!H55),\"\",'JMF1'!H55)","v":""},{"$f":"IF(ISBLANK('JMF1'!I55),\"\",'JMF1'!I55)","v":""},{"$f":"IF(ISBLANK('JMF1'!J55),\"\",'JMF1'!J55)","v":""}]
["#100 (150mm)",{"$f":"IF(ISBLANK('JMF1'!B56),\"\",'JMF1'!B56)","v":""},{"$f":"IF(ISBLANK('JMF1'!C56),\"\",'JMF1'!C56)","v":""},{"$f":"IF(ISBLANK('JMF1'!D56),\"\",'JMF1'!D56)","v":""},{"$f":"IF(ISBLANK('JMF1'!E56),\"\",'JMF1'!E56)","v":""},{"$f":"IF(ISBLANK('JMF1'!F56),\"\",'JMF1'!F56)","v":""},{"$f":"IF(ISBLANK('JMF1'!G56),\"\",'JMF1'!G56)","v":""},{"$f":"IF(ISBLANK('JMF1'!H56),\"\",'JMF1'!H56)","v":""},{"$f":"IF(ISBLANK('JMF1'!I56),\"\",'JMF1'!I56)","v":""},{"$f":"IF(ISBLANK('JMF1'!J56),\"\",'JMF1'!J56)","v":""}]
["#200 (75mm)",{"$f":"IF(ISBLANK('JMF1'!B57),\"\",'JMF1'!B57)","v":""},{"$f":"IF(ISBLANK('JMF1'!C57),\"\",'JMF1'!C57)","v":""},{"$f":"IF(ISBLANK('JMF1'!D57),\"\",'JMF1'!D57)","v":""},{"$f":"IF(ISBLANK('JMF1'!E57),\"\",'JMF1'!E57)","v":""},{"$f":"IF(ISBLANK('JMF1'!F57),\"\",'JMF1'!F57)","v":""},{"$f":"IF(ISBLANK('JMF1'!G57),\"\",'JMF1'!G57)","v":""},{"$f":"IF(ISBLANK('JMF1'!H57),\"\",'JMF1'!H57)","v":""},{"$f":"IF(ISBLANK('JMF1'!I57),\"\",'JMF1'!I57)","v":""},{"$f":"IF(ISBLANK('JMF1'!J57),\"\",'JMF1'!J57)","v":""}]
[null,null,null,null,null,null,null,null,null,null,null,null,null,"DAR",{"$f":"'JMF1'!I27","v":""}]
["Bulk Sp. Gr.",{"$f":"IF('Agg. S. G.'!$N$6=1,'Agg. S. G.'!E43,'Agg. S. G.'!N31)","v":""},null,null,null,"Absorption",{"$f":"IF('Agg. S. G.'!$N$6=1,'Agg. S. G.'!E47,'Agg. S. G.'!N35)","v":""},null,null,null,"NCAT Corr. Factor",{"$f":"IF(ISBLANK(Furnace!D25),\"\",Furnace!M30)","v":""},null,"Eff. AC Content",{"$f":"IF(ISBLANK('Mix Des. Data'!B34),\"\",M29-(100/B36-100/B37)/(100+M29)*100)","v":""}]
["Eff. Sp. Gr.",{"$f":"'Rice SG'!H39","v":""},null,null,null,"Fract. Face",{"$f":"IF(ISBLANK('Fract. Face'!E19),\"\",'Fract. Face'!D23)","v":""},null,null,null,"L.O.I.",{"$f":"LOI!E38","v":""},null,"TSR",{"$f":"'JMF1'!F32","v":""}]
["App. Sp. Gr.",{"$f":"IF('Agg. S. G.'!$N$6=1,'Agg. S. G.'!E45,'Agg. S. G.'!N33)","v":""},null,null,null,"Glassy Part.",{"$f":"IF(ISBLANK(Glassy!E21),\"\",Glassy!E25)","v":""},null,null,null,"A.C. in RAP 1",{"$f":"'JMF1'!C23","v":0},null,"Conditioned Ten. Str.",{"$f":"TSR!D44","v":""}]
[null,null,null,null,null,null,null,null,null,null,"A.C. in RAP 2",{"$f":"'JMF1'!C24","v":0}]

{"sheet":"MARSHALL(TDOT)","index":19,"n_rows":498,"n_cols":21,"rows_kept":498,"cut":false,"hidden":false,"merged":[[0,0,0,18],[1,2,1,4],[2,2,2,4],[3,2,3,4],[3,9,3,10],[3,13,3,15],[1,9,1,10],[1,11,1,12],[1,13,1,15],[2,13,2,15],[5,0,7,0],[5,1,7,1],[5,2,7,2],[5,6,7,6],[5,7,7,7],[5,15,7,15],[5,16,7,16],[5,17,7,17],[6,3,7,3],[6,4,7,4],[6,5,7,5],[5,9,7,9],[5,10,7,10],[5,11,7,11],[5,12,7,12],[5,13,7,13],[5,14,7,14],[5,8,7,8],[9,6,12,6],[9,7,12,7],[9,8,12,8],[9,9,12,9],[9,10,12,10],[9,11,12,11],[9,12,12,12],[9,13,12,13],[18,16,18,17],[26,11,26,12],[27,11,27,12],[28,11,29,12],[45,3,45,4],[32,6,32,7],[38,3,38,6],[39,5,39,6],[40,5,40,6],[43,3,43,6],[44,3,44,4]]}
["TDOT Check of Contractor's J.M.F",null,null,null,null,null,null,null,null,null,null,null,null,null,null,null,null,null,null,1,"Use Corrected "]
["Serial #",null,{"$f":"'Des. Check'!C7:D7","v":0},null,null,null,null,null,null,null,null,"No. Hammer Blows",null,null,null,null,null,null,null,2,"Use UnCorrected "]
["Design #",null,{"$f":"'Des. Check'!H7","v":0},null,null,null,"Region",null,{"$f":"'Des. Check'!C4","v":0},null,null,null,"SG of Asphalt",{"$f":"'Rice SG'!H33","v":1.03},null,null,null,null,null,2]
["Date",null,{"$f":"'Des. Check'!C3","v":"00:00:00"}]
[]
["Sample No.","% AC","% Agg.","Mass (grams)",null,null,"Volume (ml)","Bulk SG, Gmb","Rice SG, TMD, or Gmm","Eff.*   Grav. Aggs., Gse","VTM       (%)","VMA       (%)","VFA      (%)","Unit Weight (pcf)","Stability (lb)","Flow (0.01\")","Correlation Ratio","Corrected Stability (lb)",null,3]
[null,null,null,"In Air","SSD","In Water"]
[]
[null,"A","B","C","D","E","F","G","H","I","J","K","L","M"]
[null,null,null,null,null,null,"D-E","C/F","See* Below","See* Below","(100-G/H) x100","100- (BxG)/ I","(K-J)/K        x100","62.4 x Gmm"]
[]
[]
[]
["1",{"$f":"'Mix Des. Data'!B34","v":0},{"$f":"IF(ISBLANK(B14),\"\",100-B14)","v":100},null,null,null,{"$f":"E14-F14","v":0},{"$f":"IF(ISBLANK(D14),\"\",D14/G14)","v":""},{"$f":"'Des. Check'!H22","v":""},{"$f":"IF(ISBLANK(D14),,(C14)/((100/I14)-(B14/N3)))","v":0},{"$f":"IF(ISBLANK(D14),\"\",(I14-H17)/I14*100)","v":""},{"$f":"IF(ISBLANK(D14),\"\",100-((C14*H17)/$J$14))","v":""},{"$f":"IF(ISBLANK(D14),\"\",(((L14-K14)/L14)*100))","v":""},{"$f":"IF(ISBLANK(D14),\"\",H17*62.4)","v":""},null,null,{"$f":"IF(ISBLANK(O14),\"\",VLOOKUP(G14,$A$73:$B$498,2,TRUE))","v":""},{"$f":"IF(ISBLANK(O14),,O14*Q14)","v":0}]
["2",null,null,null,null,null,{"$f":"E15-F15","v":0},{"$f":"IF(ISBLANK(D15),\"\",D15/G15)","v":""},null,null,null,null,null,null,null,null,{"$f":"IF(ISBLANK(O15),\"\",VLOOKUP(G15,$A$73:$B$498,2,TRUE))","v":""},{"$f":"IF(ISBLANK(O15),\"\",O15*Q15)","v":""}]
["3",null,null,null,null,null,{"$f":"E16-F16","v":0},{"$f":"IF(ISBLANK(D16),\"\",D16/G16)","v":""},null,null,null,null,null,null,null,null,{"$f":"IF(ISBLANK(O16),\"\",VLOOKUP(G16,$A$73:$B$498,2,TRUE))","v":""},{"$f":"IF(ISBLANK(O16),\"\",O16*Q16)","v":""}]
[null,null,null,null,null,null,"Avg",{"$f":"IF(ISBLANK(B14),\"\",AVERAGE(H14:H16))","v":{"$error":"#DIV/0!"}},null,null,null,null,null,"Avg",{"$f":"IF(ISBLANK(O14),\"\",AVERAGE(O14:O16))","v":""},{"$f":"IF(ISBLANK(P14),\"\",AVERAGE(P14:P16))","v":""},null,{"$f":"IF(ISBLANK(R14),\"\",AVERAGE(R14:R16))","v":0}]
[]
[null,null,null,null,null,null,null,null,null,null,null,null,null,null,null,"Stability -",{"$f":"VLOOKUP(T3,T1:U2,2)","v":"Use UnCorrected "}]
["*MAXIMUM THEORETICAL SPECIFIC GRAVITY (H) as determined by AASHTO T-209"]
["Note - Check large aggregate by breaking open and inspecting for the presence of water.  "]
["If water is present, procedure for \"dryback\" must be followed and used in above computations."]
[]
[]
[]
[null,null,null,null,null,null,"#1","#2"]
[null,null,"Dry wt",null,null,null,null,null,"Wgt. Matl. + Cont.",null,null,{"$f":"'Mix Des. Data'!I34","v":""}]
[null,null,"Wet wt",null,null,null,null,null,"Wgt. Cont.",null,null,{"$f":"ABS(L27-(IF(ISBLANK(G27),B30,G33)))","v":{"$error":"#VALUE!"}},null,"Variation from TDOT Gmm"]
[null,null,"Bowl (Wet)",null,null,"A",{"$f":"G27-G28","v":0},{"$f":"(H27-H28)","v":0},"Wgt. Matl. Only",null,null,{"$f":"IF(ISERROR(L28),,(IF(L28>0.024,\"FAIL\",\"PASS\")))","v":0}]
[null,{"$f":"IF(ISBLANK(B27),\"\",B27/(B27-(B28-B29)))","v":""},"Gmm",null,null,"D",null,null,"Wgt. Cont. + Water"]
[null,null,null,null,null,"E",null,null,"Wgt. Matl. +Cont. + Water"]
[null,null,null,null,null,null,{"$f":"IF(ISBLANK(G27),\"\",G29/(G29+G30-G31))","v":""},{"$f":"IF(ISBLANK(H27),,H29/(H29+H30-H31))","v":0},"Max. Specific Gravity "]
[null,null,null,null,null,null,{"$f":"IF(ISBLANK(H27),G32,AVERAGE(G32:H32))","v":""},null,"AVERAGE"]
[]
[]
[]
[]
["^CALCULATING Gmm AND EFFECTIVE GRAVITY:"]
["* Eff. Grav. Aggs. ( I ) = ",null,null,"B"]
[null,null,null,100,"-","A"]
[null,null,null,"H",null,"Sp.Gr. AC"]
[]
[]
["*Theo. Grav. (H)",null,"=",100]
["*At any AC content",null,null,"A",null,"+","B"]
[null,null,null,"Sp.Gr. AC",null,null,"I"]
[]
[]
[]
[]
[]
[]
[]
[]
[]
[]
[]
[]
[]
[]
[]
[]
[]
[]
[]
[]
[]
[]
[]
[]
[]
[]
[200,5.56]
[201,5.56]
[202,5.56]
[203,5.56]
[204,5.56]
[205,5.56]
[206,5.56]
[207,5.56]
[208,5.56]
[209,5.56]
[210,5.56]
[211,5.56]
[212,5.56]
[213,5.56]
[214,5]
[215,5]
[216,5]
[217,5]
[218,5]
[219,5]
[220,5]
[221,5]
[222,5]
[223,5]
[224,5]
[225,5]
[226,4.55]
[227,4.55]
[228,4.55]
[229,4.55]
[230,4.55]
[231,4.55]
[232,4.55]
[233,4.55]
[234,4.55]
[235,4.55]
[236,4.55]
[237,4.55]
[238,4.17]
[239,4.17]
[240,4.17]
[241,4.17]
[242,4.17]
[243,4.17]
[244,4.17]
[245,4.17]
[246,4.17]
[247,4.17]
[248,4.17]
[249,4.17]
[250,4.17]
[251,3.85]
[252,3.85]
[253,3.85]
[254,3.85]
[255,3.85]
[256,3.85]
[257,3.85]
[258,3.85]
[259,3.85]
[260,3.85]
[261,3.85]
[262,3.85]
[263,3.85]
[264,3.85]
[265,3.57]
[266,3.57]
[267,3.57]
[268,3.57]
[269,3.57]
[270,3.57]
[271,3.57]
[272,3.57]
[273,3.57]
[274,3.57]
[275,3.57]
[276,3.57]
[277,3.33]
[278,3.33]
[279,3.33]
[280,3.33]
[281,3.33]
[282,3.33]
[283,3.33]
[284,3.33]
[285,3.33]
[286,3.33]
[287,3.33]
[288,3.33]
[289,3.33]
[290,3.03]
[291,3.03]
[292,3.03]
[293,3.03]
[294,3.03]
[295,3.03]
[296,3.03]
[297,3.03]
[298,3.03]
[299,3.03]
[300,3.03]
[301,3.03]
[302,2.78]
[303,2.78]
[304,2.78]
[305,2.78]
[306,2.78]
[307,2.78]
[308,2.78]
[309,2.78]
[310,2.78]
[311,2.78]
[312,2.78]
[313,2.78]
[314,2.78]
[315,2.78]
[316,2.78]
[317,2.5]
[318,2.5]
[319,2.5]
[320,2.5]
[321,2.5]
[322,2.5]
[323,2.5]
[324,2.5]
[325,2.5]
[326,2.5]
[327,2.5]
[328,2.5]
[329,2.27]
[330,2.27]
[331,2.27]
[332,2.27]
[333,2.27]
[334,2.27]
[335,2.27]
[336,2.27]
[337,2.27]
[338,2.27]
[339,2.27]
[340,2.27]
[341,2.08]
[342,2.08]
[343,2.08]
[344,2.08]
[345,2.08]
[346,2.08]
[347,2.08]
[348,2.08]
[349,2.08]
[350,2.08]
[351,2.08]
[352,2.08]
[353,2.08]
[354,1.92]
[355,1.92]
[356,1.92]
[357,1.92]
[358,1.92]
[359,1.92]
[360,1.92]
[361,1.92]
[362,1.92]
[363,1.92]
[364,1.92]
[365,1.92]
[366,1.92]
[367,1.92]
[368,1.79]
[369,1.79]
[370,1.79]
[371,1.79]
[372,1.79]
[373,1.79]
[374,1.79]
[375,1.79]
[376,1.79]
[377,1.79]
[378,1.79]
[379,1.79]
[380,1.67]
[381,1.67]
[382,1.67]
[383,1.67]
[384,1.67]
[385,1.67]
[386,1.67]
[387,1.67]
[388,1.67]
[389,1.67]
[390,1.67]
[391,1.67]
[392,1.67]
[393,1.56]
[394,1.56]
[395,1.56]
[396,1.56]
[397,1.56]
[398,1.56]
[399,1.56]
[400,1.56]
[401,1.56]
[402,1.56]
[403,1.56]
[404,1.56]
[405,1.56]
[406,1.47]
[407,1.47]
[408,1.47]
[409,1.47]
[410,1.47]
[411,1.47]
[412,1.47]
[413,1.47]
[414,1.47]
[415,1.47]
[416,1.47]
[417,1.47]
[418,1.47]
[419,1.47]
[420,1.47]
[421,1.39]
[422,1.39]
[423,1.39]
[424,1.39]
[425,1.39]
[426,1.39]
[427,1.39]
[428,1.39]
[429,1.39]
[430,1.39]
[431,1.39]
[432,1.32]
[433,1.32]
[434,1.32]
[435,1.32]
[436,1.32]
[437,1.32]
[438,1.32]
[439,1.32]
[440,1.32]
[441,1.32]
[442,1.32]
[443,1.32]
[444,1.25]
[445,1.25]
[446,1.25]
[447,1.25]
[448,1.25]
[449,1.25]
[450,1.25]
[451,1.25]
[452,1.25]
[453,1.25]
[454,1.25]
[455,1.25]
[456,1.25]
[457,1.19]
[458,1.19]
[459,1.19]
[460,1.19]
[461,1.19]
[462,1.19]
[463,1.19]
[464,1.19]
[465,1.19]
[466,1.19]
[467,1.19]
[468,1.19]
[469,1.19]
[470,1.19]
[471,1.1399999999999999]
[472,1.1399999999999999]
[473,1.1399999999999999]
[474,1.1399999999999999]
[475,1.1399999999999999]
[476,1.1399999999999999]
[477,1.1399999999999999]
[478,1.1399999999999999]
[479,1.1399999999999999]
[480,1.1399999999999999]
[481,1.1399999999999999]
[482,1.1399999999999999]
[483,1.0900000000000001]
[484,1.0900000000000001]
[485,1.0900000000000001]
[486,1.0900000000000001]
[487,1.0900000000000001]
[488,1.0900000000000001]
[489,1.0900000000000001]
[490,1.0900000000000001]
[491,1.0900000000000001]
[492,1.0900000000000001]
[493,1.0900000000000001]
[494,1.0900000000000001]
[495,1.0900000000000001]
[496,1.04]
[497,1.04]
[498,1.04]
[499,1.04]
[500,1.04]
[501,1.04]
[502,1.04]
[503,1.04]
[504,1.04]
[505,1.04]
[506,1.04]
[507,1.04]
[508,1.04]
[509,1]
[510,1]
[511,1]
[512,1]
[513,1]
[514,1]
[515,1]
[516,1]
[517,1]
[518,1]
[519,1]
[520,1]
[521,1]
[522,1]
[523,0.96]
[524,0.96]
[525,0.96]
[526,0.96]
[527,0.96]
[528,0.96]
[529,0.96]
[530,0.96]
[531,0.96]
[532,0.96]
[533,0.96]
[534,0.96]
[535,0.96]
[536,0.93]
[537,0.93]
[538,0.93]
[539,0.93]
[540,0.93]
[541,0.93]
[542,0.93]
[543,0.93]
[544,0.93]
[545,0.93]
[546,0.93]
[547,0.89]
[548,0.89]
[549,0.89]
[550,0.89]
[551,0.89]
[552,0.89]
[553,0.89]
[554,0.89]
[555,0.89]
[556,0.89]
[557,0.89]
[558,0.89]
[559,0.89]
[560,0.86]
[561,0.86]
[562,0.86]
[563,0.86]
[564,0.86]
[565,0.86]
[566,0.86]
[567,0.86]
[568,0.86]
[569,0.86]
[570,0.86]
[571,0.86]
[572,0.86]
[573,0.86]
[574,0.83]
[575,0.83]
[576,0.83]
[577,0.83]
[578,0.83]
[579,0.83]
[580,0.83]
[581,0.83]
[582,0.83]
[583,0.83]
[584,0.83]
[585,0.83]
[586,0.81]
[587,0.81]
[588,0.81]
[589,0.81]
[590,0.81]
[591,0.81]
[592,0.81]
[593,0.81]
[594,0.81]
[595,0.81]
[596,0.81]
[597,0.81]
[598,0.81]
[599,0.78]
[600,0.78]
[601,0.78]
[602,0.78]
[603,0.78]
[604,0.78]
[605,0.78]
[606,0.78]
[607,0.78]
[608,0.78]
[609,0.78]
[610,0.78]
[611,0.76]
[612,0.76]
[613,0.76]
[614,0.76]
[615,0.76]
[616,0.76]
[617,0.76]
[618,0.76]
[619,0.76]
[620,0.76]
[621,0.76]
[622,0.76]
[623,0.76]
[624,0.76]
[625,0.76]

{"sheet":"TSR(TDOT)","index":20,"n_rows":42,"n_cols":16,"rows_kept":42,"cut":false,"hidden":false,"merged":[[0,1,0,4],[4,2,4,4],[6,2,6,4],[6,6,6,8],[23,0,23,8],[25,0,25,8],[41,3,41,8],[28,0,28,8],[29,4,29,5],[29,7,29,8],[30,0,30,8],[37,3,37,8],[40,3,40,8]]}
[null,null,null,null,null,"Design No.",{"$f":"'JMF1'!H12","v":0},null,null,null,1]
[]
["Additive",{"$f":"'JMF1'!G24","v":0},null,null,null,"Dosage",{"$f":"'JMF1'!I25","v":" "}]
[]
["Compaction Method",null,null,null,null,"Effort",null,"Blows"]
[]
["Date Tested",null,"00:00:00",null,null,"By:",0]
[]
["Sample I.D.",null,null,1,2,3,4,5,6]
["Diameter","(inches)","D"]
["Thickness","(inches)","t"]
["Dry mass in air",null,"A"]
["SSD mass",null,"B"]
["Mass in water",null,"C"]
["Volume(B-C)",null,"E",{"$f":"D13-D14","v":0},0,0,0,0,0]
["Bulk Sp.Gr.(A/E)",null,"F",{"$f":"IF(ISBLANK(D12),,D12/D15)","v":0},{"$f":"IF(ISBLANK(E12),\"\",E12/E15)","v":""},{"$f":"IF(ISBLANK(F12),\"\",F12/F15)","v":""},{"$f":"IF(ISBLANK(G12),\"\",G12/G15)","v":""},{"$f":"IF(ISBLANK(H12),\"\",H12/H15)","v":""},{"$f":"IF(ISBLANK(I12),\"\",I12/I15)","v":""}]
["Max Sp.Gr.",null,"G",{"$f":"'Des. Check'!H22","v":""},{"$f":"D17","v":""},{"$f":"E17","v":""},{"$f":"F17","v":""},{"$f":"G17","v":""},{"$f":"H17","v":""}]
["%AirVoid(100(G-F)/G)",null,"H",{"$f":"IF(ISBLANK(D12),,100*(D17-D16)/D17)","v":0},0,0,0,0,0]
["Deviation from average",null,null,{"$f":"IF(ISBLANK(D12),,D18-AVERAGE($D$18:$I$18))","v":0},0,0,0,0,0]
["Condition Specimen",null,null,null,null,null,null,null,null,null,false,false,false,false,false,false]
["Min. Saturated. Mass (55%)",null,null,{"$f":"IF(K20=FALSE,,D15*D18/100*0.55+D12)","v":0},0,0,0,0,0]
["Max. Saturated. Mass (80%)",null,null,{"$f":"IF(K20=FALSE,,D15*D18/100*0.8+D12)","v":0},0,0,0,0,0]
["Average",null,null,{"$f":"AVERAGE(D21:D22)","v":0},0,0,0,0,0]
[]
[null,null,"Saturated       ",null,"min.  @",null,"\"Hg"]
[]
["SSD Mass",null,"B'"]
["%Saturation(100J'/I)",null,null,{"$f":"IF(OR(K20=FALSE,ISBLANK(D27)),,((D27-D12)/(D18*D15/100))*100)","v":0},0,0,0,0,0]
[]
["Conditioned 24h in 140F water",null,null,"TIME IN:  ",null,null,"TIME OUT:"]
[]
["Thickness","(inches)","t\""]
["SSD mass",null,"B''"]
["Mass in water",null,"C''"]
["Load(lbs(kg))",null,"P\""]
["Dry Strength,2P/tDp",null,"Std",{"$f":"IF(OR(K20=TRUE,ISBLANK(D35)),0,(2*D35)/(D11*D10*3.14159))","v":0},0,0,0,0,0]
["Wet Strength2P\"/t''Dp",null,"Stm",{"$f":"IF(OR(K20=FALSE,ISBLANK(D35)),0,(2*D35)/(D32*D10*3.14159))","v":0},0,0,0,0,0]
["TSR 100S tm/S td",null,null,{"$f":"D42/D41*100","v":{"$error":"#DIV/0!"}}]
["Visual Moisture Damage"]
["Crack/Break Aggregate"]
["Average Dry Stength",null,null,{"$f":"((SUM(D36:I36))/((COUNTIF(D36:I36,\">0\"))))","v":{"$error":"#DIV/0!"}}]
["Average Wet Strength",null,null,{"$f":"((SUM(D37:I37))/((COUNTIF(D37:I37,\">0\"))))","v":{"$error":"#DIV/0!"}}]

{"sheet":"TSR(TDOT) (AASHTO)","index":21,"n_rows":45,"n_cols":16,"rows_kept":45,"cut":false,"hidden":false,"merged":[[44,3,44,8],[0,0,0,8],[31,4,31,5],[31,7,31,8],[30,0,30,8],[32,4,32,5],[32,7,32,8],[33,0,33,8],[40,3,40,8],[43,3,43,8],[2,1,2,4],[6,2,6,4],[8,2,8,4],[8,6,8,8],[25,0,25,8],[27,0,27,8]]}
["Tensile Strength Ratio (TSR) by AASHTO T283   TDOT Data Sheet"]
[]
[null,null,null,null,null,"Design No.",{"$f":"'JMF1'!H12","v":0},null,null,null,1]
[]
["Additive",{"$f":"'JMF1'!G24","v":0},null,null,null,"Dosage",{"$f":"'JMF1'!I25","v":" "}]
[]
["Compaction Method",null,null,null,null,"Effort",null,"Blows"]
[]
["Date Tested",null,"00:00:00",null,null,"By:",0]
[]
["Sample I.D.",null,null,1,2,3,4,5,6]
["Diameter","(inches)","D"]
["Thickness","(inches)","t"]
["Dry mass in air",null,"A"]
["SSD mass",null,"B"]
["Mass in water",null,"C"]
["Volume(B-C)",null,"E",{"$f":"D15-D16","v":0},0,0,0,0,0]
["Bulk Sp.Gr.(A/E)",null,"F",{"$f":"IF(ISBLANK(D14),,D14/D17)","v":0},{"$f":"IF(ISBLANK(E14),\"\",E14/E17)","v":""},{"$f":"IF(ISBLANK(F14),\"\",F14/F17)","v":""},{"$f":"IF(ISBLANK(G14),\"\",G14/G17)","v":""},{"$f":"IF(ISBLANK(H14),\"\",H14/H17)","v":""},{"$f":"IF(ISBLANK(I14),\"\",I14/I17)","v":""}]
["Max Sp.Gr.",null,"G",{"$f":"'Des. Check'!H22","v":""},{"$f":"D19","v":""},{"$f":"E19","v":""},{"$f":"F19","v":""},{"$f":"G19","v":""},{"$f":"H19","v":""}]
["%AirVoid(100(G-F)/G)",null,"H",{"$f":"IF(ISBLANK(D14),,100*(D19-D18)/D19)","v":0},0,0,0,0,0]
["Deviation from average",null,null,{"$f":"IF(ISBLANK(D14),,D20-AVERAGE($D$20:$I$20))","v":0},0,0,0,0,0]
["Condition Specimen",null,null,null,null,null,null,null,null,null,false,false,false,false,false,false]
["Min. Saturated. Mass (70%)",null,null,{"$f":"IF(K22=FALSE,,D17*D20/100*0.7+D14)","v":0},0,0,0,0,0]
["Max. Saturated. Mass (80%)",null,null,{"$f":"IF(K22=FALSE,,D17*D20/100*0.8+D14)","v":0},0,0,0,0,0]
["Average",null,null,{"$f":"AVERAGE(D23:D24)","v":0},0,0,0,0,0]
[]
[null,null,"Saturated       ",null,"min.  @",null,"\"Hg"]
[]
["SSD Mass",null,"B'"]
["%Saturation(100J'/I)",null,null,{"$f":"IF(OR(K22=FALSE,ISBLANK(D29)),,((D29-D14)/(D20*D17/100))*100)","v":0},0,0,0,0,0]
[]
["Conditioned Min 16h in Freezer",null,null,"TIME IN:  ",null,null,"TIME OUT:"]
["Conditioned 24h in 140F water",null,null,"TIME IN:  ",null,null,"TIME OUT:"]
[]
["Thickness","(inches)","t\""]
["SSD mass",null,"B''"]
["Mass in water",null,"C''"]
["Load(lbs(kg))",null,"P\""]
["Dry Strength,2P/tDp",null,"Std",{"$f":"IF(OR(K22=TRUE,ISBLANK(D38)),0,(2*D38)/(D13*D12*3.14159))","v":0},0,0,0,0,0]
["Wet Strength2P\"/t''Dp",null,"Stm",{"$f":"IF(OR(K22=FALSE,ISBLANK(D38)),0,(2*D38)/(D35*D12*3.14159))","v":0},0,0,0,0,0]
["TSR 100S tm/S td",null,null,{"$f":"D45/D44*100","v":{"$error":"#DIV/0!"}}]
["Visual Moisture Damage"]
["Crack/Break Aggregate"]
["Average Dry Stength",null,null,{"$f":"((SUM(D39:I39))/((COUNTIF(D39:I39,\">0\"))))","v":{"$error":"#DIV/0!"}}]
["Average Wet Strength",null,null,{"$f":"((SUM(D40:I40))/((COUNTIF(D40:I40,\">0\"))))","v":{"$error":"#DIV/0!"}}]

{"sheet":"N.C.A.T(TDOT)","index":22,"n_rows":41,"n_cols":9,"rows_kept":41,"cut":false,"hidden":false,"merged":[[0,1,0,2],[1,0,1,6],[2,0,2,6],[4,0,4,6],[6,5,8,6],[27,3,27,6],[29,5,29,6],[30,3,30,4],[30,5,30,6],[31,3,31,4],[31,5,31,6],[33,5,33,6],[34,5,34,6],[36,3,36,4],[36,5,36,6],[37,3,37,4],[37,5,37,6],[38,3,38,4],[38,5,38,6],[48,5,48,6],[50,5,50,6],[41,5,41,6],[42,5,42,6],[44,5,44,6],[45,5,45,6],[46,5,46,6],[47,5,47,6]]}
["Sample",null,null,"Design No.",{"$f":"'JMF1'!H12","v":0}]
["             WASHED GRADATION FOR IGNITION FURNACE SAMPLES"]
["and A.C Correction Factor"]
[]
["AASHTO T-11 & AASHTO T-30"]
[]
["U.S.","CUMULATIVE",null,null,"JMF","One Test Range"]
["STANDARDS","WEIGHT","PERCENT","PERCENT","OR"]
["SIEVES","RETAINED","RETAINED","PASSING","SPECIFICATION"]
["1 1/2\"",null,{"$f":"IF(B10=0,0,B10/$C$31*100)","v":0},{"$f":"IF(C10=0,0,100-C10)","v":0},{"$f":"'JMF1'!I44","v":""},{"$f":"IF(E10=\"\",\"\",E10-6.5)","v":""},{"$f":"IF(I10>100,100,I10)","v":100},null,{"$f":"IF(E10=\"\",\"\",E10+6.5)","v":""}]
["1 1/4\"",null,{"$f":"IF(B11=0,0,B11/$C$31*100)","v":0},0,{"$f":"'JMF1'!I45","v":""},"",{"$f":"IF(I11>100,100,I11)","v":100},null,""]
["1\"",null,0,0,{"$f":"'JMF1'!I46","v":""},"",100,null,""]
["3/4\"",null,0,0,{"$f":"'JMF1'!I47","v":""},"",100,null,""]
["5/8\"",null,0,0,{"$f":"'JMF1'!I48","v":""},"",100,null,""]
["1/2\"",null,0,0,{"$f":"'JMF1'!I49","v":""},"",100,null,""]
["3/8\"",null,0,0,{"$f":"'JMF1'!I50","v":""},"",100,null,""]
["NO. 4",null,0,0,{"$f":"'JMF1'!I51","v":""},{"$f":"IF(E17=\"\",\"\",E17-4.62)","v":""},100,null,{"$f":"IF(E17=\"\",\"\",E17+4.62)","v":""}]
["NO. 8",null,0,0,{"$f":"'JMF1'!I52","v":""},{"$f":"IF(E18=\"\",\"\",E18-3.8)","v":""},100,null,{"$f":"IF(E18=\"\",\"\",E18+3.8)","v":""}]
["NO. 16",null,0,0,{"$f":"'JMF1'!I53","v":""},{"$f":"IF(E19=\"\",\"\",E19-3.8)","v":""},100,null,{"$f":"IF(E19=\"\",\"\",E19+3.8)","v":""}]
["NO. 30",null,0,{"$f":"IF(C20=0,0,100-C20)","v":0},{"$f":"'JMF1'!I54","v":""},{"$f":"IF(E20=\"\",\"\",E20-3.8)","v":""},100,null,{"$f":"IF(E20=\"\",\"\",E20+3.8)","v":""}]
["NO. 50",null,0,{"$f":"IF(C21=0,0,100-C21)","v":0},{"$f":"'JMF1'!I55","v":""},{"$f":"IF(E21=\"\",\"\",E21-3.8)","v":""},100,null,{"$f":"IF(E21=\"\",\"\",E21+3.8)","v":""}]
["NO. 100",null,0,{"$f":"IF(C22=0,0,100-C22)","v":0},{"$f":"'JMF1'!I56","v":""},{"$f":"IF(E22=\"\",\"\",E22-1.8)","v":""},100,null,{"$f":"IF(E22=\"\",\"\",E22+1.8)","v":""}]
["NO. 200",null,0,{"$f":"IF(C23=0,0,100-C23)","v":0},{"$f":"'JMF1'!I57","v":""},{"$f":"IF(E23=\"\",\"\",E23-1.8)","v":""},100,null,{"$f":"IF(E23=\"\",\"\",E23+1.8)","v":""}]
["PAN",null,0]
["WASH LOSS",{"$f":"C31-C32","v":0},0]
["TOTAL",{"$f":"B24+B25","v":0},0,{"$f":"IF(C26=0,0,100-C26)","v":0}]
["D.A.R."," --- "," ---",{"$f":"IF(OR(B26=0,ISBLANK(B26)),\"\",D23/F38)","v":""},"0.6 - 1.2"]
[null,"AGGREGATE AFTER BURN-OFF",null,"AC CONTENTS FROM NCAT FURNACE TICKET"]
[null,"AASHTO T-11"]
[]
["AGGREGATE WEIGHT",null,null,"          % Loss No. 1 (From ticket)"]
["WT.OF AGG. AFTER WASH (-)",null,null,"          % Loss  No. 2 (From ticket)"]
["WASH LOSS",null,{"$f":"C31-C32","v":0}]
[null,null,null,null,"Oven No."]
[]
[null,"AASHTO T-27"]
[null,null,null,"Average % Loss",null,{"$f":"IF(ISBLANK(F32),,AVERAGE(F31:F32))","v":0}]
["PAN WEIGHT",null,{"$f":"B24","v":0},"Design AC%",null,{"$f":"'Mix Des. Data'!B34","v":0}]
["ADD'L MASS -#200 (T27)",null,{"$f":"B24-B23","v":0},"Correction",null,{"$f":"IF(ISBLANK(F31),\"\",F37-F38)","v":""}]
["TOTAL MASS -#200",null,{"$f":"C39+C33","v":0}]
["TOTAL %PASSING #200",null,{"$f":"IF(ISBLANK(C31),,C40/C31*100)","v":0}]

{"sheet":"F.FACE(TDOT)","index":23,"n_rows":23,"n_cols":12,"rows_kept":23,"cut":false,"hidden":false,"merged":[]}
["Fractured Face Count"]
["Subsection 903.11(a)(3)"]
[]
["Is Crushed Gravel used as a coarse aggregate in this mix?",null,null,null,null,null,"Yes",null,null,null,null,2]
[null,null,null,null,null,null,"No"]
[]
[]
[]
[]
[]
[]
[]
[]
[]
[]
[]
[]
[]
[null,"No. of Particles Fractured"]
[null,"Total No. of Particles Inspected"]
[]
[]
[null,"% Fractured =",null,{"$f":"IF($L$4=1,ROUND(E19/E20*100,1),\"n/a\")","v":"n/a"},"%"]

{"sheet":"Glassy (TDOT)","index":24,"n_rows":25,"n_cols":12,"rows_kept":25,"cut":false,"hidden":false,"merged":[]}
["Glassy Particles (Slag)"]
["Subsection 903.11(a)(4)"]
[]
["Does mix contain slag used as coarse aggregate?",null,null,null,null,"Yes",null,null,null,null,null,2]
[null,null,null,null,null,"No"]
[]
[]
[]
[]
[]
[]
[]
[]
[]
[]
[]
[]
[]
[]
[]
[null,"Mass of Glassy Particles",null,null,null,"g"]
[null,"Total Mass of Sample Used",null,null,null,"g"]
[]
[]
[null,"% Glassy Particles =",null,null,{"$f":"IF($L$4=1,ROUND(E21/E22*100,1),\"N/A\")","v":"N/A"},"%"]

{"sheet":"LOI (TDOT)","index":25,"n_rows":34,"n_cols":12,"rows_kept":34,"cut":false,"hidden":false,"merged":[[33,4,33,5]]}
["Loss on Ignition (L. O. I.)"]
["T. D. O. T. Procedures"]
[]
[]
[null,null,null,null,"(1)",null,"(2)",null,"(3)",null,"(4)"]
["Mass Crucible & Test Sample",null,null,null,null,"g",null,"g",null,"g",null,"g"]
[null,"(before ignition)"]
[]
["Mass Crucible",null,null,"(-)",null,"g",null,"g",null,"g",null,"g"]
[]
[]
["Mass Test Sample",null,null,null,{"$f":"E6-E9","v":0},"g",{"$f":"G6-G9","v":0},"g",{"$f":"I6-I9","v":0},"g",{"$f":"K6-K9","v":0},"g"]
[]
[]
["Mass Crucible & Test Sample",null,null,null,null,"g",null,"g",null,"g",null,"g"]
[null,"(after ignition)"]
[]
["Mass Loss",null,null,null,{"$f":"E6-E15","v":0},"g",{"$f":"G6-G15","v":0},"g",{"$f":"I6-I15","v":0},"g",{"$f":"K6-K15","v":0},"g"]
[]
[]
[]
["Combined Masses from above:"]
[]
[null,"Mass of Test Samples",null,null,{"$f":"SUM(E12,G12,I12,K12)","v":0},null,"g"]
[]
[null,"Mass of Losses",null,null,{"$f":"SUM(E18,G18,I18,K18)","v":0},null,"g"]
[]
[]
[]
[]
[]
[]
[]
[null,"% L. O. I.",null,null,{"$f":"IF(ISBLANK(E6),\"\",(E26/E24)*100)","v":""}]

{"sheet":"OGFC (TDOT)","index":26,"n_rows":63,"n_cols":24,"rows_kept":63,"cut":false,"hidden":false,"merged":[[60,15,60,16],[62,13,62,14],[62,15,62,16],[52,12,52,14],[52,15,52,16],[54,12,54,14],[54,15,54,16],[56,12,56,14],[56,15,56,16],[43,6,43,8],[45,11,45,12],[48,12,48,14],[48,15,48,16],[50,12,50,14],[50,15,50,16],[38,12,38,14],[38,15,38,16],[40,12,40,14],[40,15,40,16],[42,12,42,14],[42,15,42,16],[27,14,27,16],[31,11,31,12],[34,12,34,14],[34,15,34,16],[36,12,36,14],[36,15,36,16],[23,2,23,5],[23,6,23,7],[24,14,24,16],[25,6,25,7],[26,11,26,12],[26,14,26,15],[22,12,23,18],[4,19,4,20],[6,3,6,4],[6,5,8,5],[6,6,6,9],[6,10,8,10],[6,11,6,12],[6,20,8,20],[7,3,8,3],[7,4,8,4],[7,6,8,6],[7,7,8,7],[7,8,8,8],[7,9,8,9],[7,11,8,11],[7,12,8,12],[1,2,1,9],[1,11,1,12],[2,11,2,12],[3,0,3,2],[3,5,3,9],[3,11,3,12]]}
["State of Tennessee Marshall Mix Design Sheet (OGFC)"]
["Type of Mix",null,{"$f":"IF(ISBLANK('JMF1'!E10),\"\",'JMF1'!E10)","v":"  "},null,null,null,null,null,null,null,"Date",{"$f":"IF(ISBLANK('JMF1'!C3),\"\",'JMF1'!C3)","v":""},null,null,"Effective Gravity of Aggregate",null,null,null,null,{"$f":"IF(ISBLANK('Rice SG'!H39),\"\",'Rice SG'!H39)","v":""}]
["HMA Producer",null,{"$f":"IF(ISBLANK('Mix Des. Data'!A4:J4),\"\",'Mix Des. Data'!C4:I4)","v":0},null,null,null,null,null,null,null,"Region",null,null,null,"SG of Asphalt",null,null,null,null,{"$f":"IF(ISBLANK('Mix Des. Data'!O4),\"\",'Mix Des. Data'!O4)","v":1.03}]
["Fiber Additive Producer",null,null,null,null,null,null,null,null,null,"Fiber%",{"$f":"IF(ISBLANK(OGFC!L4),\"\",OGFC!L4*100)","v":0},null,null,"Number of Blows w/ Marshall Hammer"]
[null,null,null,null,null,null,null,null,null,null,null,null,null,null,"Sealing Bag Specific Gravity"]
[]
[null,null,null,"Gmb by height (mm)",null,"Dry Weight (g)","Gmb by Corelok",null,null,null,"Re- Weigh OK?","Mass (g)",null,null,null,null,null,null,null,null,"% Loss","Unit"]
["Sample",null,null,"Height (mm)","Dia.    (in)",null,"Sealed Weight (g)","Sub merged Weight (g)","Re- Weigh (g)","Re-Weigh Dev. (g)",null,"Before Abrasion","After Abrasion","Volume",null,"Rice SG","VTM","VMA (Gse)","VMA (Gsb)","VFA",null,"Weight","VCADRC","VCAMix"]
["No.","% AC","% Agg.",null,null,null,null,null,null,null,null,null,null,"(cm3)","Bulk SG","or TMD","(%)","(%)","(%)","(%)",null,"(pcf)","(%)","(%)"]
["Extra-1",null,{"$f":"IF(ISBLANK(B10),\"\",100-B10)","v":""},null,null,null,null,null,null,null,{"$f":"IF(ISBLANK(I10),\"\",IF((OR(ABS(F10-I10)>5,J10<-1*F10*0.0008,J10>F10*0.0004)),\"NO\",\"YES\"))","v":""},null,null,{"$f":"IF(ISBLANK(F10),0,IF(ISBLANK(D10),I10+G10-F10-H10-((G10-F10)/$T$5),3.14159*0.25*E10*E10*2.54*2.54*D10*0.1))","v":0},{"$f":"IF(ISBLANK(F10),\"\",F10/N10)","v":""},{"$f":"IF(ISBLANK(F10),\"\",100/((C10/$T$2)+(B10/$T$3)))","v":""},{"$f":"IF(ISBLANK(F10),\"\",(P10-O13)/P10*100)","v":""},{"$f":"IF(ISBLANK(F10),\"\",100-((C10*O13)/$T$2))","v":""},{"$f":"IF(ISBLANK(F10),\"\",100-((C10*O13)/Stuff!$B$322))","v":""},{"$f":"IF(ISBLANK(F10),\"\",((B10*O13)/$T$3)/R10*100)","v":""},{"$f":"IF(ISBLANK(F10),\"\",((SUM(L10:L12))-(SUM(M10:M12)))/(SUM(L10:L12))*100)","v":""},{"$f":"IF(ISBLANK(F10),\"\",O13*62.4)","v":""},{"$f":"G44","v":""},{"$f":"IF(ISBLANK(F10),\"\",100-((O13/'Agg. S. G.'!$D$30)*'Agg. S. G.'!$G$6))","v":""}]
["Extra-2",null,null,null,null,null,null,null,null,null,{"$f":"IF(ISBLANK(I11),\"\",IF((OR(ABS(F11-I11)>5,J11<-1*F11*0.0008,J11>F11*0.0004)),\"NO\",\"YES\"))","v":""},null,null,{"$f":"IF(ISBLANK(F11),0,IF(ISBLANK(D11),I11+G11-F11-H11-((G11-F11)/$T$5),3.14159*0.25*E11*E11*2.54*2.54*D11*0.1))","v":0},{"$f":"IF(ISBLANK(F11),\"\",F11/N11)","v":""}]
["Extra-3",null,null,null,null,null,null,null,null,null,{"$f":"IF(ISBLANK(I12),\"\",IF((OR(ABS(F12-I12)>5,J12<-1*F12*0.0008,J12>F12*0.0004)),\"NO\",\"YES\"))","v":""},null,null,{"$f":"IF(ISBLANK(F12),0,IF(ISBLANK(D12),I12+G12-F12-H12-((G12-F12)/$T$5),3.14159*0.25*E12*E12*2.54*2.54*D12*0.1))","v":0},{"$f":"IF(ISBLANK(F12),\"\",F12/N12)","v":""}]
[null,null,null,null,null,null,null,null,null,null,null,null,null,"Avg",{"$f":"IF(ISBLANK(F10),\"\",AVERAGE(O10:O12))","v":""}]
[]
["Opt-1",{"$f":"IF(ISBLANK(OGFC!B35),\"\",OGFC!B35)","v":0},{"$f":"IF(ISBLANK(OGFC!B35),\"\",OGFC!C35)","v":100},null,null,null,null,null,null,null,{"$f":"IF(ISBLANK(I15),\"\",IF((OR(ABS(F15-I15)>5,J15<-1*F15*0.0008,J15>F15*0.0004)),\"NO\",\"YES\"))","v":""},null,null,{"$f":"IF(ISBLANK(F15),0,IF(ISBLANK(D15),I15+G15-F15-H15-((G15-F15)/$T$5),3.14159*0.25*E15*E15*2.54*2.54*D15*0.1))","v":0},{"$f":"IF(ISBLANK(F15),\"\",F15/N15)","v":""},{"$f":"IF(ISBLANK(F15),\"\",100/((C15/$T$2)+(B15/$T$3)))","v":""},{"$f":"IF(ISBLANK(F15),\"\",(P15-O18)/P15*100)","v":""},{"$f":"IF(ISBLANK(F15),\"\",100-((C15*O18)/$T$2))","v":""},{"$f":"IF(ISBLANK(F15),\"\",100-((C15*O18)/Stuff!$B$322))","v":""},{"$f":"IF(ISBLANK(F15),\"\",((B15*O18)/$T$3)/R15*100)","v":""},{"$f":"IF(ISBLANK(F15),\"\",((SUM(L15:L17))-(SUM(M15:M17)))/(SUM(L15:L17))*100)","v":""},{"$f":"IF(ISBLANK(F15),\"\",O18*62.4)","v":""},{"$f":"G44","v":""},{"$f":"IF(ISBLANK(F15),\"\",100-((O18/'Agg. S. G.'!$D$30)*'Agg. S. G.'!$G$6))","v":""}]
["Opt-2",null,null,null,null,null,null,null,null,null,{"$f":"IF(ISBLANK(I16),\"\",IF((OR(ABS(F16-I16)>5,J16<-1*F16*0.0008,J16>F16*0.0004)),\"NO\",\"YES\"))","v":""},null,null,{"$f":"IF(ISBLANK(F16),0,IF(ISBLANK(D16),I16+G16-F16-H16-((G16-F16)/$T$5),3.14159*0.25*E16*E16*2.54*2.54*D16*0.1))","v":0},{"$f":"IF(ISBLANK(F16),\"\",F16/N16)","v":""}]
["Opt-3",null,null,null,null,null,null,null,null,null,{"$f":"IF(ISBLANK(I17),\"\",IF((OR(ABS(F17-I17)>5,J17<-1*F17*0.0008,J17>F17*0.0004)),\"NO\",\"YES\"))","v":""},null,null,{"$f":"IF(ISBLANK(F17),0,IF(ISBLANK(D17),I17+G17-F17-H17-((G17-F17)/$T$5),3.14159*0.25*E17*E17*2.54*2.54*D17*0.1))","v":0},{"$f":"IF(ISBLANK(F17),\"\",F17/N17)","v":""}]
[null,null,null,null,null,null,null,null,null,null,null,null,null,"Avg",{"$f":"IF(ISBLANK(F15),\"\",AVERAGE(O15:O17))","v":""}]
[]
[]
[]
[]
[null,null,null,null,null,null,"T-19/ dry rodded unit",null,null,null,null,null,"Draindown Test"]
[null,null,"% of +4 Material",null,null,null,{"$f":"'Agg. S. G.'!G6","v":""}]
[null,null,null,null,null,null,null,null,null,null,null,null,null,null,"AASHTO T-305"]
[null,null,"gsb",null,null,null,{"$f":"IF(ISBLANK('Agg. S. G.'!F11),'Agg. S. G.'!N31,'Agg. S. G.'!E43)","v":""}]
[null,null,null,null,null,null,null,null,null,null,null,"AC Content:",null,{"$f":"IF(ISBLANK('Mix Des. Data'!B34),\"\",'Mix Des. Data'!B34)","v":""},"Fiber Content:",null,{"$f":"L4/100","v":0},"Temp:",{"$f":"IF(ISBLANK('JMF1'!D36),\"\",'JMF1'!D36)","v":""}]
[null,null,null,null,null,null,null,"Check 1","Check 2",null,null,null,null,null,"(by mass of total mix)"]
[null,null,null,null,null,"wt1",null,null,null,"(grams)"]
[null,null,null,null,null,"wt2"]
[null,null,null,null,null,"wt3"]
[null,null,null,null,null,null,null,null,null,null,null,"Sample #1:"]
[null,null,null,null,null,"vol 1",5.5E-2,5.5E-2,5.5E-2,"(ft3)"]
[null,null,null,null,null,"vol 2"]
[null,null,null,null,null,"vol 3",null,null,null,null,null,null,"Weight of Asphalt Sample:"]
[]
[null,null,null,null,null,"pcf 1",{"$f":"IF(ISBLANK(G29),\"\",(G29/453.6)/G33)","v":""},"","",null,null,null,"Weight of Drained AC and Pan:"]
[null,null,null,null,null,"pcf 2","","",""]
[null,null,null,null,null,"pcf 3","","","",null,null,null,"Weight of Pan:"]
[null,null,null,null,null,"Avg. PCF",{"$f":"IF(ISBLANK(G29),\"\",AVERAGE(G37:G39))","v":""},{"$f":"IF(ISBLANK(H29),\"\",AVERAGE(H37:H39))","v":""},{"$f":"IF(ISBLANK(I29),\"\",AVERAGE(I37:I39))","v":""}]
[null,null,null,null,null,null,null,null,null,null,null,null,"Weight of Drained AC:",null,null,{"$f":"P37-P39","v":0}]
[null,null,null,null,null,"VCAdrc",{"$f":"IF(ISBLANK(G29),\"\",(($G$26*62.4-G40)/($G$26*62.4))*100)","v":""},{"$f":"IF(ISBLANK(H29),\"\",(($G$26*62.4-H40)/($G$26*62.4))*100)","v":""},{"$f":"IF(ISBLANK(I29),\"\",(($G$26*62.4-I40)/($G$26*62.4))*100)","v":""}]
[null,null,null,null,null,null,null,null,null,null,null,null,"% Draindown:",null,null,{"$f":"IF(ISBLANK(P35),\"\",(P41/P35)*100)","v":""}]
[null,null,null,null,null,"AVG",{"$f":"IF(ISBLANK(G29),\"\",AVERAGE(G42:I42))","v":""}]
[]
[null,null,null,null,null,null,null,null,null,null,null,"Sample #2:"]
[]
[]
[null,null,null,null,null,null,null,null,null,null,null,null,"Weight of Asphalt Sample:"]
[]
[null,null,null,null,null,null,null,null,null,null,null,null,"Weight of Drained AC and Pan:"]
[]
[null,null,null,null,null,null,null,null,null,null,null,null,"Weight of Pan:"]
[]
[null,null,null,null,null,null,null,null,null,null,null,null,"Weight of Drained AC:",null,null,{"$f":"P51-P53","v":0}]
[]
[null,null,null,null,null,null,null,null,null,null,null,null,"% Draindown:",null,null,{"$f":"IF(ISBLANK(P49),\"\",(P55/P49)*100)","v":""}]
[]
[]
[]
[null,null,null,null,null,null,null,null,null,null,null,null,null,null,"Average:",{"$f":"IF(ISBLANK(P35),\"\",AVERAGE(P43,P57))","v":""}]
[]
[null,null,null,null,null,null,null,null,null,null,null,null,null," Design Spec.:",null,"< 0.3%"]

{"sheet":"OGFC","index":27,"n_rows":83,"n_cols":24,"rows_kept":83,"cut":false,"hidden":false,"merged":[[82,13,82,14],[82,15,82,16],[3,0,3,2],[3,5,3,9],[70,12,70,14],[70,15,70,16],[72,12,72,14],[65,11,65,12],[68,12,68,14],[68,15,68,16],[80,15,80,16],[56,15,56,16],[58,12,58,14],[58,15,58,16],[72,15,72,16],[74,12,74,14],[74,15,74,16],[60,12,60,14],[76,12,76,14],[76,15,76,16],[46,14,46,15],[47,14,47,16],[43,6,43,7],[51,11,51,12],[60,15,60,16],[44,14,44,16],[46,11,46,12],[1,2,1,9],[2,11,2,12],[63,6,63,8],[45,6,45,7],[42,12,43,18],[6,10,8,10],[43,2,43,5],[1,11,1,12],[3,11,3,12],[7,6,8,6],[62,12,62,14],[62,15,62,16],[54,12,54,14],[54,15,54,16],[56,12,56,14],[6,3,6,4],[4,19,4,20],[6,11,6,12],[7,11,8,11],[7,12,8,12],[6,20,8,20],[7,4,8,4],[7,3,8,3],[6,6,6,9],[6,5,8,5],[7,9,8,9],[7,8,8,8],[7,7,8,7]]}
["State of Tennessee Marshall Mix Design Sheet"]
["Type of Mix",null,{"$f":"'JMF1'!E10","v":"  "},null,null,null,null,null,null,null,"Date",{"$f":"'JMF1'!C3","v":"00:00:00"},null,null,"Effective Gravity of Aggregate",null,null,null,null,{"$f":"'Rice SG'!H39","v":""}]
["HMA Producer",null,{"$f":"'JMF1'!C8","v":0},null,null,null,null,null,null,null,"Region",{"$f":"'JMF1'!C4","v":0},null,null,"SG of Asphalt",null,null,null,null,{"$f":"'Rice SG'!H33","v":1.03}]
["Fiber Additive Producer",null,null,null,null,null,null,null,null,null,"Fiber%",{"$f":"VLOOKUP(Stuff!C327,Stuff!A328:B330,2)","v":0},null,null,"Number of Blows w/ Marshall Hammer"]
[null,null,null,null,null,null,null,null,null,null,null,null,null,null,"Sealing Bag Specific Gravity"]
[]
[null,null,null,"Gmb by height (mm)",null,"Dry Weight (g)","Gmb by Corelok",null,null,null,"Re- Weigh OK?","Mass (g)",null,null,null,null,null,null,null,null,"% Loss","Unit"]
["Sample",null,null,"Height (mm)","Dia.    (in)",null,"Sealed Weight (g)","Sub merged Weight (g)","Re- Weigh (g)","Re-Weigh Dev. (g)",null,"Before Abrasion","After Abrasion","Volume",null,"Rice SG","VTM","VMA (Gse)","VMA (Gsb)","VFA",null,"Weight","VCADRC","VCAMix"]
["No.","% AC","% Agg.",null,null,null,null,null,null,null,null,null,null,"(cm3)","Bulk SG","or TMD","(%)","(%)","(%)","(%)",null,"(pcf)","(%)","(%)"]
["1-1",{"$f":"'Mix Des. Data'!B9","v":0},{"$f":"IF(ISBLANK(B10),\"\",100-B10)","v":100},null,null,null,null,null,null,{"$f":"IF(ISBLANK(I10),\"\",I10-F10)","v":""},{"$f":"IF(ISBLANK(I10),\"\",IF((OR(ABS(F10-I10)>5,J10<-1*F10*0.0008,J10>F10*0.0004)),\"NO\",\"YES\"))","v":""},null,null,{"$f":"IF(ISBLANK(F10),0,IF(ISBLANK(D10),I10+G10-F10-H10-((G10-F10)/$T$5),3.14159*0.25*E10*E10*2.54*2.54*D10*0.1))","v":0},{"$f":"IF(ISBLANK(F10),\"\",F10/N10)","v":""},{"$f":"IF(ISBLANK(F10),\"\",100/((C10/$T$2)+(B10/$T$3)))","v":""},{"$f":"IF(ISBLANK(F10),\"\",(P10-O13)/P10*100)","v":""},{"$f":"IF(ISBLANK(F10),\"\",100-((C10*O13)/$T$2))","v":""},{"$f":"IF(ISBLANK(F10),\"\",100-((C10*O13)/Stuff!$B$322))","v":""},{"$f":"IF(ISBLANK(F10),\"\",((B10*O13)/$T$3)/R10*100)","v":""},{"$f":"IF(ISBLANK(F10),\"\",((SUM(L10:L12))-(SUM(M10:M12)))/(SUM(L10:L12))*100)","v":""},{"$f":"IF(ISBLANK(F10),\"\",O13*62.4)","v":""},{"$f":"G64","v":""},{"$f":"IF(ISBLANK(F10),\"\",100-((O13/'Agg. S. G.'!$D$30)*'Agg. S. G.'!$G$6))","v":""}]
["1-2",null,null,null,null,null,null,null,null,null,{"$f":"IF(ISBLANK(I11),\"\",IF((OR(ABS(F11-I11)>5,J11<-1*F11*0.0008,J11>F11*0.0004)),\"NO\",\"YES\"))","v":""},null,null,{"$f":"IF(ISBLANK(F11),0,IF(ISBLANK(D11),I11+G11-F11-H11-((G11-F11)/$T$5),3.14159*0.25*E11*E11*2.54*2.54*D11*0.1))","v":0},{"$f":"IF(ISBLANK(F11),\"\",F11/N11)","v":""}]
["1-3",null,null,null,null,null,null,null,null,null,{"$f":"IF(ISBLANK(I12),\"\",IF((OR(ABS(F12-I12)>5,J12<-1*F12*0.0008,J12>F12*0.0004)),\"NO\",\"YES\"))","v":""},null,null,{"$f":"IF(ISBLANK(F12),0,IF(ISBLANK(D12),I12+G12-F12-H12-((G12-F12)/$T$5),3.14159*0.25*E12*E12*2.54*2.54*D12*0.1))","v":0},{"$f":"IF(ISBLANK(F12),\"\",F12/N12)","v":""}]
[null,null,null,null,null,null,null,null,null,null,null,null,null,"Avg",{"$f":"IF(ISBLANK(F10),\"\",AVERAGE(O10:O12))","v":""}]
[]
["2-1",{"$f":"'Mix Des. Data'!B14","v":0},{"$f":"IF(ISBLANK(B15),\"\",100-B15)","v":100},null,null,null,null,null,null,null,{"$f":"IF(ISBLANK(I15),\"\",IF((OR(ABS(F15-I15)>5,J15<-1*F15*0.0008,J15>F15*0.0004)),\"NO\",\"YES\"))","v":""},null,null,{"$f":"IF(ISBLANK(F15),0,IF(ISBLANK(D15),I15+G15-F15-H15-((G15-F15)/$T$5),3.14159*0.25*E15*E15*2.54*2.54*D15*0.1))","v":0},{"$f":"IF(ISBLANK(F15),\"\",F15/N15)","v":""},{"$f":"IF(ISBLANK(F15),\"\",100/((C15/$T$2)+(B15/$T$3)))","v":""},{"$f":"IF(ISBLANK(F15),\"\",(P15-O18)/P15*100)","v":""},{"$f":"IF(ISBLANK(F15),\"\",100-((C15*O18)/$T$2))","v":""},{"$f":"IF(ISBLANK(F15),\"\",100-((C15*O18)/Stuff!$B$322))","v":""},{"$f":"IF(ISBLANK(F15),\"\",((B15*O18)/$T$3)/R15*100)","v":""},{"$f":"IF(ISBLANK(F15),\"\",((SUM(L15:L17))-(SUM(M15:M17)))/(SUM(L15:L17))*100)","v":""},{"$f":"IF(ISBLANK(F15),\"\",O18*62.4)","v":""},{"$f":"G64","v":""},{"$f":"IF(ISBLANK(F15),\"\",100-((O18/'Agg. S. G.'!$D$30)*'Agg. S. G.'!$G$6))","v":""}]
["2-2",null,null,null,null,null,null,null,null,null,{"$f":"IF(ISBLANK(I16),\"\",IF((OR(ABS(F16-I16)>5,J16<-1*F16*0.0008,J16>F16*0.0004)),\"NO\",\"YES\"))","v":""},null,null,{"$f":"IF(ISBLANK(F16),0,IF(ISBLANK(D16),I16+G16-F16-H16-((G16-F16)/$T$5),3.14159*0.25*E16*E16*2.54*2.54*D16*0.1))","v":0},{"$f":"IF(ISBLANK(F16),\"\",F16/N16)","v":""}]
["2-3",null,null,null,null,null,null,null,null,null,{"$f":"IF(ISBLANK(I17),\"\",IF((OR(ABS(F17-I17)>5,J17<-1*F17*0.0008,J17>F17*0.0004)),\"NO\",\"YES\"))","v":""},null,null,{"$f":"IF(ISBLANK(F17),0,IF(ISBLANK(D17),I17+G17-F17-H17-((G17-F17)/$T$5),3.14159*0.25*E17*E17*2.54*2.54*D17*0.1))","v":0},{"$f":"IF(ISBLANK(F17),\"\",F17/N17)","v":""}]
[null,null,null,null,null,null,null,null,null,null,null,null,null,"Avg",{"$f":"IF(ISBLANK(F15),\"\",AVERAGE(O15:O17))","v":""}]
[]
["3-1",{"$f":"'Mix Des. Data'!B19","v":0},{"$f":"IF(ISBLANK(B20),\"\",100-B20)","v":100},null,null,null,null,null,null,null,{"$f":"IF(ISBLANK(I20),\"\",IF((OR(ABS(F20-I20)>5,J20<-1*F20*0.0008,J20>F20*0.0004)),\"NO\",\"YES\"))","v":""},null,null,{"$f":"IF(ISBLANK(F20),0,IF(ISBLANK(D20),I20+G20-F20-H20-((G20-F20)/$T$5),3.14159*0.25*E20*E20*2.54*2.54*D20*0.1))","v":0},{"$f":"IF(ISBLANK(F20),\"\",F20/N20)","v":""},{"$f":"IF(ISBLANK(F20),\"\",100/((C20/$T$2)+(B20/$T$3)))","v":""},{"$f":"IF(ISBLANK(F20),\"\",(P20-O23)/P20*100)","v":""},{"$f":"IF(ISBLANK(F20),\"\",100-((C20*O23)/$T$2))","v":""},{"$f":"IF(ISBLANK(F20),\"\",100-((C20*O23)/Stuff!$B$322))","v":""},{"$f":"IF(ISBLANK(F20),\"\",((B20*O23)/$T$3)/R20*100)","v":""},{"$f":"IF(ISBLANK(F20),\"\",((SUM(L20:L22))-(SUM(M20:M22)))/(SUM(L20:L22))*100)","v":""},{"$f":"IF(ISBLANK(F20),\"\",O23*62.4)","v":""},{"$f":"G64","v":""},{"$f":"IF(ISBLANK(F20),\"\",100-((O23/'Agg. S. G.'!$D$30)*'Agg. S. G.'!$G$6))","v":""}]
["3-2",null,null,null,null,null,null,null,null,null,{"$f":"IF(ISBLANK(I21),\"\",IF((OR(ABS(F21-I21)>5,J21<-1*F21*0.0008,J21>F21*0.0004)),\"NO\",\"YES\"))","v":""},null,null,{"$f":"IF(ISBLANK(F21),0,IF(ISBLANK(D21),I21+G21-F21-H21-((G21-F21)/$T$5),3.14159*0.25*E21*E21*2.54*2.54*D21*0.1))","v":0},{"$f":"IF(ISBLANK(F21),\"\",F21/N21)","v":""}]
["3-3",null,null,null,null,null,null,null,null,null,{"$f":"IF(ISBLANK(I22),\"\",IF((OR(ABS(F22-I22)>5,J22<-1*F22*0.0008,J22>F22*0.0004)),\"NO\",\"YES\"))","v":""},null,null,{"$f":"IF(ISBLANK(F22),0,IF(ISBLANK(D22),I22+G22-F22-H22-((G22-F22)/$T$5),3.14159*0.25*E22*E22*2.54*2.54*D22*0.1))","v":0},{"$f":"IF(ISBLANK(F22),\"\",F22/N22)","v":""}]
[null,null,null,null,null,null,null,null,null,null,null,null,null,"Avg",{"$f":"IF(ISBLANK(F20),\"\",AVERAGE(O20:O22))","v":""}]
[]
["4-1",{"$f":"'Mix Des. Data'!B24","v":0},{"$f":"IF(ISBLANK(B25),\"\",100-B25)","v":100},null,null,null,null,null,null,null,{"$f":"IF(ISBLANK(I25),\"\",IF((OR(ABS(F25-I25)>5,J25<-1*F25*0.0008,J25>F25*0.0004)),\"NO\",\"YES\"))","v":""},null,null,{"$f":"IF(ISBLANK(F25),0,IF(ISBLANK(D25),I25+G25-F25-H25-((G25-F25)/$T$5),3.14159*0.25*E25*E25*2.54*2.54*D25*0.1))","v":0},{"$f":"IF(ISBLANK(F25),\"\",F25/N25)","v":""},{"$f":"IF(ISBLANK(F25),\"\",100/((C25/$T$2)+(B25/$T$3)))","v":""},{"$f":"IF(ISBLANK(F25),\"\",(P25-O28)/P25*100)","v":""},{"$f":"IF(ISBLANK(F25),\"\",100-((C25*O28)/$T$2))","v":""},{"$f":"IF(ISBLANK(F25),\"\",100-((C25*O28)/Stuff!$B$322))","v":""},{"$f":"IF(ISBLANK(F25),\"\",((B25*O28)/$T$3)/R25*100)","v":""},{"$f":"IF(ISBLANK(F25),\"\",((SUM(L25:L27))-(SUM(M25:M27)))/(SUM(L25:L27))*100)","v":""},{"$f":"IF(ISBLANK(F25),\"\",O28*62.4)","v":""},{"$f":"G64","v":""},{"$f":"IF(ISBLANK(F25),\"\",100-((O28/'Agg. S. G.'!$D$30)*'Agg. S. G.'!$G$6))","v":""}]
["4-2",null,null,null,null,null,null,null,null,null,{"$f":"IF(ISBLANK(I26),\"\",IF((OR(ABS(F26-I26)>5,J26<-1*F26*0.0008,J26>F26*0.0004)),\"NO\",\"YES\"))","v":""},null,null,{"$f":"IF(ISBLANK(F26),0,IF(ISBLANK(D26),I26+G26-F26-H26-((G26-F26)/$T$5),3.14159*0.25*E26*E26*2.54*2.54*D26*0.1))","v":0},{"$f":"IF(ISBLANK(F26),\"\",F26/N26)","v":""}]
["4-3",null,null,null,null,null,null,null,null,null,{"$f":"IF(ISBLANK(I27),\"\",IF((OR(ABS(F27-I27)>5,J27<-1*F27*0.0008,J27>F27*0.0004)),\"NO\",\"YES\"))","v":""},null,null,{"$f":"IF(ISBLANK(F27),0,IF(ISBLANK(D27),I27+G27-F27-H27-((G27-F27)/$T$5),3.14159*0.25*E27*E27*2.54*2.54*D27*0.1))","v":0},{"$f":"IF(ISBLANK(F27),\"\",F27/N27)","v":""}]
[null,null,null,null,null,null,null,null,null,null,null,null,null,"Avg",{"$f":"IF(ISBLANK(F25),\"\",AVERAGE(O25:O27))","v":""}]
[]
["5-1",{"$f":"'Mix Des. Data'!B29","v":0},{"$f":"IF(ISBLANK(B30),\"\",100-B30)","v":100},null,null,null,null,null,null,null,{"$f":"IF(ISBLANK(I30),\"\",IF((OR(ABS(F30-I30)>5,J30<-1*F30*0.0008,J30>F30*0.0004)),\"NO\",\"YES\"))","v":""},null,null,{"$f":"IF(ISBLANK(F30),0,IF(ISBLANK(D30),I30+G30-F30-H30-((G30-F30)/$T$5),3.14159*0.25*E30*E30*2.54*2.54*D30*0.1))","v":0},{"$f":"IF(ISBLANK(F30),\"\",F30/N30)","v":""},{"$f":"IF(ISBLANK(F30),\"\",100/((C30/$T$2)+(B30/$T$3)))","v":""},{"$f":"IF(ISBLANK(F30),\"\",(P30-O33)/P30*100)","v":""},{"$f":"IF(ISBLANK(F30),\"\",100-((C30*O33)/$T$2))","v":""},{"$f":"IF(ISBLANK(F30),\"\",100-((C30*O33)/Stuff!$B$322))","v":""},{"$f":"IF(ISBLANK(F30),\"\",((B30*O33)/$T$3)/R30*100)","v":""},{"$f":"IF(ISBLANK(F30),\"\",((SUM(L30:L32))-(SUM(M30:M32)))/(SUM(L30:L32))*100)","v":""},{"$f":"IF(ISBLANK(F30),\"\",O33*62.4)","v":""},{"$f":"G64","v":""},{"$f":"IF(ISBLANK(F30),\"\",100-((O33/'Agg. S. G.'!$D$30)*'Agg. S. G.'!$G$6))","v":""}]
["5-2",null,null,null,null,null,null,null,null,null,{"$f":"IF(ISBLANK(I31),\"\",IF((OR(ABS(F31-I31)>5,J31<-1*F31*0.0008,J31>F31*0.0004)),\"NO\",\"YES\"))","v":""},null,null,{"$f":"IF(ISBLANK(F31),0,IF(ISBLANK(D31),I31+G31-F31-H31-((G31-F31)/$T$5),3.14159*0.25*E31*E31*2.54*2.54*D31*0.1))","v":0},{"$f":"IF(ISBLANK(F31),\"\",F31/N31)","v":""}]
["5-3",null,null,null,null,null,null,null,null,null,{"$f":"IF(ISBLANK(I32),\"\",IF((OR(ABS(F32-I32)>5,J32<-1*F32*0.0008,J32>F32*0.0004)),\"NO\",\"YES\"))","v":""},null,null,{"$f":"IF(ISBLANK(F32),0,IF(ISBLANK(D32),I32+G32-F32-H32-((G32-F32)/$T$5),3.14159*0.25*E32*E32*2.54*2.54*D32*0.1))","v":0},{"$f":"IF(ISBLANK(F32),\"\",F32/N32)","v":""}]
[null,null,null,null,null,null,null,null,null,null,null,null,null,"Avg",{"$f":"IF(ISBLANK(F30),\"\",AVERAGE(O30:O32))","v":""}]
[]
["Opt-1",{"$f":"'Mix Des. Data'!B34","v":0},{"$f":"IF(ISBLANK(B35),\"\",100-B35)","v":100},null,null,null,null,null,null,null,{"$f":"IF(ISBLANK(I35),\"\",IF((OR(ABS(F35-I35)>5,J35<-1*F35*0.0008,J35>F35*0.0004)),\"NO\",\"YES\"))","v":""},null,null,{"$f":"IF(ISBLANK(F35),0,IF(ISBLANK(D35),I35+G35-F35-H35-((G35-F35)/$T$5),3.14159*0.25*E35*E35*2.54*2.54*D35*0.1))","v":0},{"$f":"IF(ISBLANK(F35),\"\",F35/N35)","v":""},{"$f":"IF(ISBLANK(F35),\"\",100/((C35/$T$2)+(B35/$T$3)))","v":""},{"$f":"IF(ISBLANK(F35),\"\",(P35-O38)/P35*100)","v":""},{"$f":"IF(ISBLANK(F35),\"\",100-((C35*O38)/$T$2))","v":""},{"$f":"IF(ISBLANK(F35),\"\",100-((C35*O38)/Stuff!$B$322))","v":""},{"$f":"IF(ISBLANK(F35),\"\",((B35*O38)/$T$3)/R35*100)","v":""},{"$f":"IF(ISBLANK(F35),\"\",((SUM(L35:L37))-(SUM(M35:M37)))/(SUM(L35:L37))*100)","v":""},{"$f":"IF(ISBLANK(F35),\"\",O38*62.4)","v":""},{"$f":"G64","v":""},{"$f":"IF(ISBLANK(F35),\"\",100-((O38/'Agg. S. G.'!$D$30)*'Agg. S. G.'!$G$6))","v":""}]
["Opt-2",null,null,null,null,null,null,null,null,null,{"$f":"IF(ISBLANK(I36),\"\",IF((OR(ABS(F36-I36)>5,J36<-1*F36*0.0008,J36>F36*0.0004)),\"NO\",\"YES\"))","v":""},null,null,{"$f":"IF(ISBLANK(F36),0,IF(ISBLANK(D36),I36+G36-F36-H36-((G36-F36)/$T$5),3.14159*0.25*E36*E36*2.54*2.54*D36*0.1))","v":0},{"$f":"IF(ISBLANK(F36),\"\",F36/N36)","v":""}]
["Opt-3",null,null,null,null,null,null,null,null,null,{"$f":"IF(ISBLANK(I37),\"\",IF((OR(ABS(F37-I37)>5,J37<-1*F37*0.0008,J37>F37*0.0004)),\"NO\",\"YES\"))","v":""},null,null,{"$f":"IF(ISBLANK(F37),0,IF(ISBLANK(D37),I37+G37-F37-H37-((G37-F37)/$T$5),3.14159*0.25*E37*E37*2.54*2.54*D37*0.1))","v":0},{"$f":"IF(ISBLANK(F37),\"\",F37/N37)","v":""}]
[null,null,null,null,null,null,null,null,null,null,null,null,null,"Avg",{"$f":"IF(ISBLANK(F35),\"\",AVERAGE(O35:O37))","v":""}]
[]
[]
[]
[]
[null,null,null,null,null,null,"T-19/ dry rodded unit",null,null,null,null,null,"Draindown Test"]
[null,null,"% of +4 Material",null,null,null,{"$f":"'Agg. S. G.'!G6","v":""}]
[null,null,null,null,null,null,null,null,null,null,null,null,null,null,"AASHTO T-305"]
[null,null,"gsb",null,null,null,{"$f":"'Agg. S. G.'!D30","v":""}]
[null,null,null,null,null,null,null,null,null,null,null,"AC Content:",null,{"$f":"'Mix Des. Data'!B34","v":0},"Fiber Content:",null,{"$f":"L4","v":0},"Temp:",{"$f":"'JMF1'!D36","v":0}]
[null,null,null,null,null,null,null,"Check 1","Check 2",null,null,null,null,null,"(by mass of total mix)"]
[null,null,null,null,null,"wt1",null,null,null,"(grams)"]
[null,null,null,null,null,"wt2"]
[null,null,null,null,null,"wt3"]
[null,null,null,null,null,null,null,null,null,null,null,"Sample #1:"]
[null,null,null,null,null,"vol 1",null,null,null,"(ft3)"]
[null,null,null,null,null,"vol 2"]
[null,null,null,null,null,"vol 3",null,null,null,null,null,null,"Weight of Asphalt Sample:"]
[]
[null,null,null,null,null,"pcf 1",{"$f":"IF(ISBLANK(G49),\"\",(G49/453.6)/G53)","v":""},"","",null,null,null,"Weight of Drained AC and Pan:"]
[null,null,null,null,null,"pcf 2","","",""]
[null,null,null,null,null,"pcf 3","","","",null,null,null,"Weight of Pan:"]
[null,null,null,null,null,"Avg. PCF",{"$f":"IF(ISBLANK(G49),\"\",AVERAGE(G57:G59))","v":""},{"$f":"IF(ISBLANK(H49),\"\",AVERAGE(H57:H59))","v":""},{"$f":"IF(ISBLANK(I49),\"\",AVERAGE(I57:I59))","v":""}]
[null,null,null,null,null,null,null,null,null,null,null,null,"Weight of Drained AC:",null,null,{"$f":"P57-P59","v":0}]
[null,null,null,null,null,"VCAdrc",{"$f":"IF(ISBLANK(G49),\"\",(($G$46*62.4-G60)/($G$46*62.4))*100)","v":""},{"$f":"IF(ISBLANK(H49),\"\",(($G$46*62.4-H60)/($G$46*62.4))*100)","v":""},{"$f":"IF(ISBLANK(I49),\"\",(($G$46*62.4-I60)/($G$46*62.4))*100)","v":""}]
[null,null,null,null,null,null,null,null,null,null,null,null,"% Draindown:",null,null,{"$f":"IF(ISBLANK(P55),\"\",(P61/P55)*100)","v":""}]
[null,null,null,null,null,"AVG",{"$f":"IF(ISBLANK(G49),\"\",AVERAGE(G62:I62))","v":""}]
[]
[null,null,null,null,null,null,null,null,null,null,null,"Sample #2:"]
[]
[]
[null,null,null,null,null,null,null,null,null,null,null,null,"Weight of Asphalt Sample:"]
[]
[null,null,null,null,null,null,null,null,null,null,null,null,"Weight of Drained AC and Pan:"]
[]
[null,null,null,null,null,null,null,null,null,null,null,null,"Weight of Pan:"]
[]
[null,null,null,null,null,null,null,null,null,null,null,null,"Weight of Drained AC:",null,null,{"$f":"P71-P73","v":0}]
[]
[null,null,null,null,null,null,null,null,null,null,null,null,"% Draindown:",null,null,{"$f":"IF(ISBLANK(P69),\"\",(P75/P69)*100)","v":""}]
[]
[]
[]
[null,null,null,null,null,null,null,null,null,null,null,null,null,null,"Average:",{"$f":"IF(ISBLANK(P55),\"\",AVERAGE(P63,P77))","v":""}]
[]
[null,null,null,null,null,null,null,null,null,null,null,null,null," Design Spec.:",null,"< 0.3%"]

{"sheet":"OGFC TSR","index":28,"n_rows":36,"n_cols":15,"rows_kept":36,"cut":false,"hidden":false,"merged":[[8,3,8,4],[8,6,8,8],[20,4,20,5],[20,7,20,8],[4,3,4,6],[5,3,5,4],[5,6,5,7],[6,3,6,4],[6,6,6,7]]}
[]
[null,"MOISTURE DAMAGE LABORATORY DATA"]
[null,"SHEET"]
[]
[null,null,"Mix Type",{"$f":"'JMF1'!E10","v":"  "}]
[null,null,"Additive:  ",{"$f":"'JMF1'!D25","v":0},null,"Dosage:  ",{"$f":"'JMF1'!I25","v":" "}]
[null,null,"Compaction Method:  ",null,null,"Effort:  "]
[null,null,"Aggregate Effective Gravity:  ",{"$f":"'Rice SG'!H39","v":""},null,"Opt. AC content (%):  ",{"$f":"'Mix Des. Data'!B34","v":0}]
[null,null,"Date Tested:  ",null,null,"By:  "]
[null,"Sample I.D.",null,"1","2","3","4","5","6"]
[null,"Diameter, in (D)"]
[null,"Thickness, mm (t)"]
[null,"Dry mass in air (A)"]
[null,"Volume(E)","B-C",{"$f":"3.14159*0.25*D11*D11*2.54*2.54*D12*0.1","v":0},0,0,0,0,0]
[null,"Bulk Sp. Gr. (F)","A/E",{"$f":"IF(D14=0,\"\",D13/D14)","v":""},"","","","",""]
[null,"Max. Sp. Gravity (G)",null,{"$f":"IF(ISBLANK($D11),\"\",100/(((100-$G$8)/$D$8)+($G$8/'Rice SG'!$H33)))","v":""},{"$f":"IF(ISBLANK($D11),\"\",100/(((100-$G$8)/$D$8)+($G$8/'Rice SG'!$H33)))","v":""},{"$f":"IF(ISBLANK($D11),\"\",100/(((100-$G$8)/$D$8)+($G$8/'Rice SG'!$H33)))","v":""},{"$f":"IF(ISBLANK($D11),\"\",100/(((100-$G$8)/$D$8)+($G$8/'Rice SG'!$H33)))","v":""},{"$f":"IF(ISBLANK($D11),\"\",100/(((100-$G$8)/$D$8)+($G$8/'Rice SG'!$H33)))","v":""},{"$f":"IF(ISBLANK($D11),\"\",100/(((100-$G$8)/$D$8)+($G$8/'Rice SG'!$H33)))","v":""}]
[null,"% Air Void","(100(G-F)/G)",{"$f":"IF(ISBLANK(D13),\"\",100*(D16-D15)/D16)","v":""},"","","","",""]
[null,"Deviation from Average",null,{"$f":"D17-AVERAGEA($D$17:$I$17)","v":{"$error":"#VALUE!"}},{"$error":"#VALUE!"},{"$error":"#VALUE!"},{"$error":"#VALUE!"},{"$error":"#VALUE!"},{"$error":"#VALUE!"}]
[null,"Condition Specimen: (x)",null,null,null,null,null,null,null,true,true,true,false,false,false]
[]
[null,"Conditioned 24h in 140°F water.",null,"Time In",null,null,"Time Out"]
[null," "]
[null,"Thickness (t)",null,{"$f":"D12","v":0},{"$f":"E12","v":0},0,0,0,0]
[null,"Load (P)"]
[null,"Dry (STd)","see Note 1",{"$f":"IF(ISBLANK(D24),\"\",IF(J19=TRUE,\"\",ROUND(2*D24*25.4/(3.14*D23*D11),1)))","v":""},"","","","",""]
[null,"Wet (STm)","see Note 1",{"$f":"IF(J19=TRUE,2*D24*25.4/(3.14*D23*D11),\"\")","v":{"$error":"#DIV/0!"}},{"$error":"#DIV/0!"},{"$error":"#DIV/0!"},"","",""]
[]
[null,"Results"]
[]
[null,"TSR",null,{"$f":"IF(ISBLANK(D24),\"\",100*E34/H34)","v":""}]
[null,"Visual Moisture Damage"]
[null,"Visual Aggregate Breakage "]
[]
[null,null,null,"CONDITIONED =",{"$f":"IF(ISBLANK(D24),\"\",AVERAGE(D26,E26,F26,G26,H26,I26))","v":""},null,"UNCONDITIONED =",{"$f":"IF(ISBLANK(D24),\"\",AVERAGE(D25,E25,F25,G25,H25,I25))","v":""}]
[]
[null,null,"Note 1:"]

{"sheet":"OGFC Graphs","index":29,"n_rows":11,"n_cols":24,"rows_kept":11,"cut":false,"hidden":false,"merged":[[0,0,0,9]]}
["State of Tennessee Marshall Mix Design Graphs"]
[]
[]
[]
[]
[]
[]
[]
[]
[null,null,null,null,null,null,null,null,null,null,null,null,null,null,null,null,null,null,null,null,null,null,3.5,8.5]
[null,null,null,null,null,null,null,null,null,null,null,null,null,null,null,null,null,null,null,null,null,null,20,20]

{"sheet":"FILM THICKNESS","index":30,"n_rows":36,"n_cols":9,"rows_kept":36,"cut":false,"hidden":false,"merged":[[7,1,7,2],[7,3,7,5],[2,1,2,8],[1,1,1,8],[4,3,4,5],[5,3,5,5],[6,3,6,5],[4,1,4,2],[5,1,5,2],[6,1,6,2]]}
[]
[null,"FILM THICKNESS ESTIMATE"]
[null,"Surface Area Factors after HVEEM Method"]
[]
[null,null,null,null,null,null,null,"% AC =",{"$f":"'Mix Des. Data'!B34","v":0}]
[]
[null,"PRODUCER:",null,{"$f":"'JMF1'!C8","v":0},null,null,null,"% AGG =",{"$f":"100-I5","v":100}]
[null,"MIX TYPE:",null,{"$f":"'JMF1'!E10","v":"  "}]
[null,null,null,null,null,null,null,"AC SG =",{"$f":"'Rice SG'!H33","v":1.03}]
[null,null,"SIEVE","% PASS","FACTOR","SA"]
[]
[null,null,2.5]
[null,null,2,null,2]
[null,null,1.5,null,2]
[null,null,1.25,null,2]
[null,null,0.75,null,2]
[null,null,0.375,null,2,{"$f":"IF(500-(D13+D14+D15+D16+D17)>0,1*2)","v":2}]
[null,null,"#4",null,2,{"$f":"D18/100*E18","v":0}]
[null,null,"#8",null,4,0]
[null,null,"#16",null,8,0]
[null,null,"#30",null,14,0]
[null,null,"#50",null,30,0]
[null,null,"#100",null,60,0]
[null,null,"#200",null,160,0]
[]
[null,null,null,"TOTAL",null,{"$f":"SUM(F17:F24)","v":2}]
[]
[]
[null,null,"% AGG X SA=",null,null,{"$f":"I7/100*F26","v":2},"SF"]
[null,1]
[null,null,"%AC/(62.4xAC SG)=",null,null,{"$f":"(I5/100)/(62.4*I9)","v":0},"CF"]
[null,2]
[null,null,"CF AC/SF AC=",null,null,{"$f":"F31/F29","v":0}]
[null,3]
[null,null,"FILM THICKNESS=",null,null,{"$f":"304800*F33","v":0},"MICRONS"]
[null,4]

{"sheet":"HMA Producers","index":31,"n_rows":157,"n_cols":7,"rows_kept":157,"cut":false,"hidden":true,"merged":[]}
["PRODUCERS"]
[1]
[2,null,null,null,1,"ATS Construction - Williamsburg KY",59900109]
[3,null,null,null,1,"B & F Hot Mix - Asphalt Mix",11300001]
[4,null,null,null,1,"Blalock Asphalt - Kodak Asphalt Mix",17800001]
[5,null,null,null,1,"Blalock Asphalt - Sevierville Asphalt Mix",17800002]
[6,null,null,null,1,"Duracap Asphalt Paving - Bean Station Asphalt Mix",12900004]
[7,null,null,null,1,"Duracap Asphalt Paving - Heiskell Asphalt Mix",14700015]
[8,null,null,null,1,"Duracap Asphalt Paving - Knoxville Asphalt Mix",14700014]
[9,null,null,null,1,"Duracap Asphalt Paving - Lenoir City Asp Mix",15300010]
[10,null,null,null,1,"Greene County Highway Dept - Asphalt Mix",13000008]
[11,null,null,null,1,"Harrison Construction - Greenback Asphalt Mix",15300003]
[12,null,null,null,1,"Harrison Construction - Heiskell Asphalt Mix",14700007]
[13,null,null,null,1,"Harrison Construction - Jefferson City Asphalt Mix",14500003]
[14,null,null,null,1,"Harrison Construction - Knox Cinder Asphalt Mix",14700008]
[15,null,null,null,1,"Harrison Construction - Knox Everett Asphalt Mix",14700010]
[16,null,null,null,1,"Harrison Construction - Maryville Asphalt Mix",10500001]
[17,null,null,null,1,"Harrison Construction - Mascot Asphalt Mix",14700011]
[18,null,null,null,1,"Harrison Construction - Maynardville Asphalt Mix",18700001]
[19,null,null,null,1,"Harrison Construction - Morristown Asphalt Mix",13200001]
[20,null,null,null,1,"Harrison Construction - Rogersville Asphalt Mix",13700010]
[21,null,null,null,1,"Harrison Construction - Spring Hill Asphalt Mix",14700042]
[22,null,null,null,1,"Hinkle Contracting - Middlesboro KY Asphalt Mix",59900010]
[23,null,null,null,1,"Jefferson Co Hwy Dept - Jefferson City Asphalt Mix",14500007]
[24,null,null,null,1,"Maymead - Mountain City Asphalt Mix",14600003]
[25,null,null,null,1,"Miller & Sons Paving - Oneida Asphalt Mix",17600001]
[26,null,null,null,1,"Newport Paving - Newport Asphalt Mix",11500001]
[27,null,null,null,1,"Pave Grade & Aggregate - Pioneer",10700007]
[28,null,null,null,1,"Pave-Well - Blountville",18200025]
[29,null,null,null,1,"PRI - Knoxville Asphalt Mix",14700053]
[30,null,null,null,1,"Rogers Group - Harriman Quarry Rd Asphalt Mix",17300005]
[31,null,null,null,1,"Rogers Group - Jacksboro Towe String Rd Asp Mix",10700006]
[32,null,null,null,1,"Rogers Group - Knoxville Candora Ave Asphalt Mix",14700031]
[33,null,null,null,1,"Rogers Group - Madisonville Asphalt Mix",16200006]
[34,null,null,null,1,"Rogers Group - Oak Ridge Asphalt Mix",10100005]
[35,null,null,null,1,"Rogers Group - Sweetwater Asphalt Mix",16200001]
[36,null,null,null,1,"Rogers Group - Tazewell Asphalt Mix",11300004]
[37,null,null,null,1,"Summers Taylor - Blountville Drum Plant Asp Mix",18200010]
[38,null,null,null,1,"Summers Taylor - Greeneville Asphalt Mix",13000002]
[39,null,null,null,1,"Summers Taylor - Unicoi Asphalt",18600003]
[40,null,null,null,1,"Summers Taylor - Watauga Asphalt Mix",11000002]
[41,null,null,null,1,"W & L Construction - Abington VA Asphalt Mix",59900110]
[42,null,null,null,1,"W & L Construction - Kingsport Asphalt Mix",18200017]
[43,null,null,null,1,"Washington County Highway Dept",19000010]
[44,null,null,null,1,"Willis Paving Inc - Tazewell Asphalt Mix",11300006]
[45,null,null,null,2,"Central Asphalt - Cleveland Asphalt Mix",20600002]
[46,null,null,null,2,"Copeland DRP LLC - Cookeville Asphalt Mix",27100016]
[47,null,null,null,2,"CW Matthews - Cartersville GA Asphalt Mix",59900429]
[48,null,null,null,2,"CW Matthews - Dalton GA Asphalt Mix",59900327]
[49,null,null,null,2,"Dunlap Stone - Dunlap Asphalt Mix",27700004]
[50,null,null,null,2,"Dunlap Stone - Pikeville Asphalt Mix",20400003]
[51,null,null,null,2,"Harrison Construction - Cherokee County NC Asphalt Mix",59900026]
[52,null,null,null,2,"Harrison Construction - Hayesville NC Asphalt Mix",59900168]
[53,null,null,null,2,"Hawkins Asphalt Paving - Woodbury Asphalt Mix",20800004]
[54,null,null,null,2,"Hiwassee Paving - Chattanooga Asphalt Mix",23300003]
[55,null,null,null,2,"Hiwassee Paving LLC  - Calhoun Asphalt Mix",25400007]
[56,null,null,null,2,"Manhattan Materials - Cleveland Asphalt Mix",20600008]
[57,null,null,null,2,"Rogers Group - Algood Asphalt Mix",27100005]
[58,null,null,null,2,"Rogers Group - Cookeville Asphalt Mix LAB ONLY",27100006]
[59,null,null,null,2,"Rogers Group - Cowan Asphalt Mix",22600004]
[60,null,null,null,2,"Rogers Group - Crab Orchard Asphalt Mix",21800007]
[61,null,null,null,2,"Rogers Group - Dayton Asphalt Mix",27200002]
[62,null,null,null,2,"Rogers Group - Hillsboro Asphalt Mix",21600004]
[63,null,null,null,2,"Rogers Group - Hollywood, AL Asphalt Mix",59900476]
[64,null,null,null,2,"Rogers Group - Liberty Asphalt Mix",22100004]
[65,null,null,null,2,"Rogers Group - Livingston Asphalt Mix",26700001]
[66,null,null,null,2,"Rogers Group - McMinnville Asphalt Mix",28900007]
[67,null,null,null,2,"Rogers Group - Pall Mall Asphalt Mix",22500003]
[68,null,null,null,2,"Rogers Group - Sparta Asphalt Mix",29300001]
[69,null,null,null,2,"Southeastern Mtls - Chattanooga Asphalt Mix",23300001]
[70,null,null,null,2,"Southeastern Mtls - Cleveland Asphalt Mix",20600006]
[71,null,null,null,2,"Southeastern Mtls - Tiftonia Asphalt Mix",23300012]
[72,null,null,null,2,"Tinsley Asphalt - Decherd Asphalt Mix",22600008]
[73,null,null,null,2,"Tinsley Asphalt - McMinnville Asphalt Mix",28900005]
[74,null,null,null,2,"Tinsley Asphalt - South Pittsburg Asphalt Mix",25800004]
[75,null,null,null,2,"Vulcan - Cookeville Asphalt Mix",27100008]
[76,null,null,null,3,"Eubank Asphalt - Dickson (Astec)",32200007]
[77,null,null,null,3,"Eubank Asphalt - Dickson (Barber Green)",32200002]
[78,null,null,null,3,"Fairview Asphalt Products Inc - Asphalt Mix",39400001]
[79,null,null,null,3,"Hawkins Asphalt Paving - Shelbyville Asphalt Mix",30200008]
[80,null,null,null,3,"Hoover - Old Hickory Asphalt Mix",31900061]
[81,null,null,null,3,"Hoover - Smyrna Asphalt Mix",37500004]
[82,null,null,null,3,"Jones Bros Contractors - Clarksville Asphalt Mix",36300004]
[83,null,null,null,3,"Jones Bros Contractors - Dickson Asphalt Mix",32200008]
[84,null,null,null,3,"Jones Bros Contractors - Nashville Asphalt Mix",31900009]
[85,null,null,null,3,"Jones Bros Contractors - Old Hickory Asphalt Mix",31900079]
[86,null,null,null,3,"Jones Bros Contractors - Robertson County Asphalt Mix",37400014]
[87,null,null,null,3,"Lincoln Paving Co - Fayetteville",35200003]
[88,null,null,null,3,"Lincoln Paving Co - Lewisburg",35900003]
[89,null,null,null,3,"Lincoln Paving Co - Lynchburg",36400001]
[90,null,null,null,3,"Marathon Ashland - Nashville Liquid Asphalt",31900025]
[91,null,null,null,3,"Maury Co Asphalt - Columbia",36000008]
[92,null,null,null,3,"McAsphalt LLC, Clarksville Plant 1",36300009]
[93,null,null,null,3,"McAsphalt LLC, Clarksville Plant 2",36300015]
[94,null,null,null,3,"Rogers Group - Columbia Asphalt Mix",36000009]
[95,null,null,null,3,"Rogers Group - Cross Plains Rockhouse Rd Asphalt",37400010]
[96,null,null,null,3,"Rogers Group - Gallatin Asphalt Mix",38300012]
[97,null,null,null,3,"Rogers Group - Hopkinsville Kentucky Asphalt",59900046]
[98,null,null,null,3,"Rogers Group - Huntsville, AL",59900473]
[99,null,null,null,3,"Rogers Group - Lawrenceburg Asphalt Mix",35000003]
[100,null,null,null,3,"Rogers Group - Nashville Whites Creek Asphalt Mix",31900036]
[101,null,null,null,3,"Rogers Group - Nashville ReoStone Asphalt Mix",31900083]
[102,null,null,null,3,"Rogers Group - New Prospect",35000005]
[103,null,null,null,3,"Rogers Group - Pottsville Asphalt Mix",35900007]
[104,null,null,null,3,"Rogers Group - Pulaski Bethel Rd Asphalt Mix",32800008]
[105,null,null,null,3,"Scotty's Asphalt Co",59900047]
[106,null,null,null,3,"Tennessee Valley Asphalt - Fairview",39400001]
[107,null,null,null,3,"Tennessee Valley Blacktop, Inc. - Dickson",32200011]
[108,null,null,null,3,"Volunteer Materials - Lewisburg Asp Mix",35900008]
[109,null,null,null,3,"Volunteer Materials - Shelbyville Asphalt Mix",30200006]
[110,null,null,null,3,"Vulcan - City Plant",31900023]
[111,null,null,null,3,"Vulcan - Clarksville",36300013]
[112,null,null,null,3,"Vulcan - Columbia",36000006]
[113,null,null,null,3,"Vulcan - Danley",31900021]
[114,null,null,null,3,"Vulcan - Franklin",39400002]
[115,null,null,null,3,"Vulcan - Gordonsville",38000002]
[116,null,null,null,3,"Vulcan - Hermitage",31900022]
[117,null,null,null,3,"Vulcan - Lebanon  Asphalt",39500006]
[118,null,null,null,3,"Vulcan - Murfreesboro",37500007]
[119,null,null,null,3,"Vulcan - Nashville River Rd",31900024]
[120,null,null,null,3,"Vulcan - Springfield",37400005]
[121,null,null,null,3,"Wiregrass Construction Co - Lebanon Asphalt Mix",39500016]
[122,null,null,null,3,"Wiregrass Construction Co - Murfreesboro Asphalt Mix",37500003]
[123,null,null,null,3,"Wiregrass Construction Co. - Smyrna Asphalt Mix",37500025]
[124,null,null,null,3,"Wright Paving Co - Pottsville",35900005]
[125,null,null,null,4,"APAC - Glen Mississippi Asphalt Mix",59900054]
[126,null,null,null,4,"APAC - Memphis Harbour Ave Asphalt Mix",47900004]
[127,null,null,null,4,"APAC - Memphis Tuggle Rd Asphalt Mix",47900005]
[128,null,null,null,4,"Arrow Paving Inc - Lexington Asphalt Mix",43900001]
[129,null,null,null,4,"Delta Contracting - Holladay Asphalt Mix",40300002]
[130,null,null,null,4,"Delta Contracting - Humboldt Asphalt Mix",42700001]
[131,null,null,null,4,"Delta Contracting - Jackson Asphalt Mix",45700017]
[132,null,null,null,4,"Delta Contracting - Parsons Asphalt Mix",42000001]
[133,null,null,null,4,"Delta Contracting - Savannah Asphalt Mix",43600002]
[134,null,null,null,4,"Delta Contracting- Paris Asphalt Mix",44000004]
[135,null,null,null,4,"Ford Construction - Dresden Asphalt Mix",49200002]
[136,null,null,null,4,"Ford Construction - Dyersburg Asphalt Mix",42300004]
[137,null,null,null,4,"Ford Construction - Jackson Asphalt Mix",45700006]
[138,null,null,null,4,"Ford Construction - Troy Asphalt Mix",46600004]
[139,null,null,null,4,"Ford Construction - Union City Asphalt Mix",46600005]
[140,null,null,null,4,"Frank Climer and Sons - Munford Asphalt Mix",48400003]
[141,null,null,null,4,"Hardeman Co. Highway Dept.","N/A"]
[142,null,null,null,4,"J Hamm Asphalt - Crump Asphalt Mix",43600009]
[143,null,null,null,4,"Jones Bros Contractors - Lexington Asphalt Mix",43900004]
[144,null,null,null,4,"Lehman Roberts - Arlington Asphalt Mix",47900012]
[145,null,null,null,4,"Lehman Roberts - Byhalia MS Asphalt Mix",59900329]
[146,null,null,null,4,"Lehman Roberts - Hernando, MS",59900455]
[147,null,null,null,4,"Lehman Roberts - Memphis Carrier Asphalt Mix",47900014]
[148,null,null,null,4,"Martin Paving - Medina Asphalt Mix",42700002]
[149,null,null,null,4,"Murray Paving",59900513]
[150,null,null,null,4,"Standard Construction - Collierville Asphalt Mix",47900052]
[151,null,null,null,4,"Standard Construction - Cordova Asphalt Mix",47900042]
[152,null,null,null,4,"Standard Construction - Millington Asphalt Mix",47900069]
[153,null,null,null,4,"Standard Construction - Stantonville Asphalt Mix",45500005]
[154,null,null,null,4,"Standard Construction - Whiteville Asphalt Mix",43500002]
[155,null,null,null,4,"Union City Paving",46600006]
[156,null,null,null,4,"Volunteer Paving - Holladay",40300010]

{"sheet":"Terminals","index":32,"n_rows":30,"n_cols":7,"rows_kept":30,"cut":false,"hidden":true,"merged":[]}
["TERMINALS"]
[null,null,null,null,null,null,"P/S ID#"]
[1]
[2,1,3,null,null,"ASSOCIATED ASPHALT, BRISTOL",59900173]
[3,null,null,null,null,"BLACKLIDGE EMULSIONS, GREER, SC",59900030]
[4,null,null,null,null,"CW MATTHEWS, CHATTANOOGA, TN",23300024]
[5,null,null,null,null,"CW MATTHEWS, MARIETTA, GA",59900324]
[6,4,3,null,null,"ERGON ASPHALT & EMULSIONS, IUKA, MS",59900062]
[7,4,3,null,null,"ERGON ASPHALT & EMULSIONS, MEMPHIS T1",47900001]
[8,null,null,null,null,"ERGON ASPHALT & EMULSIONS, MEMPHIS T3",47900061]
[9,3,3,null,null,"ERGON ASPHALT & EMULSIONS, NASHVILLE TERMINAL",31900007]
[10,4,3,null,null,"ERGON ASPHALT & EMULSIONS, PARSONS, TN",42000007]
[11,null,null,null,null,"ERGON ASPHALT & EMULSIONS, VICKSBURG, MS",59900178]
[12,null,null,null,null,"HINKLE CONTRACTING, FERGUSON, KY",59900245]
[13,null,null,null,null,"HUDSON MATERIALS CO, CHATTANOOGA SHALLOWFORD",23300025]
[14,null,null,null,null,"HUDSON MATERIALS CO, CHATTANOOGA RIVERPORT",23300027]
[15,null,null,null,null,"HUDSON MATERIALS CO, KNOXVILLE",14700056]
[16,3,3,null,null,"HUNT REFINING, DECATUR, AL",59900166]
[17,null,null,null,null,"HUNT REFINING, GWINNETT GA",59900239]
[18,null,null,null,null,"MARATHON PETROLEUM CO., CATLETTSBURG VINEY BRANCH",59900175]
[19,1,3,null,null,"MARATHON PETROLEUM CO., KNOXVILLE",14700023]
[20,3,3,null,null,"MARATHON PETROLEUM CO., KUTTAWA, KY",59900067]
[21,4,3,null,null,"MARATHON PETROLEUM CO., MEMPHIS, TN",47900060]
[22,3,3,null,null,"MARATHON PETROLEUM CO., NASHVILLE TERMINAL",31900057]
[23,2,3,null,null,"PHILLIPS 66, CHATTANOOGA TERMINAL",23300021]
[24,null,null,null,null,"PHILLIPS 66, JEFFERSON, IN",59900207]
[25,1,3,null,null,"PHILLIPS 66, KNOXVILLE",14700048]
[26,null,null,null,null,"RUSSELL STANDARD, BLACK MOUNTAIN, NC",59900170]
[27,1,3,null,null,"RUSSELL STANDARD, GREENSBORO, NC",59900409]
[28,null,null,null,null,"WIREGRASS CONSTRUCTION HANCEVILLE, AL",59900480]

{"sheet":"ASA Suppliers","index":35,"n_rows":30,"n_cols":8,"rows_kept":30,"cut":false,"hidden":true,"merged":[[0,3,0,4]]}
["ASA Suppliers",null,1,"Producer",null,{"$f":"VLOOKUP(C1,A3:D30,3)","v":0},{"$f":"VLOOKUP(C1,A3:D30,2)","v":0},{"$f":"VLOOKUP(C1,A3:D30,4)","v":0}]
[null,"Product Name","Producer","P/S Code"]
[1]
[2,"Anova 1440","Cargill",89901432]
[3,"Anova 1501","Cargill",89901432]
[4,"Evotherm P Series","Ingevity",89900617]
[5,"Evotherm M Series","Ingevity",89900617]
[6,"Morlife","Ingevity",89900617]
[7,"AD-here Series","Road Science, Div. of Arr-Mazz",89900084]
[8,"AD-here Ultra Series","Road Science, Div. of Arr-Mazz",89900084]
[9,"Cecabase RT Series","Road Science, Div. of Arr-Mazz",89900084]
[10,"KO-here Series","Road Science, Div. of Arr-Mazz",89900084]
[11,"NovaGrip Series","Road Science, Div. of Arr-Mazz",89900084]
[12,"Super Anti-Strip","StarChem USA",89901587]
[13,"LAS 100","Tri-State Sand LLC",89900960]
[14,"TS-9R","Tri-State Sand LLC",89900960]
[15,"TS 43","Tri-State Sand LLC",89900960]
[16,"TS 53","Tri-State Sand LLC",89900960]
[17,"Zycotherm","Zydex Industries",89901287]
[18]
[19]
[20]
[21]
[22]
[23]
[24]
[25]
[26]
[27]
[28]

{"sheet":"Aggregate Suppliers","index":36,"n_rows":395,"n_cols":35,"rows_kept":395,"cut":false,"hidden":true,"merged":[]}
["Aggregate Suppliers"]
["Counter","Name","Code","Absorption"]
[1,0,0]
[2,"Alliance Sand - Florence AL",59900430,0]
[3,"Alliance Sand - Luka MS",59900325,0]
[4,"Alliance Sand - Decatur AL (State Docks Port)",59900326,0]
[5,"Alliance Sand - Huntsville, AL",59900180,0]
[6,"Albany Quarry - Albany KY Agg",59900209,0.61]
[7,"APAC - Sardis, MS",59900328,1.1100000000000001,null,1,2,3,4,5,6,7,8,9,10,11,12,13,14,15,16,17,18,19,20,21,22,23,24,25,26,27,28,29,30]
[8,"Arcosa - Clarksville",36300012,0.86]
[9,"Arcosa - Grand Rivers KY",59900137,0.84,null,null,"\"Contractors Gradations\""]
[10,"Copperhill Quarry - Copperhill TN",27000002,0.49,"Supplier link cell",null,1,1,1,1,1,1,1,1,1,1,1,1,1,1,1,1,1,1,1,1,1,1,1,1,1,1,1,1,1]
[11,"Delta Contracting - Jackson Aggregate",45700004,1.1100000000000001,"Supplier Code",null,{"$f":"VLOOKUP(G$12,$A$3:$C$396,3)","v":0},0,0,0,0,0,0,0,0,0,0,0,0,0,0,0,0,0,0,0,0,0,0,0,0,0,0,0,0]
[12,"Dunlap Sand & Gravel",27700001,0,"Supplier Desc",null,{"$f":"VLOOKUP(G$12,$A$3:$C$396,2)","v":0},0,0,0,0,0,0,0,0,0,0,0,0,0,0,0,0,0,0,0,0,0,0,0,0,0,0,0,0]
[13,"Dunlap Stone - Dunlap Aggregate",27700002,0.76,"Agg Size Link",null,1,1,1,1,1,1,1,1,1,1,1,1,1,1,1,1,1,1,1,1,1,1,1,1,1,1,1,1,1]
[14,"Dunlap Stone - Jasper Aggregate",25800001,0.4,"Agg Size Desc",null,{"$f":"VLOOKUP(G15,'Aggregate Sizes'!$F$5:$H$46,2)","v":0},{"$f":"VLOOKUP(H15,'Aggregate Sizes'!$F$5:$H$46,2)","v":0},{"$f":"VLOOKUP(I15,'Aggregate Sizes'!$F$5:$H$46,2)","v":0},{"$f":"VLOOKUP(J15,'Aggregate Sizes'!$F$5:$H$46,2)","v":0},{"$f":"VLOOKUP(K15,'Aggregate Sizes'!$F$5:$H$46,2)","v":0},{"$f":"VLOOKUP(L15,'Aggregate Sizes'!$F$5:$H$46,2)","v":0},{"$f":"VLOOKUP(M15,'Aggregate Sizes'!$F$5:$H$46,2)","v":0},{"$f":"VLOOKUP(N15,'Aggregate Sizes'!$F$5:$H$46,2)","v":0},{"$f":"VLOOKUP(O15,'Aggregate Sizes'!$F$5:$H$46,2)","v":0},{"$f":"VLOOKUP(P15,'Aggregate Sizes'!$F$5:$H$46,2)","v":0},{"$f":"VLOOKUP(Q15,'Aggregate Sizes'!$F$5:$H$46,2)","v":0},{"$f":"VLOOKUP(R15,'Aggregate Sizes'!$F$5:$H$46,2)","v":0},{"$f":"VLOOKUP(S15,'Aggregate Sizes'!$F$5:$H$46,2)","v":0},{"$f":"VLOOKUP(T15,'Aggregate Sizes'!$F$5:$H$46,2)","v":0},{"$f":"VLOOKUP(U15,'Aggregate Sizes'!$F$5:$H$46,2)","v":0},{"$f":"VLOOKUP(V15,'Aggregate Sizes'!$F$5:$H$46,2)","v":0},{"$f":"VLOOKUP(W15,'Aggregate Sizes'!$F$5:$H$46,2)","v":0},{"$f":"VLOOKUP(X15,'Aggregate Sizes'!$F$5:$H$46,2)","v":0},{"$f":"VLOOKUP(Y15,'Aggregate Sizes'!$F$5:$H$46,2)","v":0},{"$f":"VLOOKUP(Z15,'Aggregate Sizes'!$F$5:$H$46,2)","v":0},{"$f":"VLOOKUP(AA15,'Aggregate Sizes'!$F$5:$H$46,2)","v":0},{"$f":"VLOOKUP(AB15,'Aggregate Sizes'!$F$5:$H$46,2)","v":0},{"$f":"VLOOKUP(AC15,'Aggregate Sizes'!$F$5:$H$46,2)","v":0},{"$f":"VLOOKUP(AD15,'Aggregate Sizes'!$F$5:$H$46,2)","v":0},{"$f":"VLOOKUP(AE15,'Aggregate Sizes'!$F$5:$H$46,2)","v":0},{"$f":"VLOOKUP(AF15,'Aggregate Sizes'!$F$5:$H$46,2)","v":0},{"$f":"VLOOKUP(AG15,'Aggregate Sizes'!$F$5:$H$46,2)","v":0},{"$f":"VLOOKUP(AH15,'Aggregate Sizes'!$F$5:$H$46,2)","v":0},{"$f":"VLOOKUP(AI15,'Aggregate Sizes'!$F$5:$H$46,2)","v":0}]
[15,"Dunlap Stone - Pikeville Aggregate",20400001,0.49,"Agg Type Link",null,1,1,1,1,1,1,1,1,1,1,1,1,1,1,1,1,1,1,1,1,1,1,1,1,1,1,1,1,1]
[16,"Duracap Materials LLC (Goins Hollow) - Tazewell",11300007,0.43,"Agg Type Desc",null,{"$f":"VLOOKUP(G17,'Aggregate Sizes'!$A$5:$D$22,4)","v":0},{"$f":"VLOOKUP(H17,'Aggregate Sizes'!$A$5:$D$22,4)","v":0},{"$f":"VLOOKUP(I17,'Aggregate Sizes'!$A$5:$D$22,4)","v":0},{"$f":"VLOOKUP(J17,'Aggregate Sizes'!$A$5:$D$22,4)","v":0},{"$f":"VLOOKUP(K17,'Aggregate Sizes'!$A$5:$D$22,4)","v":0},{"$f":"VLOOKUP(L17,'Aggregate Sizes'!$A$5:$D$22,4)","v":0},{"$f":"VLOOKUP(M17,'Aggregate Sizes'!$A$5:$D$22,4)","v":0},{"$f":"VLOOKUP(N17,'Aggregate Sizes'!$A$5:$D$22,4)","v":0},{"$f":"VLOOKUP(O17,'Aggregate Sizes'!$A$5:$D$22,4)","v":0},{"$f":"VLOOKUP(P17,'Aggregate Sizes'!$A$5:$D$22,4)","v":0},{"$f":"VLOOKUP(Q17,'Aggregate Sizes'!$A$5:$D$22,4)","v":0},{"$f":"VLOOKUP(R17,'Aggregate Sizes'!$A$5:$D$22,4)","v":0},{"$f":"VLOOKUP(S17,'Aggregate Sizes'!$A$5:$D$22,4)","v":0},{"$f":"VLOOKUP(T17,'Aggregate Sizes'!$A$5:$D$22,4)","v":0},{"$f":"VLOOKUP(U17,'Aggregate Sizes'!$A$5:$D$22,4)","v":0},{"$f":"VLOOKUP(V17,'Aggregate Sizes'!$A$5:$D$22,4)","v":0},{"$f":"VLOOKUP(W17,'Aggregate Sizes'!$A$5:$D$22,4)","v":0},{"$f":"VLOOKUP(X17,'Aggregate Sizes'!$A$5:$D$22,4)","v":0},{"$f":"VLOOKUP(Y17,'Aggregate Sizes'!$A$5:$D$22,4)","v":0},{"$f":"VLOOKUP(Z17,'Aggregate Sizes'!$A$5:$D$22,4)","v":0},{"$f":"VLOOKUP(AA17,'Aggregate Sizes'!$A$5:$D$22,4)","v":0},{"$f":"VLOOKUP(AB17,'Aggregate Sizes'!$A$5:$D$22,4)","v":0},{"$f":"VLOOKUP(AC17,'Aggregate Sizes'!$A$5:$D$22,4)","v":0},{"$f":"VLOOKUP(AD17,'Aggregate Sizes'!$A$5:$D$22,4)","v":0},{"$f":"VLOOKUP(AE17,'Aggregate Sizes'!$A$5:$D$22,4)","v":0},{"$f":"VLOOKUP(AF17,'Aggregate Sizes'!$A$5:$D$22,4)","v":0},{"$f":"VLOOKUP(AG17,'Aggregate Sizes'!$A$5:$D$22,4)","v":0},{"$f":"VLOOKUP(AH17,'Aggregate Sizes'!$A$5:$D$22,4)","v":0},{"$f":"VLOOKUP(AI17,'Aggregate Sizes'!$A$5:$D$22,4)","v":0}]
[17,"Ford - Camden Gravel Co",40300001,4.51,"Agg Type Code",null,{"$f":"IF(G17=18,VLOOKUP(G15,'Aggregate Sizes'!$F$32:$H$46,3),VLOOKUP(G17,'Aggregate Sizes'!$A$5:$B$23,2))","v":0},{"$f":"IF(H17=18,VLOOKUP(H15,'Aggregate Sizes'!$F$32:$H$46,3),VLOOKUP(H17,'Aggregate Sizes'!$A$5:$B$23,2))","v":0},{"$f":"IF(I17=18,VLOOKUP(I15,'Aggregate Sizes'!$F$32:$H$46,3),VLOOKUP(I17,'Aggregate Sizes'!$A$5:$B$23,2))","v":0},{"$f":"IF(J17=18,VLOOKUP(J15,'Aggregate Sizes'!$F$32:$H$46,3),VLOOKUP(J17,'Aggregate Sizes'!$A$5:$B$23,2))","v":0},{"$f":"IF(K17=18,VLOOKUP(K15,'Aggregate Sizes'!$F$32:$H$46,3),VLOOKUP(K17,'Aggregate Sizes'!$A$5:$B$23,2))","v":0},{"$f":"IF(L17=18,VLOOKUP(L15,'Aggregate Sizes'!$F$32:$H$46,3),VLOOKUP(L17,'Aggregate Sizes'!$A$5:$B$23,2))","v":0},{"$f":"IF(M17=18,VLOOKUP(M15,'Aggregate Sizes'!$F$32:$H$46,3),VLOOKUP(M17,'Aggregate Sizes'!$A$5:$B$23,2))","v":0},{"$f":"IF(N17=18,VLOOKUP(N15,'Aggregate Sizes'!$F$32:$H$46,3),VLOOKUP(N17,'Aggregate Sizes'!$A$5:$B$23,2))","v":0},{"$f":"IF(O17=18,VLOOKUP(O15,'Aggregate Sizes'!$F$32:$H$46,3),VLOOKUP(O17,'Aggregate Sizes'!$A$5:$B$23,2))","v":0},{"$f":"IF(P17=18,VLOOKUP(P15,'Aggregate Sizes'!$F$32:$H$46,3),VLOOKUP(P17,'Aggregate Sizes'!$A$5:$B$23,2))","v":0},{"$f":"IF(Q17=18,VLOOKUP(Q15,'Aggregate Sizes'!$F$32:$H$46,3),VLOOKUP(Q17,'Aggregate Sizes'!$A$5:$B$23,2))","v":0},{"$f":"IF(R17=18,VLOOKUP(R15,'Aggregate Sizes'!$F$32:$H$46,3),VLOOKUP(R17,'Aggregate Sizes'!$A$5:$B$23,2))","v":0},{"$f":"IF(S17=18,VLOOKUP(S15,'Aggregate Sizes'!$F$32:$H$46,3),VLOOKUP(S17,'Aggregate Sizes'!$A$5:$B$23,2))","v":0},{"$f":"IF(T17=18,VLOOKUP(T15,'Aggregate Sizes'!$F$32:$H$46,3),VLOOKUP(T17,'Aggregate Sizes'!$A$5:$B$23,2))","v":0},{"$f":"IF(U17=18,VLOOKUP(U15,'Aggregate Sizes'!$F$32:$H$46,3),VLOOKUP(U17,'Aggregate Sizes'!$A$5:$B$23,2))","v":0},{"$f":"IF(V17=18,VLOOKUP(V15,'Aggregate Sizes'!$F$32:$H$46,3),VLOOKUP(V17,'Aggregate Sizes'!$A$5:$B$23,2))","v":0},{"$f":"IF(W17=18,VLOOKUP(W15,'Aggregate Sizes'!$F$32:$H$46,3),VLOOKUP(W17,'Aggregate Sizes'!$A$5:$B$23,2))","v":0},{"$f":"IF(X17=18,VLOOKUP(X15,'Aggregate Sizes'!$F$32:$H$46,3),VLOOKUP(X17,'Aggregate Sizes'!$A$5:$B$23,2))","v":0},{"$f":"IF(Y17=18,VLOOKUP(Y15,'Aggregate Sizes'!$F$32:$H$46,3),VLOOKUP(Y17,'Aggregate Sizes'!$A$5:$B$23,2))","v":0},{"$f":"IF(Z17=18,VLOOKUP(Z15,'Aggregate Sizes'!$F$32:$H$46,3),VLOOKUP(Z17,'Aggregate Sizes'!$A$5:$B$23,2))","v":0},{"$f":"IF(AA17=18,VLOOKUP(AA15,'Aggregate Sizes'!$F$32:$H$46,3),VLOOKUP(AA17,'Aggregate Sizes'!$A$5:$B$23,2))","v":0},{"$f":"IF(AB17=18,VLOOKUP(AB15,'Aggregate Sizes'!$F$32:$H$46,3),VLOOKUP(AB17,'Aggregate Sizes'!$A$5:$B$23,2))","v":0},{"$f":"IF(AC17=18,VLOOKUP(AC15,'Aggregate Sizes'!$F$32:$H$46,3),VLOOKUP(AC17,'Aggregate Sizes'!$A$5:$B$23,2))","v":0},{"$f":"IF(AD17=18,VLOOKUP(AD15,'Aggregate Sizes'!$F$32:$H$46,3),VLOOKUP(AD17,'Aggregate Sizes'!$A$5:$B$23,2))","v":0},{"$f":"IF(AE17=18,VLOOKUP(AE15,'Aggregate Sizes'!$F$32:$H$46,3),VLOOKUP(AE17,'Aggregate Sizes'!$A$5:$B$23,2))","v":0},{"$f":"IF(AF17=18,VLOOKUP(AF15,'Aggregate Sizes'!$F$32:$H$46,3),VLOOKUP(AF17,'Aggregate Sizes'!$A$5:$B$23,2))","v":0},{"$f":"IF(AG17=18,VLOOKUP(AG15,'Aggregate Sizes'!$F$32:$H$46,3),VLOOKUP(AG17,'Aggregate Sizes'!$A$5:$B$23,2))","v":0},{"$f":"IF(AH17=18,VLOOKUP(AH15,'Aggregate Sizes'!$F$32:$H$46,3),VLOOKUP(AH17,'Aggregate Sizes'!$A$5:$B$23,2))","v":0},{"$f":"IF(AI17=18,VLOOKUP(AI15,'Aggregate Sizes'!$F$32:$H$46,3),VLOOKUP(AI17,'Aggregate Sizes'!$A$5:$B$23,2))","v":0}]
[18,"Ford Construction - Troy Aggregate",46600002,5.22,"Full Agg Desc",null,{"$f":"G16&\", \"&G18&\" from \"&G14","v":"0, 0 from 0"},{"$f":"H16&\", \"&H18&\" from \"&H14","v":"0, 0 from 0"},"0, 0 from 0","0, 0 from 0","0, 0 from 0","0, 0 from 0","0, 0 from 0","0, 0 from 0","0, 0 from 0","0, 0 from 0","0, 0 from 0","0, 0 from 0","0, 0 from 0","0, 0 from 0","0, 0 from 0","0, 0 from 0","0, 0 from 0","0, 0 from 0","0, 0 from 0","0, 0 from 0","0, 0 from 0","0, 0 from 0","0, 0 from 0","0, 0 from 0","0, 0 from 0","0, 0 from 0","0, 0 from 0","0, 0 from 0","0, 0 from 0"]
[19,"Ford Construction - Water Valley Aggregate",59900063,5.67]
[20,"Fortis Sand & Gravel",43600013,1.6]
[21,"Fullen Dock and Warehouse",47900008,1.25]
[22,"Gaddie Shamrock - Albany KY Aggregate",59900097,0.59]
[23,"Harrison Construction - Cherokee NC Aggregate",59900106,0.61]
[24,"Harrison Construction - Hayesville NC Aggregate",59900027,0.39]
[25,"Harrison Construction - Waynesville NC Aggregate",59900003,0.5]
[26,"Heidelberg Materials - Russellville Kentucky",59900038,0.57999999999999996]
[27,"Heidelberg Materials - Woodburn Kentucky",59900039,1.2]
[28,"Hinkle Contracting - Cumberland Lake, KY",59900248,0.48]
[29,"Hinkle Contracting - Ewing Virginia Aggregate",59900009,0.38]
[30,"Hinkle Contracting - Jellico Stone Co",10700002,0.48]
[31,"Hinkle Contracting-Bourbon Limestone-Paris KY Agg",59900102,0.46]
[32,"Holcim- Fredonia KY Aggregate",59900069,0.63]
[33,"Holcim - Smithland KY Aggregate",59900070,0.62]
[34,"Hommell Limestone",11500006,0.05]
[35,"Hoover - Old Hickory Aggregate",31900062,0.52]
[36,"Jefferson County Hwy Dept - Dandridge",14500006,0.4]
[37,"Jones Bros Contractors - Parsons TN Agg",42000008,0.3]
[38,"K&S Sand & Gravel - Adamsville",43600011,4.2]
[39,"K&S Sand & Gravel - Stantonville",45500006,3.49]
[40,"Lhoist North America - Crab Orchard",21800005,0.86]
[41,"Martin Marietta - Abingdon Virginia",59900001,0.13]
[42,"Martin Marietta - Black Rock Arkansas Agg",59900068,0.46]
[43,"Martin Marietta - Blountville",18200002,0.49]
[44,"Martin Marietta - Bowling Green North",59900464,1.2]
[45,"Martin Marietta - Bowling Green South",59900461,1.1399999999999999]
[46,"Martin Marietta - Calhoun",25400006,0.41]
[47,"Martin Marietta- Chattanooga",23300008,0.33]
[48,"Martin Marietta - Dallas Georgia",59900113,0.37]
[49,"Martin Marietta - Elizabethton",19000002,0.69]
[50,"Martin Marietta - Heiskell I-75",14700002,0.54]
[51,"Martin Marietta- Jefferson City",14500001,0.18]
[52,"Martin Marietta - Jonesborough - Locust Mount",19000001,0.15]
[53,"Martin Marietta - Knoxville John Sevier Hwy",14700001,0.42]
[54,"Martin Marietta - Lebanon Aggregate",39500014,0.46]
[55,"Martin Marietta - Lenoir City",15300001,0.48]
[56,"Martin Marietta - Mascot",14700005,0.23]
[57,"Martin Marietta - Memphis Aggregate",47900017,0.25]
[58,"Martin Marietta (Mossy Creek Mining)",14500008,0.25]
[59,"Martin Marietta - Murfreesboro Aggregate",37500015,0.25]
[60,"Martin Marietta - Rutledge",12900001,0.47]
[61,"Martin Marietta - Smyrna Aggregate",37500016,0.3]
[62,"Martin Marietta - Unicoi",18600001,0.13]
[63,"Martin Marietta - Watauga",11000001,0.1]
[64,"Martin Marietta - Woodbury TN Aggregate",20800002,0.19]
[65,"Martin Paving - Medina Aggregate",42700005,0]
[66,"Maymead - Mountain City Aggregate",14600004,0.31]
[67,"Memphis Stone & Gravel - Arlington Aggregate",47900025,1.89]
[68,"Memphis Stone & Gravel - Senatobia MS Aggregate",59900164,1.96]
[69,"Memphis Stone & Gravel - Southaven MS Aggregate",59900219,1.63]
[70,"Metro Materials - Memphis Rozelle St Aggregate",47900029,1.44]
[71,"Mid South Construction - Hickory KY Aggregate",59900078,6.07]
[72,"Middle Tennessee Limestone",29300003,0.56000000000000005]
[73,"Midsouth Aggregates - Dallas Georgia",59900111,0.38]
[74,"Midsouth Aggregates - Ringgold Georgia",59900099,0.33]
[75,"Midsouth Aggregates - Tiftonia",23300017,0.23]
[76,"Midsouth Aggregates Sand Products* - Monterey",26700005,0]
[77,"Monteagle Sand",25800002,0]
[78,"Monterey Sand LLC",27100010,0]
[79,"Newport Sand & Gravel",11500009,0.93]
[80,"Nugent Sand - Milton KY",59900193,0]
[81,"Nugent Sand Co - Lexington KY Aggregate",59900162,0]
[82,"Paris Sand & Gravel",44000002,6.01]
[83,"Pave Grade & Aggregate - Lafollette TN",10700008,1.17]
[84,"Pine Bluff - Nashville West",31900010,0]
[85,"Pine Bluff Sand & Gravel - New Johnsonville",34300001,0]
[86,"Pine Bluff Sand & Gravel - Clarksville",36300007,0]
[87,"Pine Bluff Sand & Gravel - Gallatin",38300008,0]
[88,"Pine Bluff Sand & Gravel - Hailey's Harbor",31900063,0]
[89,"Pine Bluff Sand & Gravel - Nashville",31900013,0]
[90,"Pine Bluff Sand & Gravel - Salem KY Aggregate",59900080,0.76]
[91,"PRI Aggregate - Knoxville",14700064,0.49]
[92,"Redland Sand - Watkinsville GA",59900192,0]
[93,"Riverfront Limestone LLC",59900082,0.76]
[94,"Rogers Group - Algood Aggregate",27100011,0.56999999999999995]
[95,"Rogers Group - Allons Quarry Aggregate",26700004,1.82]
[96,"Rogers Group - Bon Aqua Aggregate",34100001,1.76]
[97,"Rogers Group - Cadiz KY Aggregate",59900045,0.53]
[98,"Rogers Group - Caryville Aggregate",10700003,0.84]
[99,"Rogers Group - Columbia Aggregate",36000013,0.56000000000000005]
[100,"Rogers Group - Cookeville Aggregate",27100004,0.56999999999999995]
[101,"Rogers Group - Cowan Aggregate",22600003,0.64]
[102,"Rogers Group - Cross Plains Rockhouse Rd Aggregate",37400011,1.67]
[103,"Rogers Group - Dayton - Rhea Co Aggregate",27200003,0.43]
[104,"Rogers Group - Deason Aggregate",30200003,0.31]
[105,"Rogers Group - Delaney Loop Sand & Gravel",43600010,3.78]
[106,"Rogers Group - Englewood Aggregate",25400008,0.4]
[107,"Rogers Group - Fayetteville Aggregate",35200005,0.36]
[108,"Rogers Group - Fentress - Pall Mall Aggregate",22500002,0.47]
[109,"Rogers Group - Gainesboro Quarry Aggregate",24400001,0.51]
[110,"Rogers Group - Gallatin Aggregate",38300013,0.39]
[111,"Rogers Group - Gordonsville Aggregate",38000003,0.57999999999999996]
[112,"Rogers Group - Harriman Aggregate (Roane County)",17300004,0.46]
[113,"Rogers Group - Hillsboro Aggregate",21600006,0.86]
[114,"Rogers Group* - Hollywood AL",59900341,0.26]
[115,"Rogers Group - Hopkinsville KY Aggregate",59900096,0.74]
[116,"Rogers Group - Lacey's Springs AL Aggregate",59900115,0.62]
[117,"Rogers Group - Lawrenceburg Aggregate",35000002,1.39]
[118,"Rogers Group - Lewisburg Aggregate",32800005,0.62]
[119,"Rogers Group - Liberty Aggregate",22100003,0.19]
[120,"Rogers Group - Linden (TN River S&G) ",36800002,4.12]
[121,"Rogers Group - Linden (Pine Bluff Sand)",36800003,4.12]
[122,"Rogers Group - Livingston Quarry Aggregate",26700003,0.56000000000000005]
[123,"Rogers Group - McMinnville Aggregate",28900004,0.62]
[124,"Rogers Group - Monterey Quarry Aggregate",27100009,0.66]
[125,"Rogers Group - Murfreesboro Aggregate",37500012,0.39]
[126,"Rogers Group - Nashville Reostone Aggregate",31900035,0.5]
[127,"Rogers Group - Nashville Whites Creek Aggregate",31900048,0.43]
[128,"Rogers Group - Oak Ridge Aggregate",10100006,0.6]
[129,"Rogers Group - Oliver Springs Aggregate",10100008,1.1000000000000001]
[130,"Rogers Group - Pottsville Aggregate",35900004,0.32]
[131,"Rogers Group - Pulaski Aggregate",32800004,0.63]
[132,"Rogers Group - Shelbyville Hwy 41A Aggregate",30200002,0.36]
[133,"Rogers Group - Sparta Aggregate",29300004,0.71]
[134,"Rogers Group - Tanner AL Aggregate",59900116,1.63]
[135,"Rogers Group - West Huntsville AL Aggregate",59900229,1.32]
[136,"Wythe Sand - Wytheville VA Sand",59900019,0.28000000000000003]
[137,"Saltillo Sand and Gravel",43600012,0]
[138,"SRM Materials - Monteagle Sand",22600005,0]
[139,"Slats Lucas Quarry/Warren Paving - Salem KY Agg",59900135,0.39]
[140,"Standard Construction -Byhalia MS ",59900108,3.67]
[141,"Standard Construction - Como MS Aggregate",59900337,1.3]
[142,"Standard Construction - Olive Branch, MS",59900492,2.4300000000000002]
[143,"Standard Construction - Stantonville Aggregate",45500003,3.75]
[144,"SRM Crab Orchard Sand - Crossville",21800012,0]
[145,"SRM Materials - Murray, KY",59900514,0]
[146,"SRM Materials - Smyrna",37500023,0.31]
[147,"SRM Materials - Woodbury",20800003,0.2]
[148,"Tinsley Limestone Products",22600010,0.46]
[149,"Tower Rock Stone - St Genevieve MO Aggregate",59900085,1.22]
[150,"Transportation Tech LLC - Greeneville Sand",13000004,0]
[151,"Tri -County Stone",23100001,0.64]
[152,"Tube City IMS - Knoxville - RGI Aggregate",14700024,1.69]
[153,"Volunteer Materials - Lewisburg Aggregate",35900006,0.4]
[154,"Volunteer Materials - Shelbyville",30200010,0.53]
[155,"Volunteer Sand & Gravel - Hurricane Mills",34300003,4.63]
[156,"Vulcan Materials - Adairsville, GA",59900428,0.2]
[157,"Vulcan Materials - Athens",25400005,0.15]
[158,"Vulcan Materials - Blairsville Georgia",59900033,0.28000000000000003]
[159,"Vulcan Materials - Bristol Hwy 11 West",18200014,0.1]
[160,"Vulcan Materials - Buford GA Friendship",59900190,0.36]
[161,"Vulcan Materials - Cartersville Georgia",59900112,0.25]
[162,"Vulcan Materials - Chattanooga",23300016,0.53]
[163,"Vulcan Materials - Cherokee Alabama",59900089,1.07]
[164,"Vulcan Materials - Clarksville",36300011,1]
[165,"Vulcan Materials - Cleveland",20600007,0.23]
[166,"Vulcan Materials - Columbia",36000012,0.89]
[167,"Vulcan Materials - Cookeville",27100013,0.78]
[168,"Vulcan Materials - Dalton GA Agg",59900235,0.28000000000000003]
[169,"Vulcan Materials - Dayton",27200005,0.23]
[170,"Vulcan Materials - Dickson",32200005,1.07]
[171,"Vulcan Materials - East Memphis Rail Yard",47900059,1.07]
[172,"Vulcan Materials - Ellijay Georgia",59900034,0.28000000000000003]
[173,"Vulcan Materials - Enka NC Aggregate",59900023,0.33]
[174,"Vulcan Materials - Falkville AL",59900368,0.33]
[175,"Vulcan Materials - Franklin",39400006,0.73]
[176,"Vulcan Materials - Grand Rivers KY",59900090,0.25]
[177,"Vulcan Materials - Greeneville Greystone Rd Sand",13000005,1.31]
[178,"Vulcan Materials - Greeneville Lonesome Pine Rd",13000006,0.13]
[179,"Vulcan Materials - Helena Alabama",59900117,0.39]
[180,"Vulcan Materials - Hermitage",31900041,0.36]
[181,"Vulcan Materials - Holladay",40300005,0.55000000000000004]
[182,"Vulcan Materials - Kingsport",18200015,0.15]
[183,"Vulcan Materials - Knoxville Everett Rd",14700040,0.35]
[184,"Vulcan Materials - Knoxville Riverside Dr",14700041,0.15]
[185,"Vulcan Materials - Kodak",17800004,0.26]
[186,"Vulcan Materials - LaGrange GA",59900151,0.46]
[187,"Vulcan Materials - Lebanon Murfreesboro Rd",39500013,0.35]
[188,"Vulcan Materials - Lexington KY Manchester St",59900161,0.51]
[189,"Vulcan Materials - Lexington KY Richmond Rd Mine",59900189,0.17]
[190,"Vulcan Materials - Lithia Springs GA",59900152,0.28000000000000003]
[191,"Vulcan Materials - Macon GA",59900091,0.43]
[192,"Vulcan Materials - Maryville",10500007,0.17]
[193,"Vulcan Materials - Maynardville",18700003,0.33]
[194,"Vulcan Materials - Memphis",47900046,0.25]
[195,"Vulcan Materials - Morristown",13200006,0.28000000000000003]
[196,"Vulcan Materials - Nashville Danley Plant",31900042,0.35]
[197,"Vulcan Materials - Nashville River Rd",31900043,0.44]
[198,"Vulcan Materials - Newnan GA Madras",59900191,0.49]
[199,"Vulcan Materials - Newport",11500010,0.32]
[200,"Vulcan Materials - Parsons Aggregate",42000005,0.59]
[201,"Vulcan Materials - Pleasant View",37400001,1.55]
[202,"Vulcan Materials - Readyville",20800001,0.27]
[203,"Vulcan Materials - Rogersville",13700008,0.13]
[204,"Vulcan Materials - Savannah",43600007,0.77]
[205,"Vulcan Materials - Sevierville",17800005,0.08]
[206,"Vulcan Materials - Shelbyville",30200005,0.24]
[207,"Vulcan Materials - Springfield",37400002,1.1399999999999999]
[208,"Vulcan Materials - Sweetwater",16200002,0.21]
[209,"Vulcan Materials - Tazewell",11300005,0.2]
[210,"Vulcan Materials - Trinity AL Aggregate",59900182,0.64]
[211,"Vulcan Materials* - Loudon County Quarry",10500009,0.17]
[212,"Wayne County Rock",39100003,1.03]
[213]
[214]
[215]
[216]
[217,{"$f":"\"RAP - \"&'HMA Producers'!F3","v":"RAP - ATS Construction - Williamsburg KY"},{"$f":"'HMA Producers'!G3","v":59900109},0]
[218,{"$f":"\"RAP - \"&'HMA Producers'!F4","v":"RAP - B & F Hot Mix - Asphalt Mix"},{"$f":"'HMA Producers'!G4","v":11300001},0]
[219,{"$f":"\"RAP - \"&'HMA Producers'!F5","v":"RAP - Blalock Asphalt - Kodak Asphalt Mix"},{"$f":"'HMA Producers'!G5","v":17800001},0]
[220,{"$f":"\"RAP - \"&'HMA Producers'!F6","v":"RAP - Blalock Asphalt - Sevierville Asphalt Mix"},{"$f":"'HMA Producers'!G6","v":17800002},0]
[221,{"$f":"\"RAP - \"&'HMA Producers'!F7","v":"RAP - Duracap Asphalt Paving - Bean Station Asphalt Mix"},{"$f":"'HMA Producers'!G7","v":12900004},0]
[222,{"$f":"\"RAP - \"&'HMA Producers'!F8","v":"RAP - Duracap Asphalt Paving - Heiskell Asphalt Mix"},{"$f":"'HMA Producers'!G8","v":14700015},0]
[223,{"$f":"\"RAP - \"&'HMA Producers'!F9","v":"RAP - Duracap Asphalt Paving - Knoxville Asphalt Mix"},{"$f":"'HMA Producers'!G9","v":14700014},0]
[224,{"$f":"\"RAP - \"&'HMA Producers'!F10","v":"RAP - Duracap Asphalt Paving - Lenoir City Asp Mix"},{"$f":"'HMA Producers'!G10","v":15300010},0]
[225,{"$f":"\"RAP - \"&'HMA Producers'!F11","v":"RAP - Greene County Highway Dept - Asphalt Mix"},{"$f":"'HMA Producers'!G11","v":13000008},0]
[226,{"$f":"\"RAP - \"&'HMA Producers'!F12","v":"RAP - Harrison Construction - Greenback Asphalt Mix"},{"$f":"'HMA Producers'!G12","v":15300003},0]
[227,{"$f":"\"RAP - \"&'HMA Producers'!F13","v":"RAP - Harrison Construction - Heiskell Asphalt Mix"},{"$f":"'HMA Producers'!G13","v":14700007},0]
[228,{"$f":"\"RAP - \"&'HMA Producers'!F14","v":"RAP - Harrison Construction - Jefferson City Asphalt Mix"},{"$f":"'HMA Producers'!G14","v":14500003},0]
[229,{"$f":"\"RAP - \"&'HMA Producers'!F15","v":"RAP - Harrison Construction - Knox Cinder Asphalt Mix"},{"$f":"'HMA Producers'!G15","v":14700008},0]
[230,{"$f":"\"RAP - \"&'HMA Producers'!F16","v":"RAP - Harrison Construction - Knox Everett Asphalt Mix"},{"$f":"'HMA Producers'!G16","v":14700010},0]
[231,{"$f":"\"RAP - \"&'HMA Producers'!F17","v":"RAP - Harrison Construction - Maryville Asphalt Mix"},{"$f":"'HMA Producers'!G17","v":10500001},0]
[232,{"$f":"\"RAP - \"&'HMA Producers'!F18","v":"RAP - Harrison Construction - Mascot Asphalt Mix"},{"$f":"'HMA Producers'!G18","v":14700011},0]
[233,{"$f":"\"RAP - \"&'HMA Producers'!F19","v":"RAP - Harrison Construction - Maynardville Asphalt Mix"},{"$f":"'HMA Producers'!G19","v":18700001},0]
[234,{"$f":"\"RAP - \"&'HMA Producers'!F20","v":"RAP - Harrison Construction - Morristown Asphalt Mix"},{"$f":"'HMA Producers'!G20","v":13200001},0]
[235,{"$f":"\"RAP - \"&'HMA Producers'!F21","v":"RAP - Harrison Construction - Rogersville Asphalt Mix"},{"$f":"'HMA Producers'!G21","v":13700010},0]
[236,{"$f":"\"RAP - \"&'HMA Producers'!F22","v":"RAP - Harrison Construction - Spring Hill Asphalt Mix"},{"$f":"'HMA Producers'!G22","v":14700042},0]
[237,{"$f":"\"RAP - \"&'HMA Producers'!F23","v":"RAP - Hinkle Contracting - Middlesboro KY Asphalt Mix"},{"$f":"'HMA Producers'!G23","v":59900010},0]
[238,{"$f":"\"RAP - \"&'HMA Producers'!F24","v":"RAP - Jefferson Co Hwy Dept - Jefferson City Asphalt Mix"},{"$f":"'HMA Producers'!G24","v":14500007},0]
[239,{"$f":"\"RAP - \"&'HMA Producers'!F25","v":"RAP - Maymead - Mountain City Asphalt Mix"},{"$f":"'HMA Producers'!G25","v":14600003},0]
[240,{"$f":"\"RAP - \"&'HMA Producers'!F26","v":"RAP - Miller & Sons Paving - Oneida Asphalt Mix"},{"$f":"'HMA Producers'!G26","v":17600001},0]
[241,{"$f":"\"RAP - \"&'HMA Producers'!F27","v":"RAP - Newport Paving - Newport Asphalt Mix"},{"$f":"'HMA Producers'!G27","v":11500001},0]
[242,{"$f":"\"RAP - \"&'HMA Producers'!F28","v":"RAP - Pave Grade & Aggregate - Pioneer"},{"$f":"'HMA Producers'!G28","v":10700007},0]
[243,{"$f":"\"RAP - \"&'HMA Producers'!F29","v":"RAP - Pave-Well - Blountville"},{"$f":"'HMA Producers'!G29","v":18200025},0]
[244,{"$f":"\"RAP - \"&'HMA Producers'!F30","v":"RAP - PRI - Knoxville Asphalt Mix"},{"$f":"'HMA Producers'!G30","v":14700053},0]
[245,{"$f":"\"RAP - \"&'HMA Producers'!F31","v":"RAP - Rogers Group - Harriman Quarry Rd Asphalt Mix"},{"$f":"'HMA Producers'!G31","v":17300005},0]
[246,{"$f":"\"RAP - \"&'HMA Producers'!F32","v":"RAP - Rogers Group - Jacksboro Towe String Rd Asp Mix"},{"$f":"'HMA Producers'!G32","v":10700006},0]
[247,{"$f":"\"RAP - \"&'HMA Producers'!F33","v":"RAP - Rogers Group - Knoxville Candora Ave Asphalt Mix"},{"$f":"'HMA Producers'!G33","v":14700031},0]
[248,{"$f":"\"RAP - \"&'HMA Producers'!F34","v":"RAP - Rogers Group - Madisonville Asphalt Mix"},{"$f":"'HMA Producers'!G34","v":16200006},0]
[249,{"$f":"\"RAP - \"&'HMA Producers'!F35","v":"RAP - Rogers Group - Oak Ridge Asphalt Mix"},{"$f":"'HMA Producers'!G35","v":10100005},0]
[250,{"$f":"\"RAP - \"&'HMA Producers'!F36","v":"RAP - Rogers Group - Sweetwater Asphalt Mix"},{"$f":"'HMA Producers'!G36","v":16200001},0]
[251,{"$f":"\"RAP - \"&'HMA Producers'!F37","v":"RAP - Rogers Group - Tazewell Asphalt Mix"},{"$f":"'HMA Producers'!G37","v":11300004},0]
[252,{"$f":"\"RAP - \"&'HMA Producers'!F38","v":"RAP - Summers Taylor - Blountville Drum Plant Asp Mix"},{"$f":"'HMA Producers'!G38","v":18200010},0]
[253,{"$f":"\"RAP - \"&'HMA Producers'!F39","v":"RAP - Summers Taylor - Greeneville Asphalt Mix"},{"$f":"'HMA Producers'!G39","v":13000002},0]
[254,{"$f":"\"RAP - \"&'HMA Producers'!F41","v":"RAP - Summers Taylor - Watauga Asphalt Mix"},{"$f":"'HMA Producers'!G41","v":11000002},0]
[255,{"$f":"\"RAP - \"&'HMA Producers'!F42","v":"RAP - W & L Construction - Abington VA Asphalt Mix"},{"$f":"'HMA Producers'!G42","v":59900110},0]
[256,{"$f":"\"RAP - \"&'HMA Producers'!F43","v":"RAP - W & L Construction - Kingsport Asphalt Mix"},{"$f":"'HMA Producers'!G43","v":18200017},0]
[257,{"$f":"\"RAP - \"&'HMA Producers'!F44","v":"RAP - Washington County Highway Dept"},{"$f":"'HMA Producers'!G44","v":19000010},0]
[258,{"$f":"\"RAP - \"&'HMA Producers'!F45","v":"RAP - Willis Paving Inc - Tazewell Asphalt Mix"},{"$f":"'HMA Producers'!G45","v":11300006},0]
[259,{"$f":"\"RAP - \"&'HMA Producers'!F46","v":"RAP - Central Asphalt - Cleveland Asphalt Mix"},{"$f":"'HMA Producers'!G46","v":20600002},0]
[260,{"$f":"\"RAP - \"&'HMA Producers'!F47","v":"RAP - Copeland DRP LLC - Cookeville Asphalt Mix"},{"$f":"'HMA Producers'!G47","v":27100016},0]
[261,{"$f":"\"RAP - \"&'HMA Producers'!F48","v":"RAP - CW Matthews - Cartersville GA Asphalt Mix"},{"$f":"'HMA Producers'!G48","v":59900429},0]
[262,{"$f":"\"RAP - \"&'HMA Producers'!F49","v":"RAP - CW Matthews - Dalton GA Asphalt Mix"},{"$f":"'HMA Producers'!G49","v":59900327},0]
[263,{"$f":"\"RAP - \"&'HMA Producers'!F50","v":"RAP - Dunlap Stone - Dunlap Asphalt Mix"},{"$f":"'HMA Producers'!G50","v":27700004},0]
[264,{"$f":"\"RAP - \"&'HMA Producers'!F51","v":"RAP - Dunlap Stone - Pikeville Asphalt Mix"},{"$f":"'HMA Producers'!G51","v":20400003},0]
[265,{"$f":"\"RAP - \"&'HMA Producers'!F52","v":"RAP - Harrison Construction - Cherokee County NC Asphalt Mix"},{"$f":"'HMA Producers'!G52","v":59900026},0]
[266,{"$f":"\"RAP - \"&'HMA Producers'!F53","v":"RAP - Harrison Construction - Hayesville NC Asphalt Mix"},{"$f":"'HMA Producers'!G53","v":59900168},0]
[267,{"$f":"\"RAP - \"&'HMA Producers'!F54","v":"RAP - Hawkins Asphalt Paving - Woodbury Asphalt Mix"},{"$f":"'HMA Producers'!G54","v":20800004},0]
[268,{"$f":"\"RAP - \"&'HMA Producers'!F55","v":"RAP - Hiwassee Paving - Chattanooga Asphalt Mix"},{"$f":"'HMA Producers'!G55","v":23300003},0]
[269,{"$f":"\"RAP - \"&'HMA Producers'!F56","v":"RAP - Hiwassee Paving LLC  - Calhoun Asphalt Mix"},{"$f":"'HMA Producers'!G56","v":25400007},0]
[270,"RAP - Manhattan Materials - Cleveland Asphalt Mix",{"$f":"'HMA Producers'!G57","v":20600008},0]
[271,{"$f":"\"RAP - \"&'HMA Producers'!F58","v":"RAP - Rogers Group - Algood Asphalt Mix"},{"$f":"'HMA Producers'!G58","v":27100005},0]
[272,{"$f":"\"RAP - \"&'HMA Producers'!F59","v":"RAP - Rogers Group - Cookeville Asphalt Mix LAB ONLY"},{"$f":"'HMA Producers'!G59","v":27100006},0]
[273,{"$f":"\"RAP - \"&'HMA Producers'!F60","v":"RAP - Rogers Group - Cowan Asphalt Mix"},{"$f":"'HMA Producers'!G60","v":22600004},0]
[274,{"$f":"\"RAP - \"&'HMA Producers'!F61","v":"RAP - Rogers Group - Crab Orchard Asphalt Mix"},{"$f":"'HMA Producers'!G61","v":21800007},0]
[275,{"$f":"\"RAP - \"&'HMA Producers'!F62","v":"RAP - Rogers Group - Dayton Asphalt Mix"},{"$f":"'HMA Producers'!G62","v":27200002},0]
[276,{"$f":"\"RAP - \"&'HMA Producers'!F63","v":"RAP - Rogers Group - Hillsboro Asphalt Mix"},{"$f":"'HMA Producers'!G63","v":21600004},0]
[277,{"$f":"\"RAP - \"&'HMA Producers'!F64","v":"RAP - Rogers Group - Hollywood, AL Asphalt Mix"},{"$f":"'HMA Producers'!G64","v":59900476},0]
[278,{"$f":"\"RAP - \"&'HMA Producers'!F65","v":"RAP - Rogers Group - Liberty Asphalt Mix"},{"$f":"'HMA Producers'!G65","v":22100004},0]
[279,{"$f":"\"RAP - \"&'HMA Producers'!F66","v":"RAP - Rogers Group - Livingston Asphalt Mix"},{"$f":"'HMA Producers'!G66","v":26700001},0]
[280,{"$f":"\"RAP - \"&'HMA Producers'!F67","v":"RAP - Rogers Group - McMinnville Asphalt Mix"},{"$f":"'HMA Producers'!G67","v":28900007},0]
[281,{"$f":"\"RAP - \"&'HMA Producers'!F68","v":"RAP - Rogers Group - Pall Mall Asphalt Mix"},{"$f":"'HMA Producers'!G68","v":22500003},0]
[282,{"$f":"\"RAP - \"&'HMA Producers'!F69","v":"RAP - Rogers Group - Sparta Asphalt Mix"},{"$f":"'HMA Producers'!G69","v":29300001},0]
[283,{"$f":"\"RAP - \"&'HMA Producers'!F70","v":"RAP - Southeastern Mtls - Chattanooga Asphalt Mix"},{"$f":"'HMA Producers'!G70","v":23300001},0]
[284,{"$f":"\"RAP - \"&'HMA Producers'!F71","v":"RAP - Southeastern Mtls - Cleveland Asphalt Mix"},{"$f":"'HMA Producers'!G71","v":20600006},0]
[285,{"$f":"\"RAP - \"&'HMA Producers'!F72","v":"RAP - Southeastern Mtls - Tiftonia Asphalt Mix"},{"$f":"'HMA Producers'!G72","v":23300012},0]
[286,{"$f":"\"RAP - \"&'HMA Producers'!F73","v":"RAP - Tinsley Asphalt - Decherd Asphalt Mix"},{"$f":"'HMA Producers'!G73","v":22600008},0]
[287,{"$f":"\"RAP - \"&'HMA Producers'!F74","v":"RAP - Tinsley Asphalt - McMinnville Asphalt Mix"},{"$f":"'HMA Producers'!G74","v":28900005},0]
[288,{"$f":"\"RAP - \"&'HMA Producers'!F75","v":"RAP - Tinsley Asphalt - South Pittsburg Asphalt Mix"},{"$f":"'HMA Producers'!G75","v":25800004},0]
[289,{"$f":"\"RAP - \"&'HMA Producers'!F76","v":"RAP - Vulcan - Cookeville Asphalt Mix"},{"$f":"'HMA Producers'!G76","v":27100008},0]
[290,{"$f":"\"RAP - \"&'HMA Producers'!F77","v":"RAP - Eubank Asphalt - Dickson (Astec)"},{"$f":"'HMA Producers'!G77","v":32200007},0]
[291,{"$f":"\"RAP - \"&'HMA Producers'!F79","v":"RAP - Fairview Asphalt Products Inc - Asphalt Mix"},{"$f":"'HMA Producers'!G79","v":39400001},0]
[292,{"$f":"\"RAP - \"&'HMA Producers'!F80","v":"RAP - Hawkins Asphalt Paving - Shelbyville Asphalt Mix"},{"$f":"'HMA Producers'!G80","v":30200008},0]
[293,{"$f":"\"RAP - \"&'HMA Producers'!F81","v":"RAP - Hoover - Old Hickory Asphalt Mix"},{"$f":"'HMA Producers'!G81","v":31900061},0]
[294,{"$f":"\"RAP - \"&'HMA Producers'!F82","v":"RAP - Hoover - Smyrna Asphalt Mix"},{"$f":"'HMA Producers'!G82","v":37500004},0]
[295,{"$f":"\"RAP - \"&'HMA Producers'!F83","v":"RAP - Jones Bros Contractors - Clarksville Asphalt Mix"},{"$f":"'HMA Producers'!G83","v":36300004},0]
[296,{"$f":"\"RAP - \"&'HMA Producers'!F84","v":"RAP - Jones Bros Contractors - Dickson Asphalt Mix"},{"$f":"'HMA Producers'!G84","v":32200008},0]
[297,{"$f":"\"RAP - \"&'HMA Producers'!F85","v":"RAP - Jones Bros Contractors - Nashville Asphalt Mix"},{"$f":"'HMA Producers'!G85","v":31900009},0]
[298,{"$f":"\"RAP - \"&'HMA Producers'!F86","v":"RAP - Jones Bros Contractors - Old Hickory Asphalt Mix"},{"$f":"'HMA Producers'!G86","v":31900079},0]
[299,{"$f":"\"RAP - \"&'HMA Producers'!F87","v":"RAP - Jones Bros Contractors - Robertson County Asphalt Mix"},{"$f":"'HMA Producers'!G87","v":37400014},0]
[300,{"$f":"\"RAP - \"&'HMA Producers'!F88","v":"RAP - Lincoln Paving Co - Fayetteville"},{"$f":"'HMA Producers'!G88","v":35200003},0]
[301,{"$f":"\"RAP - \"&'HMA Producers'!F89","v":"RAP - Lincoln Paving Co - Lewisburg"},{"$f":"'HMA Producers'!G89","v":35900003},0]
[302,{"$f":"\"RAP - \"&'HMA Producers'!F90","v":"RAP - Lincoln Paving Co - Lynchburg"},{"$f":"'HMA Producers'!G90","v":36400001},0]
[303,{"$f":"\"RAP - \"&'HMA Producers'!F91","v":"RAP - Marathon Ashland - Nashville Liquid Asphalt"},{"$f":"'HMA Producers'!G91","v":31900025},0]
[304,{"$f":"\"RAP - \"&'HMA Producers'!F92","v":"RAP - Maury Co Asphalt - Columbia"},{"$f":"'HMA Producers'!G92","v":36000008},0]
[305,{"$f":"\"RAP - \"&'HMA Producers'!F93","v":"RAP - McAsphalt LLC, Clarksville Plant 1"},{"$f":"'HMA Producers'!G93","v":36300009},0]
[306,{"$f":"\"RAP - \"&'HMA Producers'!F94","v":"RAP - McAsphalt LLC, Clarksville Plant 2"},{"$f":"'HMA Producers'!G94","v":36300015},0]
[307,{"$f":"\"RAP - \"&'HMA Producers'!F95","v":"RAP - Rogers Group - Columbia Asphalt Mix"},{"$f":"'HMA Producers'!G95","v":36000009},0]
[308,{"$f":"\"RAP - \"&'HMA Producers'!F96","v":"RAP - Rogers Group - Cross Plains Rockhouse Rd Asphalt"},{"$f":"'HMA Producers'!G96","v":37400010},0]
[309,{"$f":"\"RAP - \"&'HMA Producers'!F97","v":"RAP - Rogers Group - Gallatin Asphalt Mix"},{"$f":"'HMA Producers'!G97","v":38300012},0]
[310,{"$f":"\"RAP - \"&'HMA Producers'!F98","v":"RAP - Rogers Group - Hopkinsville Kentucky Asphalt"},{"$f":"'HMA Producers'!G98","v":59900046},0]
[311,{"$f":"\"RAP - \"&'HMA Producers'!F99","v":"RAP - Rogers Group - Huntsville, AL"},{"$f":"'HMA Producers'!G99","v":59900473},0]
[312,{"$f":"\"RAP - \"&'HMA Producers'!F100","v":"RAP - Rogers Group - Lawrenceburg Asphalt Mix"},{"$f":"'HMA Producers'!G100","v":35000003},0]
[313,{"$f":"\"RAP - \"&'HMA Producers'!F101","v":"RAP - Rogers Group - Nashville Whites Creek Asphalt Mix"},{"$f":"'HMA Producers'!G101","v":31900036},0]
[314,{"$f":"\"RAP - \"&'HMA Producers'!F102","v":"RAP - Rogers Group - Nashville ReoStone Asphalt Mix"},{"$f":"'HMA Producers'!G102","v":31900083},0]
[315,{"$f":"\"RAP - \"&'HMA Producers'!F103","v":"RAP - Rogers Group - New Prospect"},{"$f":"'HMA Producers'!G103","v":35000005},0]
[316,{"$f":"\"RAP - \"&'HMA Producers'!F104","v":"RAP - Rogers Group - Pottsville Asphalt Mix"},{"$f":"'HMA Producers'!G104","v":35900007},0]
[317,{"$f":"\"RAP - \"&'HMA Producers'!F105","v":"RAP - Rogers Group - Pulaski Bethel Rd Asphalt Mix"},{"$f":"'HMA Producers'!G105","v":32800008},0]
[318,{"$f":"\"RAP - \"&'HMA Producers'!F106","v":"RAP - Scotty's Asphalt Co"},{"$f":"'HMA Producers'!G106","v":59900047},0]
[319,{"$f":"\"RAP - \"&'HMA Producers'!F107","v":"RAP - Tennessee Valley Asphalt - Fairview"},{"$f":"'HMA Producers'!G107","v":39400001},0]
[320,{"$f":"\"RAP - \"&'HMA Producers'!F108","v":"RAP - Tennessee Valley Blacktop, Inc. - Dickson"},{"$f":"'HMA Producers'!G108","v":32200011},0]
[321,{"$f":"\"RAP - \"&'HMA Producers'!F109","v":"RAP - Volunteer Materials - Lewisburg Asp Mix"},{"$f":"'HMA Producers'!G109","v":35900008},0]
[322,{"$f":"\"RAP - \"&'HMA Producers'!F110","v":"RAP - Volunteer Materials - Shelbyville Asphalt Mix"},{"$f":"'HMA Producers'!G110","v":30200006},0]
[323,{"$f":"\"RAP - \"&'HMA Producers'!F111","v":"RAP - Vulcan - City Plant"},{"$f":"'HMA Producers'!G111","v":31900023},0]
[324,{"$f":"\"RAP - \"&'HMA Producers'!F112","v":"RAP - Vulcan - Clarksville"},{"$f":"'HMA Producers'!G112","v":36300013},0]
[325,{"$f":"\"RAP - \"&'HMA Producers'!F114","v":"RAP - Vulcan - Danley"},{"$f":"'HMA Producers'!G114","v":31900021},0]
[326,{"$f":"\"RAP - \"&'HMA Producers'!F115","v":"RAP - Vulcan - Franklin"},{"$f":"'HMA Producers'!G115","v":39400002},0]
[327,{"$f":"\"RAP - \"&'HMA Producers'!F116","v":"RAP - Vulcan - Gordonsville"},{"$f":"'HMA Producers'!G116","v":38000002},0]
[328,{"$f":"\"RAP - \"&'HMA Producers'!F117","v":"RAP - Vulcan - Hermitage"},{"$f":"'HMA Producers'!G117","v":31900022},0]
[329,{"$f":"\"RAP - \"&'HMA Producers'!F118","v":"RAP - Vulcan - Lebanon  Asphalt"},{"$f":"'HMA Producers'!G118","v":39500006},0]
[330,{"$f":"\"RAP - \"&'HMA Producers'!F119","v":"RAP - Vulcan - Murfreesboro"},{"$f":"'HMA Producers'!G119","v":37500007},0]
[331,{"$f":"\"RAP - \"&'HMA Producers'!F120","v":"RAP - Vulcan - Nashville River Rd"},{"$f":"'HMA Producers'!G120","v":31900024},0]
[332,{"$f":"\"RAP - \"&'HMA Producers'!F121","v":"RAP - Vulcan - Springfield"},{"$f":"'HMA Producers'!G121","v":37400005},0]
[333,{"$f":"\"RAP - \"&'HMA Producers'!F122","v":"RAP - Wiregrass Construction Co - Lebanon Asphalt Mix"},{"$f":"'HMA Producers'!G122","v":39500016},0]
[334,{"$f":"\"RAP - \"&'HMA Producers'!F123","v":"RAP - Wiregrass Construction Co - Murfreesboro Asphalt Mix"},{"$f":"'HMA Producers'!G123","v":37500003},0]
[335,{"$f":"\"RAP - \"&'HMA Producers'!F124","v":"RAP - Wiregrass Construction Co. - Smyrna Asphalt Mix"},{"$f":"'HMA Producers'!G124","v":37500025},0]
[336,{"$f":"\"RAP - \"&'HMA Producers'!F125","v":"RAP - Wright Paving Co - Pottsville"},{"$f":"'HMA Producers'!G125","v":35900005},0]
[337,{"$f":"\"RAP - \"&'HMA Producers'!F126","v":"RAP - APAC - Glen Mississippi Asphalt Mix"},{"$f":"'HMA Producers'!G126","v":59900054},0]
[338,{"$f":"\"RAP - \"&'HMA Producers'!F127","v":"RAP - APAC - Memphis Harbour Ave Asphalt Mix"},{"$f":"'HMA Producers'!G127","v":47900004},0]
[339,{"$f":"\"RAP - \"&'HMA Producers'!F128","v":"RAP - APAC - Memphis Tuggle Rd Asphalt Mix"},{"$f":"'HMA Producers'!G128","v":47900005},0]
[340,{"$f":"\"RAP - \"&'HMA Producers'!F129","v":"RAP - Arrow Paving Inc - Lexington Asphalt Mix"},{"$f":"'HMA Producers'!G129","v":43900001},0]
[341,{"$f":"\"RAP - \"&'HMA Producers'!F130","v":"RAP - Delta Contracting - Holladay Asphalt Mix"},{"$f":"'HMA Producers'!G130","v":40300002},0]
[342,{"$f":"\"RAP - \"&'HMA Producers'!F131","v":"RAP - Delta Contracting - Humboldt Asphalt Mix"},{"$f":"'HMA Producers'!G131","v":42700001},0]
[343,{"$f":"\"RAP - \"&'HMA Producers'!F132","v":"RAP - Delta Contracting - Jackson Asphalt Mix"},{"$f":"'HMA Producers'!G132","v":45700017},0]
[344,{"$f":"\"RAP - \"&'HMA Producers'!F133","v":"RAP - Delta Contracting - Parsons Asphalt Mix"},{"$f":"'HMA Producers'!G133","v":42000001},0]
[345,{"$f":"\"RAP - \"&'HMA Producers'!F134","v":"RAP - Delta Contracting - Savannah Asphalt Mix"},{"$f":"'HMA Producers'!G134","v":43600002},0]
[346,{"$f":"\"RAP - \"&'HMA Producers'!F135","v":"RAP - Delta Contracting- Paris Asphalt Mix"},{"$f":"'HMA Producers'!G135","v":44000004},0]
[347,{"$f":"\"RAP - \"&'HMA Producers'!F136","v":"RAP - Ford Construction - Dresden Asphalt Mix"},{"$f":"'HMA Producers'!G136","v":49200002},0]
[348,{"$f":"\"RAP - \"&'HMA Producers'!F137","v":"RAP - Ford Construction - Dyersburg Asphalt Mix"},{"$f":"'HMA Producers'!G137","v":42300004},0]
[349,{"$f":"\"RAP - \"&'HMA Producers'!F138","v":"RAP - Ford Construction - Jackson Asphalt Mix"},{"$f":"'HMA Producers'!G138","v":45700006},0]
[350,{"$f":"\"RAP - \"&'HMA Producers'!F139","v":"RAP - Ford Construction - Troy Asphalt Mix"},{"$f":"'HMA Producers'!G139","v":46600004},0]
[351,{"$f":"\"RAP - \"&'HMA Producers'!F140","v":"RAP - Ford Construction - Union City Asphalt Mix"},{"$f":"'HMA Producers'!G140","v":46600005},0]
[352,{"$f":"\"RAP - \"&'HMA Producers'!F141","v":"RAP - Frank Climer and Sons - Munford Asphalt Mix"},{"$f":"'HMA Producers'!G141","v":48400003},0]
[353,{"$f":"\"RAP - \"&'HMA Producers'!F142","v":"RAP - Hardeman Co. Highway Dept."},{"$f":"'HMA Producers'!G142","v":"N/A"},0]
[354,{"$f":"\"RAP - \"&'HMA Producers'!F143","v":"RAP - J Hamm Asphalt - Crump Asphalt Mix"},{"$f":"'HMA Producers'!G143","v":43600009},0]
[355,{"$f":"\"RAP - \"&'HMA Producers'!F144","v":"RAP - Jones Bros Contractors - Lexington Asphalt Mix"},{"$f":"'HMA Producers'!G144","v":43900004},0]
[356,{"$f":"\"RAP - \"&'HMA Producers'!F145","v":"RAP - Lehman Roberts - Arlington Asphalt Mix"},{"$f":"'HMA Producers'!G145","v":47900012},0]
[357,{"$f":"\"RAP - \"&'HMA Producers'!F146","v":"RAP - Lehman Roberts - Byhalia MS Asphalt Mix"},{"$f":"'HMA Producers'!G146","v":59900329},0]
[358,{"$f":"\"RAP - \"&'HMA Producers'!F147","v":"RAP - Lehman Roberts - Hernando, MS"},{"$f":"'HMA Producers'!G147","v":59900455},0]
[359,{"$f":"\"RAP - \"&'HMA Producers'!F148","v":"RAP - Lehman Roberts - Memphis Carrier Asphalt Mix"},{"$f":"'HMA Producers'!G148","v":47900014},0]
[360,{"$f":"\"RAP - \"&'HMA Producers'!F149","v":"RAP - Martin Paving - Medina Asphalt Mix"},{"$f":"'HMA Producers'!G149","v":42700002},0]
[361,{"$f":"\"RAP - \"&'HMA Producers'!F150","v":"RAP - Murray Paving"},{"$f":"'HMA Producers'!G150","v":59900513},0]
[362,{"$f":"\"RAP - \"&'HMA Producers'!F151","v":"RAP - Standard Construction - Collierville Asphalt Mix"},{"$f":"'HMA Producers'!G151","v":47900052},0]
[363,{"$f":"\"RAP - \"&'HMA Producers'!F152","v":"RAP - Standard Construction - Cordova Asphalt Mix"},{"$f":"'HMA Producers'!G152","v":47900042},0]
[364,"RAP - Standard Construction - Millington Asphalt Mix",{"$f":"'HMA Producers'!G153","v":47900069},0]
[365,{"$f":"\"RAP - \"&'HMA Producers'!F154","v":"RAP - Standard Construction - Stantonville Asphalt Mix"},{"$f":"'HMA Producers'!G154","v":45500005},0]
[366,{"$f":"\"RAP - \"&'HMA Producers'!F155","v":"RAP - Standard Construction - Whiteville Asphalt Mix"},{"$f":"'HMA Producers'!G155","v":43500002},0]
[367,{"$f":"\"RAP - \"&'HMA Producers'!F156","v":"RAP - Union City Paving"},{"$f":"'HMA Producers'!G156","v":46600006},0]
[368,{"$f":"\"RAP - \"&'HMA Producers'!F157","v":"RAP - Volunteer Paving - Holladay"},{"$f":"'HMA Producers'!G157","v":40300010},0]
[369,null,{"$error":"#REF!"}]
[370,null,{"$error":"#REF!"}]
[371,null,{"$error":"#REF!"}]
[372]
[373]
[374,"RAS - Ground Up Recycling, Cookeville",27100018,0]
[375,"RAS - Ground Up Recycling, Mt Juliet",39500018,0]
[376,"RAS - Ground Up Recycling, Murfreesboro",37500020,0]
[377,"RAS - Paragon/E-PLEX, Collierville",47900064,0]
[378,"RAS - Paragon/E-PLEX, Memphis",47900065,0]
[379,"RAS - Tinsley Asphalt Products, Estill Springs",21600008,0]
[380,"RAS - TN Shingle Recycling - Murfreesboro",37500021,0]
[381,"RAS - LJC Environmental - NC",59900370,0]
[382]
[383]
[384]
[385]
[386]
[387]
[388]
[389]
[390]
[391]
[392]
[393]

{"sheet":"Aggregate Sizes","index":37,"n_rows":46,"n_cols":8,"rows_kept":46,"cut":false,"hidden":true,"merged":[]}
[null,"Aggregate Sizes"]
[]
[null,"SiteManager Material Codes"]
[]
[1,null,null,null,null,1]
[2,"903.06.076","Coarse Agg PM Base & Level Crush Stone","Soft Limestone (aka Non-Surface)",null,2,"#3"]
[3,"903.11.097","Coarse Agg Asph Surf Crush (Slag)","Slag",null,3,"#357"]
[4,"903.11.098","Coarse Agg Asph Surf Crush (Gravel)","Gravel ",null,4,"#4"]
[5,"903.11.099","Agg Asph Crush (Granite)","Granite",null,5,"#467"]
[6,"903.11.100","Coarse Agg Asph Surf Crush (Quartzite)","Quartzite",null,6,"#5"]
[7,"903.19.136","Agg Surf Sandstone","Sandstone",null,7,"#56"]
[8,"903.11.101","Coarse Agg Asph Surf Crush (Gneiss)","Gneiss",null,8,"#57"]
[9,"903.11.102","Agg Surf Gr D Type 1 (Crush Stone)","Hard Limestone (Type I)",null,9,"#6"]
[10,"903.11.103","Agg Surf Gr D Type 2 (Crush Stone)","Hard Limestone (Type II)",null,10,"#67"]
[11,"903.11.104","Agg Surf Gr D Type 3 (Crush Stone)","Hard Limestone (Type III)",null,11,"#68"]
[12,"903.11.105","Agg Surf Gr D Type 4 (Crush Stone)","Hard Limestone (Type IV)",null,12,"#7"]
[13,"903.11.106","Fine Agg for Asphalt Surface","Natural Sand",null,13,"#78"]
[14,"903.16.126","Mineral Filler","Mineral Filler",null,14,"#8"]
[15,"918.04.003","Hydrated Lime",{"$f":"C19","v":"Hydrated Lime"},null,15,"#89"]
[16,"903.06.077","Baghouse Fines","Baghouse Fines",null,16,"#9"]
[17,"918.17.030","Agricultural Limestone",{"$f":"C21","v":"Agricultural Limestone"},null,17,"#10"]
[18,"903.23.153","Recycled Asphalt Pavement (Unprocessed)","RAP",null,18,"#10 - Washed"]
[19,"903.23.160","Recycled Asphalt Shingles","RAS",null,19,"D Rock"]
[null,null,null,null,null,20,"BM-2 Rock"]
[null,null,null,null,null,21,"Manufactured Sand"]
[null,null,null,null,null,22,"Natural Sand"]
[null,null,null,null,null,23,"Coarse Slag"]
[null,null,null,null,null,24,"Fine Slag"]
[null,null,null,null,null,25,"Hydrated Lime"]
[null,null,null,null,null,26,"AG Lime"]
[null,null,null,null,null,27,"Baghouse Fines"]
[null,null,null,null,null,28,"RAP Processed - 5/16","903.23.154"]
[null,null,null,null,null,29,"RAP Processed -1/2","903.23.155"]
[null,null,null,null,null,30,"RAP Processed -3/8","903.23.156"]
[null,null,null,null,null,31,"RAP Processed -3/4","903.23.157"]
[null,null,null,null,null,32,"RAP Processed- 1-1/2","903.23.158"]
[null,null,null,null,null,33,"RAP Processed Coarse","903.23.159"]
[null,null,null,null,null,34,"RAP Processed- 1/4","903.23.162"]
[null,null,null,null,null,35,"RAP Fractionated - 5/16","903.23.163"]
[null,null,null,null,null,36,"RAP Fractionated - 1/2","903.23.164"]
[null,null,null,null,null,37,"RAP Fractionated - 3/8","903.23.165"]
[null,null,null,null,null,38,"RAP Fractionated - 3/4","903.23.166"]
[null,null,null,null,null,39,"RAP Fractionated - 1-1/2","903.23.167"]
[null,null,null,null,null,40,"RAP Fractionated Coarse","903.23.168"]
[null,null,null,null,null,41,"RAP Fractionated - 1/4","903.23.169"]
[null,null,null,null,null,42,"Recycled Shingles (RAS) - 3/8","903.23.160"]

{"sheet":"Sheet1","index":38,"n_rows":0,"n_cols":0,"rows_kept":0,"cut":false,"hidden":true,"merged":[]}