{"text_format":"1","workbook":"xlsx","n_sheets":32,"sheets":["Main","Find your State ID","DBase","Sch A","A-Data","Sch B","B-Data","Sch C","Sheet2","C-Data","Sch D-1","D-1-Data","Sch D-2","D-2-Data","Sch D-3","D-3-Data","Sch E","E-Data","Sch F-1","F-1-Data","Sch F-2","F-2-Data","Sch G","G-Data","Sch H","H-Data","Error Sheet","Adm Dec","Dec-Data","Appendix A","Appendix B","Tips"],"not_rendered":{"charts":0,"images":3,"macros":1,"external_links":0,"defined_names":997,"comments":0,"pivot_tables":0},"unopened":[],"bounds":{"document_bytes":16777216,"sheet_cells":100000,"rows_first":2000,"rows_last":500,"rows_between":2000,"halvings":0,"cell_chars":16384,"cell_head_chars":4096},"cells_cut":0,"cells_raw":0,"read":"whole","date_system":"1900"}

{"sheet":"Main","index":0,"n_rows":27,"n_cols":43,"rows_kept":27,"cut":false,"hidden":false,"merged":[[0,0,0,35],[1,0,1,3],[1,4,1,8],[1,9,1,14],[1,15,1,35],[9,0,9,35],[4,0,4,7],[8,0,8,35],[24,0,24,35],[17,0,17,35],[12,0,12,35],[13,0,13,35],[14,0,14,35],[15,0,15,35],[10,0,10,35],[4,8,4,26],[5,8,5,26],[26,0,26,35],[11,0,11,35],[18,0,18,35],[19,0,19,35],[20,0,20,35],[22,0,22,35],[21,0,21,35],[25,0,25,35],[16,0,16,35]]}
["2018 Nursing Homes PROVISIONAL"]
["State ID:",null,null,null,{"$f":"NHA_StateID","v":0},null,null,null,null,"Facility Name:",null,null,null,null,null,{"$f":"NHA_Name","v":"-"}]
[]
[]
[null,null,null,null,null,null,null,null,"Health Statistics\n2nd Floor, Andrew Johnson Tower\n710 James Robertson Parkway\nNashville, TN 37243\nTelephone: (615) 741-1954  Fax: (615) 253-1688",null,null,null,null,null,null,null,null,null,null,null,null,null,null,null,null,null,null,null,null,null,null,null,null,null,null,null,null,null,null,null,null,null,0]
[null,null,null,null,null,null,null,null,"TENNESSEE JOINT ANNUAL REPORT OF\n NURSING HOMES\n2018"]
[]
[]
[]
["Schedule A – Identification"]
["Schedule B – Organization Structure"]
["Schedule C – Licensure, Accreditations, and Memberships"]
["Schedule D – Facilities and Services – Part 1"]
["Schedule D – Facilities and Services – Part 2"]
["Schedule D – Facilities and Services – Part 3"]
["Schedule E – Beds"]
["Schedule F – Utilization – Part 1"]
["Schedule F – Utilization – Part 2"]
["Schedule G – Personnel"]
["Schedule H – Financial Data"]
["Error Listing - Facility Comments Required"]
["Administrator’s Declaration"]
["Appendix A: Commonly Prescribed Medications by"]
["                                 Categories by brand ( Generic)"]
["Appendix B: Definitions"]
["Tips"]
["Find Your State ID"]

{"sheet":"Find your State ID","index":1,"n_rows":341,"n_cols":12,"rows_kept":341,"cut":false,"hidden":false,"merged":[]}
["State ID","License\nNumber","2018 Tennessee Joint Annual Report                                                    of Nursing Homes                                                                                               Facility Name","County","Address","City","State","Zip","LTBML"]
["751442",356,"Adams Place","Rutherford","1927 Memorial Boulevard","Murfreesboro","TN","37129"]
["550352",167,"Adamsville Healthcare and Rehabilitation Center","McNairy","409 Park Avenue","Adamsville","TN","38310"]
["900512",290,"Agape Nursing & Rehabilitation Center, LLC","Washington","105 West Myrtle Avenue","Johnson City","TN","37604"]
["630242",190,"AHava Healthcare of Clarksville","Montgomery","111 Ussery Road","Clarksville","TN","37043"]
["570552",170,"AHC Forest Cove Nursing and Rehab Center","Madison","45 Forest Cove","Jackson","TN","38301"]
["390252",126,"AHC Lexington Health Care and Rehabilitation","Henderson","727 East Church Street","Lexington","TN","38351"]
["090552",331,"AHC McKenzie Healthcare and Rehabilitation Center","Carroll","175 Hospital Drive","McKenzie","TN","38201"]
["170152",29,"Alamo Nursing and Rehabilitation Center","Crockett","P.O. Box 367, 580 West Main Street","Alamo","TN","38001"]
["330132",102,"Alexian Village Health and Rehabilitation Center","Hamilton","671 Alexian Way","Signal Mountain","TN","37377"]
["793062",230,"Allen Morgan Health and Rehabilitation Center","Shelby","177 North Highland Street","Memphis","TN","38111",null,null,"Sumner"]
["793662",231,"Allenbrooke Nursing and Rehabilitation Center","Shelby","3933 Allenbrooke Cove","Memphis","TN","38118"]
["794962",375,"Applingwood Health Care Center","Shelby","1536 Appling Care Lane","Cordova","TN","38016",null,null,"Hawkins","OH"]
["280142",91,"Ardmore Center","Giles","25385 Main Street","Ardmore","TN","38449"]
["370512",123,"Asbury Place at Kingsport","Hawkins","100 Netherland Lane","Kingsport","TN","37660"]
["050422",10,"Asbury Place at Maryville","Blount","2648 Sevierville Road","Maryville","TN","37804"]
["792162",252,"Ashton Place Health and Rehab Center","Shelby","3030 Walnut Grove Road","Memphis","TN","38111"]
["790162",232,"Ave Maria Home","Shelby","2805 Charles Bryan Road","Bartlett","TN","38134"]
["270352",88,"Bailey Park Community Living Center","Gibson","2400 Mitchell Street","Humboldt","TN","38343"]
["794862",352,"Baptist Memorial Hospital-Memphis Skilled Nursing Facility","Shelby","6019 Walnut Grove Road","Memphis","TN","38120"]
["795162",391,"Baptist Skilled Rehabilitation Unit - Germantown","Shelby","2100 Exeter Road","Germantown","TN","38138",null,null,"Montgomery"]
["070322",17,"Beech Tree Manor","Campbell","P.O. Box 300, 240 Hospital Lane","Jellico","TN","37762"]
["190142",43,"Belcourt Terrace","Davidson","1710 Belcourt Avenue","Nashville","TN","37212",null,null,"Haywood","OK"]
["170252",30,"Bells Nursing and Rehabilitation Center","Crockett","260 Herndon Drive","Bells","TN","38006"]
["192142",44,"Bethany Health and Rehab Center","Davidson","421 Ocala Drive","Nashville","TN","37211"]
["710542",379,"Bethesda Health Care Center","Putnam","444 One Eleven Place","Cookeville","TN","38506"]
["471522",143,"Beverly Park Place Health and Rehab","Knox","5321 Beverly Park Circle","Knoxville","TN","37918"]
["040132",9,"Bledsoe County Nursing Home","Bledsoe","107 Wheelertown Avenue","Pikeville","TN","37367"]
["050922",365,"Blount Memorial Transitional Care Center","Blount","2320 East Lamar Alexander Parkway","Maryville","TN","37804"]
["750142",217,"Boulevard Terrace Rehabilitation and Nursing Center","Rutherford","1530 Middle Tennessee Boulevard","Murfreesboro","TN","37130"]
["060132",14,"Bradley Healthcare and Rehabilitation Center","Bradley","2910 Peerless Road, Northwest","Cleveland","TN","37312"]
["390152",127,"Briarwood Community Living Center","Henderson","41 Hospital Drive","Lexington","TN","38351",null,null,"Hickman","RI"]
[630642,406,"Brigadier General Wendell H. Gilbert TN State Veterans' Home","Gibson","2865 East Main Street","Humbolt","TN",38343,null,null,"Polk"]
["790262",234,"Bright Glade Health and Rehabilitation Center","Shelby","5070 Sanderlin Avenue","Memphis","TN","38117",null,null,"Jackson","TX"]
["820112",260,"Bristol Nursing Home","Sullivan","261 North Street","Bristol","TN","37620"]
["820512",261,"Brookhaven Manor","Sullivan","2035 Stonebrook Place","Kingsport","TN","37660"]
["030252",8,"Camden Healthcare and Rehabilitation Center","Benton","197 Hospital Drive","Camden","TN","38320",null,null,"Jefferson","UT"]
["140142",36,"Celina Health and Rehabilitation Center","Clay","120 Pitcock Lane","Celina","TN","38551"]
["860312",378,"Center on Aging and Health","Unicoi","880 South Mohawk Drive","Erwin","TN","37650"]
[795362,399,"Christian Care Center of Memphis","Shelby","6500 Kirby Gate Boulevard","Memphis","TN",38119]
["370312",125,"Church Hill Health Care and Rehab Center","Hawkins","701 West Main Street","Church Hill","TN","37642"]
["940642",294,"Claiborne and Hughes Health Center","Williamson","200 Strahl Street","Franklin","TN","37064",null,null,"Tipton"]
["130122",40,"Claiborne County Nursing Home","Claiborne","1850 Old Knoxville Road","Tazewell","TN","37879"]
["630142",189,"Clarksville Nursing and Rehabilitation Center","Montgomery","900 Professional Park Drive","Clarksville","TN","37043",null,null,"McNairy"]
["790462",236,"Collierville Nursing and Rehabilitation LLC","Shelby","490 West Poplar","Collierville","TN","38017"]
["050622",11,"Colonial Hills Nursing Center","Blount","2034 Cochran Road","Maryville","TN","37803"]
["750442",219,"Community Care of Rutherford County, Inc.","Rutherford","901 East County Farm Road","Murfreesboro","TN","37130"]
["050822",12,"Concordia Nursing and Rehabilitation - Fairpark","Blount","307 North Fifth Street","Maryville","TN","37802"]
["530222",161,"Concordia Nursing and Rehabilitation - Loudon","Loudon","1520 Grove Street","Loudon","TN","37774"]
["470722",148,"Concordia Nursing and Rehabilitation - Northhaven","Knox","3300 North Broadway","Knoxville","TN","37917",null,null,"Overton"]
["050522",13,"Concordia Transitional Care and Rehabilitation-Maryville","Blount","1012 Jamestown Way","Maryville","TN","37803"]
["900212",289,"Cornerstone Village","Washington","2012 Sherwood Drive","Johnson City","TN","37601"]
["500242",155,"Countryside Healthcare and Rehabilitation","Lawrence","3051 Buffalo Road","Lawrenceburg","TN","38464"]
["840362",324,"Covington Care Nursing and Rehabilitation Center","Tipton","765 Bert Johnston Avenue","Covington","TN","38019"]
["190942",53,"Creekside Health and Rehabilitation Center","Davidson","306 West Due West Avenue","Madison","TN","37115"]
["380152",122,"Crestview Health Care and Rehabilitation","Haywood","704 Dupree Street","Brownsville","TN","38012",null,null,"Hamilton","NM"]
["192742",48,"Cumberland Health Care and Rehabilitation","Davidson","4343 Ashland City Highway","Nashville","TN","37218"]
["070222",19,"Cumberland Village Care Genesis Healthcare","Campbell","136 Davis Lane","Lafollette","TN","37766",null,null,"Washington"]
["200252",315,"Decatur County Health Care and Rehabilitation ","Decatur","726 Kentucky Avenue","Parsons","TN","38363"]
["220542",72,"Dickson Health and Rehab","Dickson","901 North Charlotte Street","Dickson","TN","37055"]
["810142",306,"Diverse Care of Claiborne","Stewart","537 Spring Street","Dover","TN","37058"]
["920552",281,"Diversicare of Martin Health Care Facility","Weakley","158 Mt. Pelia Road","Martin","TN","38237"]
["010622",2,"Diversicare of Oak Ridge","Anderson","100 Elmhurst Drive","Oak Ridge","TN","37830"]
["751042",218,"Diversicare of Smyrna","Rutherford","200 Mayfield Drive","Smyrna","TN","37167"]
["192042",49,"Donelson Place Care and Rehabilitation Center","Davidson","2733 McCampbell Avenue","Nashville","TN","37214"]
["270252",85,"Douglas Nursing Home","Gibson","2084 West Main Street","Milan","TN","38358"]
["300112",310,"Durham-Hensley Health and Rehabilitation","Greene","55 Nursing Home Road","Chuckey","TN","37641"]
["271152",351,"Dyer Nursing and Rehabilitation Center","Gibson","1124 North Main Street","Dyer","TN","38330"]
[230352,74,"Dyersburg Nursing and Rehabilitation","Dyer","1900 Parr Avenue","Dyersburg","TN","38024",null,null,"Bledsoe","AZ"]
["260142",84,"Emerald -Hodgson at Southern Tennessee Regional Health System-Winchester","Franklin","629 Hospital Road","Winchester","TN","37398",null,null,"Trousdale"]
["260142",84,"Emerald -Hodgson Health Care Center","Franklin","1260 University Avenue","Sewanee","TN",37375,null,null,"Trousdale"]
["860212",274,"Erwin Health Care Center","Unicoi","100 Stalling Lane","Erwin","TN","37650"]
["540332",163,"Etowah Health Care Center","McMinn","409 Grady Road","Etowah","TN","37331"]
["520342",305,"Fayetteville Center","Lincoln","4081 Thornton Taylor Parkway","Fayetteville","TN","37334"]
["780122",226,"Fort Sanders Sevier Nursing Home","Sevier","731 Middle Creek Road","Sevierville","TN","37862"]
["471822",325,"Fort Sanders Transitional Care Unit","Knox","1901 Clinch Avenue","Knoxville","TN","37916",null,null,"Cumberland","KS"]
["901012",292,"Four Oaks Health Care Center","Washington","1101 Persimmon Ridge Road","Jonesborough","TN","37659"]
["901112",329,"Franklin Transitional Care","Washington","2511 Wesley Street","Johnson City","TN","37601"]
["830242",267,"Gallatin Health Care Center","Sumner","438 North Water Avenue","Gallatin","TN","37066"]
["240162",77,"Gallaway Health and Rehabilitation","Fayette","435 Old Brownsville Road","Gallaway","TN","38036",null,null,"Warren"]
["880542",354,"Generations Center of Spencer","Van Buren","87 Generations Drive","Spencer","TN","38585"]
["020242",7,"Glen Oaks Health and Rehabilitation","Bedford","1101 Glen Oaks Road","Shelbyville","TN","37160",null,null,"Fentress","MN"]
["010422",1,"Golden LivingCenter - Windwood","Anderson","220 Longmire Road","Clinton","TN","37716"]
["192542",51,"Good Samaritan Health and Rehab Center","Davidson","500 Hickory Hollow Terrace","Antioch","TN","37013"]
["180742",389,"Good Samaritan Society-Fairfield Glade","Cumberland","100 Samaritan Way","Crossville","TN","38558"]
["793162",238,"Grace Healthcare of Cordova","Shelby","955 Germantown Parkway","Cordova","TN","38018",null,null,"Anderson","TN"]
["610132",185,"Grace Healthcare of Decatur","Meigs","332 River Road","Decatur","TN","37322"]
["940242",298,"Grace Healthcare of Franklin","Williamson","1287 West Main Street","Franklin","TN","37064"]
["193142",69,"Grace Healthcare of Whites Creek","Davidson","3425 Knight Road","Whites Creek","TN","37189",null,null,"Davidson","KY"]
["794462",326,"Graceland Nursing Center","Shelby","1250 Farrow Road","Memphis","TN","38116"]
["193942",52,"Greenhills Health and Rehabilitation Center","Davidson","3939 Hillsboro Circle","Nashville","TN","37215",null,null,"Hardeman","NC"]
["820412",263,"Greystone Health Care Center","Sullivan","181 Dunlap Road","Blountville","TN","37617"]
["340112",115,"Hancock Manor Nursing Home","Hancock","1423 Main Street","Sneedville","TN","37869"]
["360152",118,"Harbert Hills Academy Nursing Home","Hardin","3575 Lonesome Pine Road","Savannah","TN","38372",null,null,"Hancock","NY"]
["791762",235,"Harbor View Nursing and Rehabilitation Center","Shelby","1513 North Second Street","Memphis","TN","38107"]
["360252",119,"Hardin County Nursing Home","Hardin","935 Wayne Road","Savannah","TN","38372"]
["360352",120,"Hardin Home Nursing Home","Hardin","1620 Wayne Road","Savannah","TN","38372",null,null,"Giles","MT"]
["730122",211,"Harriman Care and Rehabilitation Center","Roane","240 Hannah Road","Harriman","TN","37748",null,null,"Sequatchie"]
["850142",273,"Hartsville Convalescent Center","Trousdale","649 McMurry Boulevard","Hartsville","TN","37074"]
["120152",41,"Henderson Health & Rehabilitation Center, LLC","Chester","412 Juanita Drive","Henderson","TN","38340"]
["400252",128,"Henry County Healthcare Center","Henry","239 Hospital Circle","Paris","TN","38242",null,null,"White"]
["100312",314,"Hermitage Health Center","Carter","1633 Hillview Drive","Elizabethton","TN","37643"]
["410142",132,"Hickman Community Nursing Home","Hickman","135 East Swan Street","Centerville","TN","37033"]
["110342",318,"Hillcrest Healthcare Center","Cheatham","111 East Pemberton Street","Ashland City","TN","37015"]
["920152",280,"Hillview Community Living Center","Weakley","897 Evergreen Street","Dresden","TN","38225"]
["100112",313,"Hillview Health Center","Carter","1666 Hillview Drive","Elizabethton","TN","37643"]
["472022",333,"Holston Health and Rehabilitation Center","Knox","3916 Boyds Bridge Pike","Knoxville","TN","37914"]
["820212",264,"Holston Manor","Sullivan","3641 Memorial Boulevard","Kingsport","TN","37664"]
["160142",33,"Horizon Health and Rehab Center","Coffee","811 Keylon Street","Manchester","TN","37355",null,null,"Claiborne","HI"]
["270752",86,"Humboldt Healthcare and Rehab Center","Gibson","2031 Avondale Road","Humboldt","TN","38343"]
["270852",87,"Humboldt Nursing and Rehabilitation Center","Gibson","3515 Chere Carol Road","Humboldt","TN","38343"]
["430142",135,"Humphreys County Nursing Home","Humphreys","670 Highway 13 South","Waverly","TN","37185",null,null,"Gibson","MO"]
["090352",22,"Huntingdon Health and Rehabilitation Center","Carroll","635 High Street","Huntingdon","TN","38344"]
["760222",223,"Huntsville Manor","Scott","287 Baker Street","Huntsville","TN","37756"]
["821012",336,"Indian Path Medical Center Transitional Care Unit","Sullivan","2000 Brookside Drive","Kingsport","TN","37660"]
["471222",144,"Island Home Park Health and Rehab","Knox","1758 Hillwood Drive","Knoxville","TN","37920",null,null,"Carter","DC"]
["100212",25,"Ivy Hall Nursing Home","Carter","301 South Watauga Avenue","Elizabethton","TN","37643",null,null,"Lewis","WY"]
["193042",55,"Jackson Park Christian Home","Davidson","4107 Gallatin Road","Nashville","TN","37216"]
["450222",137,"Jefferson City Health and Rehabilitation Center","Jefferson","283 West Broadway Boulevard","Jefferson City","TN","37760"]
["450122",138,"Jefferson County Nursing Home","Jefferson","914 Industrial Park Road","Dandridge","TN","37725"]
["900312",293,"John M. Reed Health and Rehab","Washington","124 John Reed Home Road","Limestone","TN","37681"]
["800142",259,"Kindred Nursing and Rehabilitation - Smith County","Smith","112 Healthcare Drive","Carthage","TN","37030"]
["793962",243,"Kirby Pines Manor","Shelby","3535 Kirby Road","Memphis","TN","38115",null,null,"Shelby"]
["560142",168,"Knollwood Manor","Macon","405 Times Avenue","Lafayette","TN","37083"]
["901312",340,"Lakebridge Health Care Center","Washington","115 Woodlawn Drive","Johnson City","TN","37604"]
["193542",56,"Lakeshore Heartland","Davidson","3025 Fernbrook Lane","Nashville","TN","37214"]
["490162",154,"Lauderdale Community Living Center","Lauderdale","215 Lackey Lane","Ripley","TN","38063"]
["300512",96,"Laughlin Healthcare Center","Greene","801 East McKee Street","Greeneville","TN","37743",null,null,"Unicoi"]
["130222",39,"Laurel Manor Health Care","Claiborne","902 Buchanan Road","New Tazewell","TN","37825"]
["720232",208,"Laurelbrook Nursing Home","Rhea","200 Sanitarium Circle","Dayton","TN","37321"]
["570252",173,"Laurelwood Health Care","Madison","200 Birch Street","Jackson","TN","38301"]
["950742",301,"Lebanon Health and Rehabilitation Center","Wilson","731 Castle Heights Court","Lebanon","TN","37087"]
["510142",158,"Lewis County Nursing and Rehabilitation Center","Lewis","119 Kittrell Street","Hohenwald","TN","38462",null,null,"Fayette","MI"]
["540432",164,"Life Care Center of Athens","McMinn","1234 Frye Street","Athens","TN","37303",null,null,"Lauderdale","WV"]
["051122",408,"Life Care Center of Blount County","Blount","1965 Stewart Lane","Louisville","TN",37777,null,null,"Knox","VA"]
["090452",23,"Life Care Center of Bruceton - Hollow Rock","Carroll","105 Rowland Avenue","Bruceton","TN","38317"]
["410242",131,"Life Care Center of Centerville","Hickman","112 Old Dickson Road","Centerville","TN","37033",null,null,"Dyer","MA"]
["060232",15,"Life Care Center of Cleveland","Bradley","3530 Keith Street, Northwest","Cleveland","TN","37312"]
["331032",106,"Life Care Center of Collegedale","Hamilton","9210 Apison Pike","Collegedale","TN","37315",null,null,"Pickett"]
["600142",179,"Life Care Center of Columbia","Maury","841 West James Campbell Boulevard","Columbia","TN","38401"]
["700232",203,"Life Care Center of Copper Basin","Polk","166 Cooper Basin Industrial Park","Ducktown","TN","37326",null,null,"Lincoln"]
["180442",285,"Life Care Center of Crossville","Cumberland","80 Justice Street","Crossville","TN","38555",null,null,"Loudon"]
["330932",107,"Life Care Center of East Ridge","Hamilton","1500 Fincher Avenue","East Ridge","TN","37412"]
["100512",26,"Life Care Center of Elizabethton","Carter","1641 Highway 19E","Elizabethton","TN","37643",null,null,"Johnson","VT"]
["900712",288,"Life Care Center of Gray","Washington","791 Old Gray Station Road","Gray","TN","37615"]
["300312",97,"Life Care Center of Greeneville","Greene","725 Crum Street","Greeneville","TN","37743",null,null,"Bedford","AL"]
["194642",392,"Life Care Center of Hickory Woods","Davidson","4200 Murfreesboro Pike","Antioch","TN","37013"]
["330432",104,"Life Care Center of Hixson","Hamilton","5798 Hixson Homeplace","Hixson","TN","37087"]
["450422",139,"Life Care Center of Jefferson City","Jefferson","336 West Old Andrew Johnson Highway","Jefferson City","TN","37760"]
["650122",195,"Life Care Center of Morgan County","Morgan","419 South Kingston Street","Wartburg","TN","37887",null,null,"VanBuren"]
["320122",101,"Life Care Center of Morristown","Hamblen","501 West Economy Road","Morristown","TN","37814"]
[194742,393,"Life Care Center of Old Hickory Village","Davidson","1250 Robinson Road","Old Hickory","TN",37138]
[332432,397,"Life Care Center of Ooltewah","Hamilton","5911 Snow Hill Road","Ooltewah","TN",37363]
["331432",108,"Life Care Center of Red Bank","Hamilton","1020 Runyan Drive","Chattanooga","TN","37405"]
["720332",209,"Life Care Center of Rhea County","Rhea","10055 Rhea County Highway","Dayton","TN","37321"]
["930342",381,"Life Care Center of Sparta","White","508 Mose Drive","Sparta","TN","38583",null,null,"Marion"]
["160242",31,"Life Care Center of Tullahoma","Coffee","1715 North Jackson Street","Tullahoma","TN","37388",null,null,"Cannon","CT"]
["520242",159,"Lincoln and Donalson Care Centers","Lincoln","P.O. Box 838","Fayetteville","TN","37334"]
["471622",147,"Little Creek Sanitarium","Knox","1811 Little Creek Lane","Knoxville","TN","37922"]
["640142",194,"Lynchburg Nursing Center","Moore","40 Nursing Home Road","Lynchburg","TN","37352"]
["440142",136,"Mabry Health Care and Rehab Center","Jackson","1340 North Grundy Quarles Highway","Gainesboro","TN","38562",null,null,"Morgan"]
["620322",186,"Madisonville Health & Rehabilitation Center","Monroe","465 Isbill Road","Madisonville","TN","37354",null,null,"Humphreys","SD"]
["840162",272,"Magnolia Creek Nursing and Rehabilitation Center","Tipton","1992 Highway 51 South","Covington","TN","38019"]
["600442",182,"Magnolia Healthcare and Rehabilitation Center","Maury","1410 Trotwood Avenue","Columbia","TN","38401"]
["794162",240,"Majestic Gardens at Memphis Rehabilitation and Skilled Center","Shelby","131 North Tucker Street","Memphis","TN","38104"]
["160442",355,"Manchester Health Care Center","Coffee","395 Interstate Drive","Manchester","TN","37355",null,null,"Hamblen","NJ"]
["570652",174,"Maplewood Health Care","Madison","100 Cherrywood Place","Jackson","TN","38305"]
["600742",359,"Maury Regional Hospital Skilled Nursing Unit","Maury","1224 Trotwood Avenue","Columbia","TN","38401",null,null,"Blount","AR"]
["191042",58,"McKendree Village","Davidson","4347 Lebanon Road","Hermitage","TN","37076"]
["540232",165,"McMinn Memorial Nursing Home and Rehab Center","McMinn","886 Highway 411 North","Etowah","TN","37331"]
["550152",166,"McNairy County Health Care Center","McNairy","835 East Poplar Avenue","Selmer","TN","38375",null,null,"Greene","NV"]
["280342",92,"Meadowbrook Health and Rehabilitation Center","Giles","1245 East College Street","Pulaski","TN","38478"]
["794262",246,"Memphis Jewish Home","Shelby","36 Bazeberry Road","Cordova","TN","38018"]
["791462",248,"Midsouth Health and Rehabilitation Center","Shelby","2380 James Road","Memphis","TN","38127"]
["793462",255,"Midtown Center for Health and Rehabilitation","Shelby","141 North McClean Boulevard","Memphis","TN","38104"]
["270152",308,"Milan Health Care Center","Gibson","8060 Stinson Road","Milan","TN","38358"]
["794362",316,"Millington Healthcare Center","Shelby","5081 Easley Avenue","Millington","TN","38053",null,null," "]
["570452",175,"Mission Convalescent Home","Madison","118 Glass Street","Jackson","TN","38301",null,null,"Rhea"]
["950842",322,"Mount Juliet Health Care Center","Wilson","2650 North Mt. Juliet Road","Mount Juliet","TN","37122",null,null,"Henderson","OR"]
["460112",140,"Mountain City Care and Rehabilitation Center","Johnson","919 Medical Park Drive","Mountain City","TN","37683",null,null,"Chester","GA"]
["600542",181,"Mt. Pleasant Health and Rehabilitation","Maury","904 Hidden Acres Drive","Mount Pleasant","TN","38474"]
["192942",63,"Nashville Community Care & Rehabilitation  at Bordeaux","Davidson","1414 County Hospital Road","Nashville","TN","37218",null,null,"McMinn"]
["190342",47,"Nashville Metro Care & Rehabilition Center","Davidson","2030 25th Avenue North","Nashville","TN","37208"]
["150222",34,"Newport Health and Rehabilitation Center","Cocke","135 Generation Drive","Newport","TN","37821"]
[821112,401,"NHC Health Care Kingsport","Sullivan","2300 Pavillion Drive","Kingsport","TN",37660,null,null,"Union"]
["540132",162,"NHC HealthCare, Athens","McMinn","1204 Frye Street","Athens","TN","37303"]
["330732",112,"NHC HealthCare, Chattanooga","Hamilton","2700 Parkwood Avenue","Chattanooga","TN","37404"]
["600342",180,"NHC HealthCare, Columbia","Maury","101 Walnut Lane","Columbia","TN","38401",null,null,"Houston","SC"]
["710342",204,"NHC HealthCare, Cookeville","Putnam","815 South Walnut Avenue","Cookeville","TN","38501",null,null,"Henry","PA"]
["220442",73,"NHC HealthCare, Dickson","Dickson","812 North Charlotte Street","Dickson","TN","37055"]
["472422",363,"NHC HealthCare, Farragut","Knox","120 Cavett Hill Lane","Knoxville","TN","37922"]
["471322",319,"NHC HealthCare, Fort Sanders","Knox","2120 Highland Avenue","Knoxville","TN","37916"]
["940542",295,"NHC HealthCare, Franklin","Williamson","216 Fairground Street","Franklin","TN","37064"]
["830742",271,"NHC HealthCare, Hendersonville","Sumner","370 Old Shackle Island Road","Hendersonville","TN","37075"]
["900112",291,"NHC HealthCare, Johnson City","Washington","3209 Bristol Highway","Johnson City","TN","37601",null,null,"Crockett","IA"]
["470622",146,"NHC HealthCare, Knoxville","Knox","809 East Emerald Avenue","Knoxville","TN","37917"]
["500342",156,"NHC Healthcare, Lawrenceburg","Lawrence","374 Brink Street","Lawrenceburg","TN","38464"]
["590142",177,"NHC HealthCare, Lewisburg","Marshall","1653 Mooresville Highway","Lewisburg","TN","37091"]
["890242",287,"NHC HealthCare, McMinnville","Warren","P.O. Box 528, 928 Old Smithville Road","McMinnville","TN","37110"]
["270452",89,"NHC HealthCare, Milan","Gibson","8017 Dogwood Lane","Milan","TN","38358"]
["750642",220,"NHC HealthCare, Murfreesboro","Rutherford","420 North University Street","Murfreesboro","TN","37130"]
["010522",4,"NHC HealthCare, Oak Ridge","Anderson","300 Laboratory Road","Oak Ridge","TN","37830"]
["590242",178,"NHC HealthCare, Oakwood","Marshall","244 Oakwood Drive","Lewisburg","TN","37091"]
["280242",93,"NHC HealthCare, Pulaski","Giles","993 East College Street","Pulaski","TN","38478",null,null,"Sullivan"]
["500142",157,"NHC HealthCare, Scott","Lawrence","P.O. Box 767, 2380 Buffalo Road","Lawrenceburg","TN","38464"]
["770132",225,"NHC HealthCare, Sequatchie","Sequatchie","360 Dell Trail","Dunlap","TN","37327"]
["210142",71,"NHC HealthCare, Smithville","DeKalb","825 Fisher Avenue","Smithville","TN","37166",null,null,"Sevier"]
["240262",78,"NHC HealthCare, Somerville","Fayette","308 Lake Drive","Somerville","TN","38068"]
["930242",284,"NHC HealthCare, Sparta","White","34 Gracey Street","Sparta","TN","38583",null,null,"Clay","ID"]
["740242",227,"NHC HealthCare, Springfield","Robertson","608 Eighth Avenue East","Springfield","TN","37172"]
[160542,396,"NHC Healthcare, Tullahoma","Coffee","1321 Cedar Lane","Tullahoma","TN",37133,null,null,"Lake","WA"]
["940742",380,"NHC Place at Cool Springs","Williamson","211 Cool Springs Boulevard","Franklin","TN","37067"]
[192843,410,"NHC Place at Trace","Davidson","8353 Highway 100","Nashville","TN",37221]
[830752,400,"NHC Place Sumner","Sumner","140 Thorne Boulevard","Gallatin","TN",37066]
["600242",183,"NHC-Maury Regional Transitional Care Center","Maury","2710 Trotwood Avenue","Columbia","TN","38401"]
["010322",5,"Norris Health and Rehabilitation Center","Anderson","3382 Andersonville Highway","Andersonville","TN","37705"]
["571452",366,"Northbrooke Healthcare and Rehabilitation Center","Madison","121 Physicians Drive","Jackson","TN","38305",null,null,"Weakley"]
["751342",348,"Northside Health Care Nursing and Rehabilitation Center, Inc.","Rutherford","202 East MTCS Road","Murfreesboro","TN","37130"]
["090252",24,"Oak Manor Health Care Center","Carroll","150 Oak Manor Road","McKenzie","TN","38201",null,null,"Decatur","LA"]
["230152",75,"Oakwood Community Living Center","Dyer","1636 Woodlawn Avenue","Dyersburg","TN","38024"]
["660252",196,"Obion County Nursing Home","Obion","1084 East County Home Road","Union City","TN","38261"]
["760122",224,"Oneida Nursing/Rehab Center","Scott","18805 Alberta Drive","Oneida","TN","37841",null,null,"Benton","AK"]
["670142",200,"Overton County Nursing Home","Overton","318 Bilbrey Street","Livingston","TN","38570"]
["630442",192,"Palmyra Health Care Center","Montgomery","2727 Palmyra Road","Palmyra","TN","37142"]
["400152",129,"Paris Health Care Nursing and Rehabilitation Center","Henry","800 Volunteer Drive","Paris","TN","38242",null,null,"Williamson"]
["360452",121,"Park Rest Hardin County Health Center","Hardin","85 Shelby Drive","Savannah","TN","38372"]
["794662",349,"Parkway Health and Rehabilitation Center","Shelby","200 South Parkway West","Memphis","TN","38109",null,null,"Perry"]
["680142",201,"Perry County Nursing Home","Perry","127 East Brooklyn Avenue","Linden","TN","37096"]
["690142",202,"Pickett Care and Rehabilitation Center","Pickett","129 Hillcrest Drive","Byrdstown","TN","38549",null,null,"Moore"]
["780322",228,"Pigeon Forge Care and Rehabilitation Center","Sevier","415 Cole Drive","Pigeon Forge","TN","37863"]
["350252",117,"Pine Meadows Healthcare and Rehabilitation Center","Hardeman","700 Nuckolls Road","Bolivar","TN","38008"]
["350152",116,"Pleasant View Health Care Center","Hardeman","214 North Water Street","Bolivar","TN","38008"]
["901212",337,"Princeton Transitional Care","Washington","2511 Wesley Street","Johnson City","TN","37601",null,null,"Macon"]
["950342",302,"Quality Care Health Center","Wilson","932 Baddour Parkway","Lebanon","TN","37087"]
["793262",245,"Quince Nursing and Rehabilitation Center","Shelby","6733 Quince Road","Memphis","TN","38119"]
["790562",237,"Rainbow Health and Rehab of Memphis","Shelby","8119 Memphis Arlington Road","Barlett","TN","38133"]
["890342",286,"Raintree Manor","Warren","415 Pace Street","McMinnville","TN","37110"]
["480152",151,"Reelfoot Manor Health and Rehabilitation","Lake","1034 Reelfoot Avenue","Tiptonville","TN","38079",null,null,"Hardin","ND"]
[795262,405,"Regional One Health Subacute Care","Shelby","877 Jefferson Avenue Adams pavillion 3rd Floor","Memphis","TN",38103,null,null,"DeKalb","ME"]
["730322",212,"Renaissance Terrace","Roane","257 Patton Lane","Harriman","TN","37748"]
["290122",94,"Ridgeview Terrace of Life Care","Grainger","165 Coffey Lane","Rutledge","TN","37861"]
["490262",153,"Ripley Healthcare and Rehabilitation Center","Lauderdale","118 Halliburton Drive","Ripley","TN","38063"]
["600642",184,"Rosewood Manor, Inc. ","Maury","1400 Rosewood Drive","Columbia","TN","38401"]
["330832",113,"Saint Barnabas Nursing Home","Hamilton","950 Sisken Drive","Chattanooga","TN","37403"]
["360552",358,"Savannah Health Care and Rehabilitation Center","Hardin","1645 Florence Road","Savannah","TN","38372"]
["472522",385,"Senator Ben Atchley State Veterans' Home","Knox","One Veterans Way","Knoxville","TN","37931"]
["471022",149,"Serene Manor Medical Center","Knox","970 Wray Street","Knoxville","TN","37917"]
["780222",229,"Sevierville Health and Rehabilitation Center","Sevier","415 Catlett Road","Sevierville","TN","37862",null,null,"Scott"]
["470822",150,"Shannondale Health Care Center","Knox","7424 Middlebrook Pike","Knoxville","TN","37909"]
["051022",383,"Shannondale of Maryville Health Care Center","Blount","803 Shannondale Way","Maryville","TN","37803"]
["190842",54,"Signature Health Care of Madison ","Davidson","431 Larkin Springs Road","Madison","TN","37115",null,null,"Cheatham","FL"]
["793362",239,"Signature Health Care of Primacy ","Shelby","6025 Primacy Parkway","Memphis","TN","38119"]
["830642",270,"Signature Health of Portland Rehab & Wellness Center","Sumner","215 Highland Circle Drive","Portland","TN","37148"]
["794062",247,"Signature Healthcare at Methodist","Shelby","1265 Union Avenue","Memphis","TN","38104"]
["793762",254,"Signature Healthcare at Saint Francis","Shelby","6007 Park Avenue","Memphis","TN","38119"]
["630342",191,"Signature Healthcare of Clarksville","Montgomery","198 Old Farmer Road","Clarksville","TN","37043"]
["060432",16,"Signature Healthcare of Cleveland","Bradley","2750 Executive Park Place","Cleveland","TN","37312",null,null,"Carroll","DE"]
["100412",27,"Signature Healthcare of Elizabethton Rehab & Wellness","Carter","1200 Spruce Lane","Elizabethton","TN","37643"]
["420242",133,"Signature Healthcare of Erin","Houston","278 Rocky Hollow Road","Erin","TN","37061"]
["250142",80,"Signature Healthcare of Fentress County","Fentress","208 Duncan Street North","Jamestown","TN","38556"]
["300412",95,"Signature Healthcare of Greeneville","Greene","106 Holt Court","Greeneville","TN","37743",null,null,"Bradley","CA"]
["791562",256,"Signature Healthcare of Memphis","Shelby","1150 Dovecrest Road","Memphis","TN","38134"]
[194842,394,"Signature Healthcare of Nashville Rehabilitation & Wellness Center","Davidson","832 Wedgewood Avenue","Nashville","TN","37203"]
["710242",206,"Signature Healthcare of Putnam County","Putnam","278 Dry Valley Road","Algood","TN","38501"]
["480452",152,"Signature Healthcare of Ridgely Rehab & Wellness","Lake","117 North Main Street","Ridgely","TN","38080"]
["730222",213,"Signature Healthcare of Rockwood Rehab & Wellness","Roane","5580 Roane State Highway","Rockwood","TN","37854"]
["370212",124,"Signature Healthcare of Rogersville","Hawkins","109 Highway 70 North","Rogersville","TN","37857",null,null,"Franklin","MS"]
["580132",176,"Signature Healthcare of South Pittsburg Rehab & Wellness","Marion","201 East Tenth Street","South Pittsburg","TN","37380"]
["332332",382,"Siskin Hospital's Subacute Rehabilitation Program","Hamilton","One Siskin Plaza","Chattanooga","TN","37403",null,null,"Wilson"]
["332232",369,"Soddy Daisy Healthcare Center","Hamilton","701 Sequoyah Road","Soddy Daisy","TN","37379",null,null,"Madison"]
["940842",386,"Somerfield at the Heritage","Williamson","900 Heritage Way","Brentwood","TN","37027"]
["720532",210,"Spring City Care and Rehabilitation Center","Rhea","331 Hinch Street","Spring City","TN","37381"]
["792862",241,"Spring Gate Rehabilitation and Healthcare Center","Shelby","3909 Covington Pike","Memphis","TN","38135",null,null,"Dickson","MD"]
["630542",193,"Spring Meadows Health Care Center","Montgomery","220 Highway 76","Clarksville","TN","37043"]
["790962",250,"ST. Clare health and Rehabilitation Center, LLC","Shelby","1755 Eldridge Avenue","Memphis","TN","38108"]
["710442",207,"Standing Stone Care and Rehabilitation Center","Putnam","410 West Crawford Avenue","Monterey","TN","38574"]
["740342",215,"Stone Ridge Healthcare LLC","Robertson","5121 Greer Road","Goodlettsville","TN",37072]
[192843,412,"Stones River Manor","Rutherford","205 Haynes Drive","Murfreesboro","TN",37129]
["010122",3,"Summit View of  Rocky Top","Anderson","204 Industrial Park Road","Lake City","TN","37769"]
["471722",142,"Summit View of Farragut","Knox","12823 Kingston Pike","Knoxville","TN","37922"]
["620122",187,"Sweetwater Nursing Center","Monroe","978 Highway 11 South","Sweetwater","TN","37874"]
["751242",222,"Tennessee Veterans Home","Rutherford","345 Compton Road","Murfreesboro","TN","37129",null,null,"Wayne"]
["150122",35,"Tennova Healthcare-Newport Convalescent Center","Cocke","450 College Street","Newport","TN","37821",null,null,"Cocke","IL"]
["472222",342,"Tennova Healthcare-Physicians Regional Medical Center","Knox","900 East Oak Hill Avenue","Knoxville","TN","37917"]
["070122",18,"Tennova LaFollette Health and Rehab Center","Campbell","200 Torrey Road","LaFollette","TN","37766"]
["310132",99,"The Bridge at Monteagle","Grundy","26 Second Street","Monteagle","TN","37356",null,null,"Meigs"]
["820612",262,"The Cambridge House","Sullivan","250 Bellebrook Road","Bristol","TN","37620"]
["191642",309,"The Health Center at Richland Place","Davidson","504 Elmington Avenue","Nashville","TN","37205"]
["330332",103,"The Health Center at Standifer Place","Hamilton","2626 Walker Road","Chattanooga","TN","37421",null,null,"Obion"]
["320222",100,"The Heritage Center","Hamblen","1026 McFarland Street","Morristown","TN","37814",null,null,"Lawrence","WI"]
["230252",76,"The Highlands of Dyersburg Health and Rehab","Dyer","350 East Tickle Street","Dyersburg","TN","38024",null,null,"Marshall"]
["792662",257,"The Highlands of Memphis Health and Rehab","Shelby","3549 Norriswood Avenue","Memphis","TN","38111"]
["790762",244,"The King's Daughters and Sons Home","Shelby","3568 Appling Road","Bartlett","TN","38133"]
["193842",59,"The Meadows","Davidson","8044 Coley Davis Road","Nashville","TN","37221"]
["560242",169,"The Palace Health Care and Rehabilitation Center","Macon","309 Main Street","Red Boiling Springs","TN","37150",null,null,"Putnam"]
["950242",300,"The Pavilion","Wilson","1406 Medical Center Drive","Lebanon","TN","37087",null,null,"Roane"]
[192843,411,"The Reserve at Spring Hill","Maury","2000 Reserve Boulevard","Spring Hill","TN",37174]
["795062",384,"The Village at Germantown","Shelby","7930 Walking Horse Circle","Germantown","TN","38138"]
["110142",42,"The Waters of Cheatam","Cheatham","2501 River Road","Ashland City","TN","37015",null,null,"Campbell","CO"]
["830442",266,"The Waters of Gallatin","Sumner","555 East Bledsoe Street","Gallatin","TN","37066"]
["901412",388,"The Waters of Johnson City","Washington","140 Technology Lane","Johnson City","TN","37604"]
["100712",361,"The Waters of Roan Highlands LLC","Carter","146 Buck Creek Road","Roan Mountain","TN","37687"]
["740442",216,"The Waters of Robertson","Robertson","104 Watson Road","Springfield","TN","37172"]
["020142",6,"The Waters of Shelbyville","Bedford","835 Union Street","Shelbyville","TN","37160"]
["750742",221,"The Waters of Smyrna","Rutherford","202 Enon Springs Road, East","Smyrna","TN","37167"]
["740142",214,"The Waters of Springfield","Robertson","704 Fifth Avenue East","Springfield","TN","37172"]
["660352",197,"The Waters of Union City","Obion","1105 Sunswept Drive","Union City","TN","38261"]
["260342",82,"The Waters of Winchester","Franklin","1360 Bypass Road","Winchester","TN","37398",null,null,"Unknown"]
["820712",265,"The Wexford House","Sullivan","2421 John B. Dennis Parkway","Kingsport","TN","37660"]
["400352",130,"Towne Square of Puryear, Inc.","Henry","220 College Street","Puryear","TN","38251"]
["270552",90,"Trenton Center","Gibson","2036 Highway 45 By-Pass","Trenton","TN","38382"]
["191842",66,"Trevecca Health Care Center","Davidson","329 Murfreesboro Road","Nashville","TN","37210"]
["130422",38,"Tri State Health and Rehabilitation Center","Claiborne","600 Shawanee Road","Harrogate","TN","37752"]
["530122",160,"Trinity Health & Rehabilitation Center","Loudon","700 Williams Ferry Road","Lenior City","TN","37771",null,null,"Coffee","IN"]
["860112",275,"Unicoi County Nursing Home","Unicoi","100 Greenway Circle","Erwin","TN","37650",null,null,"Grundy","NH"]
["660452",198,"Union City Nursing and Rehabilitation Center, Inc.","Obion","P.O. Box 509, 1630 East Reelfoot Avenue","Union City","TN","38261"]
["920352",283,"Vanayer Healthcare and Rehab Center","Weakley","640 Hannings Lane","Martin","TN","38237"]
["191942",67,"Vanco Manor Nursing and Rehabilitation Center","Davidson","813 South Dickerson Road","Goodlettsville","TN","37072",null,null,"Monroe"]
["271052",346,"W.D. Bill Manning Tennessee State Veterans' Home","Gibson","2865 Main Street","Humboldt","TN","38343"]
["430242",134,"Waverly Health Care and Rehabilitation Center","Humphreys","895 Powers Boulevard","Waverly","TN","37185"]
["910242",277,"Wayne Care Nursing Home","Wayne","P.O. Box 777, 505 South High Street","Waynesboro","TN","38485"]
["910142",278,"Waynesboro Health Care and Rehabilitation Center, Inc.","Wayne","P.O. Box 510, 104 J.V. Mangubat Drive","Waynesboro","TN","38485"]
["920252",282,"Weakley County Nursing Home","Weakley","700 W. C. Nursing Home Road","Dresden","TN","38225"]
[472622,404,"WellPark at Shannondale","Knox","7512 Middlebrook Pike","Knoxville","TN",37909]
["471422",145,"West Hills Health and Rehab","Knox","6801 Middlebrook Pike","Knoxville","TN","37909"]
["192842",45,"West Meade Place","Davidson","1000 Saint Luke Drive","Nashville","TN","37205"]
["571352",171,"West Tennessee Transitional Care","Madison","670 Skyline Drive","Jackson","TN","38301"]
["831242",332,"Westmoreland Care and Rehabilitation Center","Sumner","1559 New Highway 52","Westmoreland","TN","37186"]
["471122",141,"Westmoreland Health and Rehabilitation Center","Knox","5837 Lyons View Pike","Knoxville","TN","37919"]
["200352",70,"Westwood Health Care and Rehabilitation Center","Decatur","524 West Main Street","Decaturville","TN","38329",null,null,"Robertson"]
["180342",28,"Wharton Nursing Home","Cumberland","P.O. Box 447","Pleasant Hill","TN","38578",null,null,"Maury"]
[740452,395,"White House Health Care, Inc.","Robertson","2871 Highway 31 W","White House","TN",37188,null,null,"Rutherford"]
["792262",258,"Whitehaven Community Living Center","Shelby","1076 Chambliss Road","Memphis","TN","38116",null,null,"Grainger","NE"]
["870122",276,"Willow Ridge Center","Union","215 Richardson Way","Maynardville","TN","37807"]
["260442",83,"Willows of Winchester  Health & Rehabilitation Center","Franklin","32 Memorial Drive","Winchester","TN","37398",null,null,"Stewart"]
["620222",188,"Wood Presbyterian Home","Monroe","520 Old Highway 68","Sweetwater","TN","37874"]
["080142",21,"Woodbury Health and Rehabilitation Center","Cannon","119 West High Street","Woodbury","TN","37190"]
["194542",343,"Woodcrest at Blakeford","Davidson","11 Burton Hills Boulevard","Nashville","TN","37215",null,null,"Smith"]
["330232",114,"Woodland Terrace Care & Rehab","Hamilton","8249 Standifer Gap Road","Chattanooga","TN","37421"]
["180242",312,"Wyndridge Health and Rehabilitation Center","Cumberland","456 Wayne Avenue","Crossville","TN","38555"]
[null,"40"]

{"sheet":"DBase","index":2,"n_rows":343,"n_cols":11,"rows_kept":343,"cut":false,"hidden":true,"merged":[]}
["State ID","Facility Name","Address","City","County","State","Zip",null,"ID list",null,"States"]
[0,"-","-","-","-","-","-",null,0]
[10122,"Summit View of Lake City","204 Industrial Park Road","Lake City","Anderson","TN",37769,null,10122,null,"TN"]
[10322,"Norris Health and Rehabilitation Center","3382 Andersonville Highway","Andersonville","Anderson","TN",37705,null,10322,null,"AL"]
[10422,"Golden LivingCenter - Windwood","220 Longmire Road","Clinton","Anderson","TN",37716,null,10422,null,"AK"]
[10522,"NHC HealthCare, Oak Ridge","300 Laboratory Road","Oak Ridge","Anderson","TN",37830,null,10522,null,"AZ"]
[10622,"Diversicare of Oak Ridge","100 Elmhurst Drive","Oak Ridge","Anderson","TN",37830,null,10622,null,"AR"]
[20142,"The Waters of Shelbyville","835 Union Street","Shelbyville","Bedford","TN",37160,null,20142,null,"CA"]
[20242,"Glen Oaks Health and Rehabilitation","1101 Glen Oaks Road","Shelbyville","Bedford","TN",37160,null,20242,null,"CO"]
[30252,"Camden Healthcare and Rehabilitation Center","197 Hospital Drive","Camden","Benton","TN",38320,null,30252,null,"CT"]
[40132,"Bledsoe County Nursing Home","107 Wheelertown Avenue","Pikeville","Bledsoe","TN",37367,null,40132,null,"DE"]
[50422,"Asbury Place at Maryville","2648 Sevierville Road","Maryville","Blount","TN",37804,null,50422,null,"DC"]
[50522,"ConcordiaTransitional Care and Rehabilitation-Maryville","1012 Jamestown Way","Maryville","Blount","TN",37803,null,50522,null,"FL"]
[50622,"Colonial Hills Nursing Center","2034 Cochran Road","Maryville","Blount","TN",37803,null,50622,null,"GA"]
[50822,"Concordia Nursing and Rehabilitation - Fairpark","307 North Fifth Street","Maryville","Blount","TN",37802,null,50822,null,"HI"]
[50922,"Blount Memorial Transitional Care Center","2320 East Lamar Alexander Parkway","Maryville","Blount","TN",37804,null,50922,null,"ID"]
[51022,"Shannondale of Maryville Health Care Center","803 Shannondale Way","Maryville","Blount","TN",37803,null,51022,null,"IL"]
[51122,"Life Care Center of Blount","1965 Stewart Lane","Louisville","Blount","TN",37777,null,51122,null,"IN"]
[60132,"Bradley Healthcare and Rehabilitation Center","2910 Peerless Road, Northwest","Cleveland","Bradley","TN",37312,null,60132,null,"IA"]
[60232,"Life Care Center of Cleveland","3530 Keith Street, Northwest","Cleveland","Bradley","TN",37312,null,60232,null,"KS"]
[60432,"Signature Healthcare of Cleveland","2750 Executive Park Place","Cleveland","Bradley","TN",37312,null,60432,null,"KY"]
[70122,"Tennova LaFollette Health and Rehab Center","200 Torrey Road","LaFollette","Campbell","TN",37766,null,70122,null,"LA"]
[70222,"Cumberland Village Care Genesis Healthcare","136 Davis Lane","Lafollette","Campbell","TN",37766,null,70222,null,"ME"]
[70322,"Beech Tree Manor","P.O. Box 300, 240 Hospital Lane","Jellico","Campbell","TN",37762,null,70322,null,"MD"]
[80142,"Woodbury Health and Rehabilitation Center","119 West High Street","Woodbury","Cannon","TN",37190,null,80142,null,"MA"]
[90252,"Oak Manor Health Care Center","150 Oak Manor Road","McKenzie","Carroll","TN",38201,null,90252,null,"MI"]
[90352,"Huntingdon Health and Rehabilitation Center","635 High Street","Huntingdon","Carroll","TN",38344,null,90352,null,"MN"]
[90452,"Life Care Center of Bruceton - Hollow Rock","105 Rowland Avenue","Bruceton","Carroll","TN",38317,null,90452,null,"MS"]
[90552,"AHC McKenzie Healthcare and Rehabilitation Center","175 Hospital Drive","McKenzie","Carroll","TN",38201,null,90552,null,"MO"]
[100112,"Hillview Health Center","1666 Hillview Drive","Elizabethton","Carter","TN",37643,null,100112,null,"MT"]
[100212,"Ivy Hall Nursing Home","301 South Watauga Avenue","Elizabethton","Carter","TN",37643,null,100212,null,"NE"]
[100312,"Hermitage Health Center","1633 Hillview Drive","Elizabethton","Carter","TN",37643,null,100312,null,"NV"]
[100412,"Signature Healthcare of Elizabethton Rehab & Wellness Center","1200 Spruce Lane","Elizabethton","Carter","TN",37643,null,100412,null,"NH"]
[100512,"Life Care Center of Elizabethton","1641 Highway 19E","Elizabethton","Carter","TN",37643,null,100512,null,"NJ"]
[100712,"The Waters of Roan Highlands Nursing Center","146 Buck Creek Road","Roan Mountain","Carter","TN",37687,null,100712,null,"NM"]
[110142,"The Waters of Cheatam","2501 River Road","Ashland City","Cheatham","TN",37015,null,110142,null,"NY"]
[110342,"Hillcrest Healthcare Center","111 East Pemberton Street","Ashland City","Cheatham","TN",37015,null,110342,null,"NC"]
[120152,"Henderson Health & Rehabilitation Center, LLC","412 Juanita Drive","Henderson","Chester","TN",38340,null,120152,null,"ND"]
[130122,"Claiborne County Nursing Home","1850 Old Knoxville Road","Tazewell","Claiborne","TN",37879,null,130122,null,"OH"]
[130222,"Laurel Manor Health Care","902 Buchanan Road","New Tazewell","Claiborne","TN",37825,null,130222,null,"OK"]
[130422,"Tri State Health and Rehabilitation Center","600 Shawanee Road","Harrogate","Claiborne","TN",37752,null,130422,null,"OR"]
[140142,"Celina Health and Rehabilitation Center","120 Pitcock Lane","Celina","Clay","TN",38551,null,140142,null,"PA"]
[150122,"Tennova Healthcare-Newport Convalescent Center","450 College Street","Newport","Cocke","TN",37821,null,150122,null,"RI"]
[150222,"Newport Health and Rehabilitation Center","135 Generation Drive","Newport","Cocke","TN",37821,null,150222,null,"SC"]
[160142,"Horizon Health and Rehab Center","811 Keylon Street","Manchester","Coffee","TN",37355,null,160142,null,"SD"]
[160242,"Life Care Center of Tullahoma","1715 North Jackson Street","Tullahoma","Coffee","TN",37388,null,160242,null,"TX"]
[160442,"Manchester Health Care Center","395 Interstate Drive","Manchester","Coffee","TN",37355,null,160442,null,"UT"]
[160542,"NHC Healthcare, Tullahoma","1321 Cedar Lane","Tullahoma","Coffee","TN",37133,null,160542,null,"VT"]
[170152,"Alamo Nursing and Rehabilitation Center","P.O. Box 367, 580 West Main Street","Alamo","Crockett","TN",38001,null,170152,null,"VA"]
[170252,"Bells Nursing and Rehabilitation Center","260 Herndon Drive","Bells","Crockett","TN",38006,null,170252,null,"WA"]
[180242,"Wyndridge Health and Rehabilitation Center","456 Wayne Avenue","Crossville","Cumberland","TN",38555,null,180242,null,"WV"]
[180342,"Wharton Nursing Home","P.O. Box 447","Pleasant Hill","Cumberland","TN",38578,null,180342,null,"WI"]
[180442,"Life Care Center of Crossville","80 Justice Street","Crossville","Cumberland","TN",38555,null,180442,null,"WY"]
[180742,"Good Samaritan Society-Fairfield Glade","100 Samaritan Way","Crossville","Cumberland","TN",38558,null,180742]
[190142,"Belcourt Terrace","1710 Belcourt Avenue","Nashville","Davidson","TN",37212,null,190142]
[190342,"Nashville Metro Care & Rehabilitation Center","2030 25th Avenue North","Nashville","Davidson","TN",37208,null,190342]
[190842,"Signature Health Care of Madison ","431 Larkin Springs Road","Madison","Davidson","TN",37115,null,190842]
[190942,"Creekside Health and Rehabilitation Center","306 West Due West Avenue","Madison","Davidson","TN",37115,null,190942]
[191042,"McKendree Village","4347 Lebanon Road","Hermitage","Davidson","TN",37076,null,191042]
[191642,"The Health Center at Richland Place","504 Elmington Avenue","Nashville","Davidson","TN",37205,null,191642]
[191842,"Trevecca Health Care Center","329 Murfreesboro Road","Nashville","Davidson","TN",37210,null,191842]
[191942,"Vanco Manor Nursing and Rehabilitation Center","813 South Dickerson Road","Goodlettsville","Davidson","TN",37072,null,191942]
[192042,"Donelson Place Care and Rehabilitation Center","2733 McCampbell Avenue","Nashville","Davidson","TN",37214,null,192042]
[192142,"Bethany Health and Rehab Center","421 Ocala Drive","Nashville","Davidson","TN",37211,null,192142]
[192542,"Good Samaritan Health and Rehab Center","500 Hickory Hollow Terrace","Antioch","Davidson","TN",37013,null,192542]
[192742,"Cumberland Health Care and Rehabilitation","4343 Ashland City Highway","Nashville","Davidson","TN",37218,null,192742]
[192842,"West Meade Place","1000 Saint Luke Drive","Nashville","Davidson","TN",37205,null,192842]
[192843,"NHC Place at Trace","8353 Highway 100","Nashville","Davidson","TN",37221,null,192843]
[192942,"Nashville Community Care & Rehabilitation at Bordeaux ","1414 County Hospital Road","Nashville","Davidson","TN",37218,null,192942]
[193042,"Jackson Park Christian Home","4107 Gallatin Road","Nashville","Davidson","TN",37216,null,193042]
[193142,"Grace Healthcare of Whites Creek","3425 Knight Road","Whites Creek","Davidson","TN",37189,null,193142]
[193542,"Lakeshore Heartland","3025 Fernbrook Lane","Nashville","Davidson","TN",37214,null,193542]
[193842,"The Meadows","8044 Coley Davis Road","Nashville","Davidson","TN",37221,null,193842]
[193942,"Greenhills Health and Rehabilitation Center","3939 Hillsboro Circle","Nashville","Davidson","TN",37215,null,193942]
[194542,"Woodcrest at Blakeford","11 Burton Hills Boulevard","Nashville","Davidson","TN",37215,null,194542]
[194642,"Life Care Center of Hickory Woods","4200 Murfreesboro Pike","Antioch","Davidson","TN",37013,null,194642]
[194742,"Life Care Center of Old Hickory Village","1250 Robinson Road","Old Hickory","Davidson","TN",37138,null,194742]
[194842,"Signature Healthcare of Nashville Rehab & Wellness Center","832 Wedgewood Avenue","Nashville","Davidson","TN",37203,null,194842]
[200252,"Decatur County Health Care and Rehabilitation ","726 Kentucky Avenue","Parsons","Decatur","TN",38363,null,200252]
[200352,"Westwood Health Care and Rehabilitation Center","524 West Main Street","Decaturville","Decatur","TN",38329,null,200352]
[210142,"NHC HealthCare, Smithville","825 Fisher Avenue","Smithville","DeKalb","TN",37166,null,210142]
[220442,"NHC HealthCare, Dickson","812 North Charlotte Street","Dickson","Dickson","TN",37055,null,220442]
[220542,"Dickson Health and Rehab","901 North Charlotte Street","Dickson","Dickson","TN",37055,null,220542]
[230152,"Oakwood Community Living Center","1636 Woodlawn Avenue","Dyersburg","Dyer","TN",38024,null,230152]
[230252,"The Highlands of Dyersburg Health and Rehab","350 East Tickle Street","Dyersburg","Dyer","TN",38024,null,230252]
[230352,"Dyersburg Nursing and Rehabilitation","1900 Parr Avenue","Dyersburg","Dyer","TN",38024,null,230352]
[240162,"Gallaway Health and Rehabilitation","435 Old Brownsville Road","Gallaway","Fayette","TN",38036,null,240162]
[240262,"NHC HealthCare, Somerville","308 Lake Drive","Somerville","Fayette","TN",38068,null,240262]
[250142,"Signature Healthcare of Fentress County","208 Duncan Street North","Jamestown","Fentress","TN",38556,null,250142]
[260142,"Emerald -Hodgson at Southern Tennessee Regional Health System-Winchester ","629 Hospital Road","Winchester","Franklin","TN",37398,null,260142]
[260342,"The Waters of Winchester","1360 Bypass Road","Winchester","Franklin","TN",37398,null,260342]
[260442,"Willows of Winchester Health and Rehabilitation Center","32 Memorial Drive","Winchester","Franklin","TN",37398,null,260442]
[270152,"Milan Health Care Center","8060 Stinson Road","Milan","Gibson","TN",38358,null,270152]
[270252,"Douglas Nursing Home","2084 West Main Street","Milan","Gibson","TN",38358,null,270252]
[270352,"Bailey Park Community Living Center","2400 Mitchell Street","Humboldt","Gibson","TN",38343,null,270352]
[270452,"NHC HealthCare, Milan","8017 Dogwood Lane","Milan","Gibson","TN",38358,null,270452]
[270552,"Trenton Center","2036 Highway 45 By-Pass","Trenton","Gibson","TN",38382,null,270552]
[270752,"Humboldt Healthcare and Rehab Center","2031 Avondale Road","Humboldt","Gibson","TN",38343,null,270752]
[270852,"Humboldt Nursing and Rehabilitation Center","3515 Chere Carol Road","Humboldt","Gibson","TN",38343,null,270852]
[271052,"W.D. Bill Manning Tennessee State Veterans' Home","2865 Main Street","Humboldt","Gibson","TN",38343,null,271052]
[271152,"Dyer Nursing and Rehabilitation Center","1124 North Main Street","Dyer","Gibson","TN",38330,null,271152]
[280142,"Ardmore Center","25385 Main Street","Ardmore","Giles","TN",38449,null,280142]
[280242,"NHC HealthCare, Pulaski","993 East College Street","Pulaski","Giles","TN",38478,null,280242]
[280342,"Meadowbrook Health and Rehabilitation Center","1245 East College Street","Pulaski","Giles","TN",38478,null,280342]
[290122,"Ridgeview Terrace of Life Care","165 Coffey Lane","Rutledge","Grainger","TN",37861,null,290122]
[300112,"Durham-Hensley Health and Rehabilitation","55 Nursing Home Road","Chuckey","Greene","TN",37641,null,300112]
[300312,"Life Care Center of Greeneville","725 Crum Street","Greeneville","Greene","TN",37743,null,300312]
[300412,"Signature Healthcare of Greeneville","106 Holt Court","Greeneville","Greene","TN",37743,null,300412]
[300512,"Laughlin Healthcare Center","801 East McKee Street","Greeneville","Greene","TN",37743,null,300512]
[310132,"Signature Healthcare of Monteagle Rehab & Wellness","26 Second Street","Monteagle","Grundy","TN",37356,null,310132]
[320122,"Life Care Center of Morristown","501 West Economy Road","Morristown","Hamblen","TN",37814,null,320122]
[320222,"The Heritage Center","1026 McFarland Street","Morristown","Hamblen","TN",37814,null,320222]
[330132,"Alexian Village Health and Rehabilitation Center","671 Alexian Way","Signal Mountain","Hamilton","TN",37377,null,330132]
[330232,"Woodland Terrace Care and Rehabilitation","8249 Standifer Gap Road","Chattanooga","Hamilton","TN",37421,null,330232]
[330332,"The Health Center at Standifer Place","2626 Walker Road","Chattanooga","Hamilton","TN",37421,null,330332]
[330432,"Life Care Center of Hixson","5798 Hixson Homeplace","Hixson","Hamilton","TN",37087,null,330432]
[330732,"NHC HealthCare, Chattanooga","2700 Parkwood Avenue","Chattanooga","Hamilton","TN",37404,null,330732]
[330832,"Saint Barnabas Nursing Home","950 Sisken Drive","Chattanooga","Hamilton","TN",37403,null,330832]
[330932,"Life Care Center of East Ridge","1500 Fincher Avenue","East Ridge","Hamilton","TN",37412,null,330932]
[331032,"Life Care Center of Collegedale","9210 Apison Pike","Collegedale","Hamilton","TN",37315,null,331032]
[331432,"Life Care Center of Red Bank","1020 Runyan Drive","Chattanooga","Hamilton","TN",37405,null,331432]
[332232,"Soddy Daisy Healthcare Center","701 Sequoyah Road","Soddy Daisy","Hamilton","TN",37379,null,332232]
[332332,"Siskin Hospital's Subacute Rehabilitation Program","One Siskin Plaza","Chattanooga","Hamilton","TN",37403,null,332332]
[332432,"Life Care Center of Ooltewah","5911 Snow Hill Road","Ooltewah","Hamilton","TN",37363,null,332432]
[340112,"Hancock Manor Nursing Home","1423 Main Street","Sneedville","Hancock","TN",37869,null,340112]
[350152,"Pleasant View Health Care Center","214 North Water Street","Bolivar","Hardeman","TN",38008,null,350152]
[350252,"Pine Meadows Healthcare and Rehabilitation Center","700 Nuckolls Road","Bolivar","Hardeman","TN",38008,null,350252]
[360152,"Harbert Hills Academy Nursing Home","3575 Lonesome Pine Road","Savannah","Hardin","TN",38372,null,360152]
[360252,"Hardin County Nursing Home","935 Wayne Road","Savannah","Hardin","TN",38372,null,360252]
[360352,"Hardin Home Nursing Home","1620 Wayne Road","Savannah","Hardin","TN",38372,null,360352]
[360452,"Park Rest Hardin County Health Center","85 Shelby Drive","Savannah","Hardin","TN",38372,null,360452]
[360552,"AHC Savannah Health Care and Rehabilitation Center","1645 Florence Road","Savannah","Hardin","TN",38372,null,360552]
[370212,"Signature Healthcare of Rogersville","109 Highway 70 North","Rogersville","Hawkins","TN",37857,null,370212]
[370312,"Church Hill Health Care and Rehab Center","701 West Main Street","Church Hill","Hawkins","TN",37642,null,370312]
[370512,"Asbury Place at Kingsport","100 Netherland Lane","Kingsport","Hawkins","TN",37660,null,370512]
[380152,"Crestview Health Care and Rehabilitation","704 Dupree Street","Brownsville","Haywood","TN",38012,null,380152]
[390152,"Briarwood Community Living Center","41 Hospital Drive","Lexington","Henderson","TN",38351,null,390152]
[390252,"AHC Lexington Health Care and Rehabilitation","727 East Church Street","Lexington","Henderson","TN",38351,null,390252]
[400152,"Paris Health Care Nursing and Rehabilitation Center","800 Volunteer Drive","Paris","Henry","TN",38242,null,400152]
[400252,"Henry County Healthcare Center","239 Hospital Circle","Paris","Henry","TN",38242,null,400252]
[400352,"Towne Square Care Care of Puryear","220 College Street","Puryear","Henry","TN",38251,null,400352]
[410142,"Hickman Community Nursing Home","135 East Swan Street","Centerville","Hickman","TN",37033,null,410142]
[410242,"Life Care Center of Centerville","112 Old Dickson Road","Centerville","Hickman","TN",37033,null,410242]
[420242,"Signature Healthcare of Erin","278 Rocky Hollow Road","Erin","Houston","TN",37061,null,420242]
[430142,"Humphreys County Nursing Home","670 Highway 13 South","Waverly","Humphreys","TN",37185,null,430142]
[430242,"Waverly Health Care and Rehabilitation Center","895 Powers Boulevard","Waverly","Humphreys","TN",37185,null,430242]
[440142,"Mabry Health Care and Rehab Center","1340 North Grundy Quarles Highway","Gainesboro","Jackson","TN",38562,null,440142]
[450122,"Jefferson County Nursing Home","914 Industrial Park Road","Dandridge","Jefferson","TN",37725,null,450122]
[450222,"Jefferson City Health and Rehabilitation Center","283 West Broadway Boulevard","Jefferson City","Jefferson","TN",37760,null,450222]
[450422,"Life Care Center of Jefferson City","336 West Old Andrew Johnson Highway","Jefferson City","Jefferson","TN",37760,null,450422]
[460112,"Mountain City Care and Rehabilitation Center","919 Medical Park Drive","Mountain City","Johnson","TN",37683,null,460112]
[470622,"NHC HealthCare, Knoxville","809 East Emerald Avenue","Knoxville","Knox","TN",37917,null,470622]
[470722,"Concordia Nursing and Rehabilitation - Northhaven","3300 North Broadway","Knoxville","Knox","TN",37917,null,470722]
[470822,"Shannondale Health Care Center","7424 Middlebrook Pike","Knoxville","Knox","TN",37909,null,470822]
[471022,"Serene Manor Medical Center","970 Wray Street","Knoxville","Knox","TN",37917,null,471022]
[471122,"Westmoreland Health and Rehabilitation Center","5837 Lyons View Pike","Knoxville","Knox","TN",37919,null,471122]
[471222,"Island Home Park Health and Rehab","1758 Hillwood Drive","Knoxville","Knox","TN",37920,null,471222]
[471322,"NHC HealthCare, Fort Sanders","2120 Highland Avenue","Knoxville","Knox","TN",37916,null,471322]
[471422,"West Hills Health and Rehab","6801 Middlebrook Pike","Knoxville","Knox","TN",37909,null,471422]
[471522,"Beverly Park Place Health and Rehab","5321 Beverly Park Circle","Knoxville","Knox","TN",37918,null,471522]
[471622,"Little Creek Sanitarium","1811 Little Creek Lane","Knoxville","Knox","TN",37922,null,471622]
[471722,"Summit View of Farragut","12823 Kingston Pike","Knoxville","Knox","TN",37922,null,471722]
[471822,"Fort Sanders Transitional Care Unit","1901 Clinch Avenue","Knoxville","Knox","TN",37916,null,471822]
[472022,"Holston Health and Rehabilitation Center","3916 Boyds Bridge Pike","Knoxville","Knox","TN",37914,null,472022]
[472222,"Tennova Healthcare-Physicians Regional Medical Center","900 East Oak Hill Avenue","Knoxville","Knox","TN",37917,null,472222]
[472422,"NHC HealthCare, Farragut","120 Cavett Hill Lane","Knoxville","Knox","TN",37922,null,472422]
[472522,"Senator Ben Atchley's State Veterans' Home","One Veterans Way","Knoxville","Knox","TN",37931,null,472522]
[472622,"WellPark at Shannodale","7512 Middlebrook Pike","Knoxville","Knox","TN",37909,null,472622]
[480152,"Reelfoot Manor Health and Rehabilitation","1034 Reelfoot Avenue","Tiptonville","Lake","TN",38079,null,480152]
[480452,"Signature Healthcare of Ridgely Rehab & Wellness","117 North Main Street","Ridgely","Lake","TN",38080,null,480452]
[490162,"Lauderdale Community Living Center","215 Lackey Lane","Ripley","Lauderdale","TN",38063,null,490162]
[490262,"Ripley Healthcare and Rehabilitation Center","118 Halliburton Drive","Ripley","Lauderdale","TN",38063,null,490262]
[500142,"NHC HealthCare, Scott","P.O. Box 767, 2380 Buffalo Road","Lawrenceburg","Lawrence","TN",38464,null,500142]
[500242,"Countryside Healthcare and Rehabilitation","3051 Buffalo Road","Lawrenceburg","Lawrence","TN",38464,null,500242]
[500342,"NHC Healthcare, Lawrenceburg","374 Brink Street","Lawrenceburg","Lawrence","TN",38464,null,500342]
[510142,"Lewis County Nursing and Rehabilitation Center","119 Kittrell Street","Hohenwald","Lewis","TN",38462,null,510142]
[520242,"Lincoln and Donalson Care Centers","P.O. Box 838","Fayetteville","Lincoln","TN",37334,null,520242]
[520342,"Fayetteville Center","4081 Thornton Taylor Parkway","Fayetteville","Lincoln","TN",37334,null,520342]
[530122,"Trinity Health and Rehabilitation Center","700 Williams Ferry Road","Lenior City","Loudon","TN",37771,null,530122]
[530222,"Concordia Nursing and Rehabilitation - Loudon","1520 Grove Street","Loudon","Loudon","TN",37774,null,530222]
[540132,"NHC HealthCare, Athens","1204 Frye Street","Athens","McMinn","TN",37303,null,540132]
[540232,"McMinn Memorial Nursing Home and Rehab Center","886 Highway 411 North","Etowah","McMinn","TN",37331,null,540232]
[540332,"Etowah Health Care Center","409 Grady Road","Etowah","McMinn","TN",37331,null,540332]
[540432,"Life Care Center of Athens","1234 Frye Street","Athens","McMinn","TN",37303,null,540432]
[550152,"AHC McNairy County Health Care Center","835 East Poplar Avenue","Selmer","McNairy","TN",38375,null,550152]
[550352,"Adamsville Healthcare and Rehabilitation Center","409 Park Avenue","Adamsville","McNairy","TN",38310,null,550352]
[560142,"Knollwood Manor","405 Times Avenue","Lafayette","Macon","TN",37083,null,560142]
[560242,"The Palace Health Care and Rehabilitation Center","309 Main Street","Red Boiling Springs","Macon","TN",37150,null,560242]
[570252,"Laurelwood Health Care","200 Birch Street","Jackson","Madison","TN",38301,null,570252]
[570452,"Mission Convalescent Home","118 Glass Street","Jackson","Madison","TN",38301,null,570452]
[570552,"AHC Forest Cove Nursing and Rehab Center","45 Forest Cove","Jackson","Madison","TN",38301,null,570552]
[570652,"Maplewood Health Care","100 Cherrywood Place","Jackson","Madison","TN",38305,null,570652]
[571352,"West Tennessee Transitional Care","670 Skyline Drive","Jackson","Madison","TN",38301,null,571352]
[571452,"AHC Northbrooke Healthcare and Rehabilitation Center","121 Physicians Drive","Jackson","Madison","TN",38305,null,571452]
[580132,"The Bridge at South Pittsburg","201 East Tenth Street","South Pittsburg","Marion","TN",37380,null,580132]
[590142,"NHC HealthCare, Lewisburg","1653 Mooresville Highway","Lewisburg","Marshall","TN",37091,null,590142]
[590242,"NHC HealthCare, Oakwood","244 Oakwood Drive","Lewisburg","Marshall","TN",37091,null,590242]
[600142,"Life Care Center of Columbia","841 West James Campbell Boulevard","Columbia","Maury","TN",38401,null,600142]
[600242,"NHC HealthCare,Maury Regional Transitional Care","2710 Trotwood Avenue","Columbia","Maury","TN",38401,null,600242]
[600342,"NHC HealthCare, Columbia","101 Walnut Lane","Columbia","Maury","TN",38401,null,600342]
[600442,"Magnolia Healthcare and Rehabilitation Center","1410 Trotwood Avenue","Columbia","Maury","TN",38401,null,600442]
[600542,"Mt. Pleasant Health and Rehabilitation","904 Hidden Acres Drive","Mount Pleasant","Maury","TN",38474,null,600542]
[600642,"Rosewood Manor, Inc. ","1400 Rosewood Drive","Columbia","Maury","TN",38401,null,600642]
[600742,"Maury Regional Hospital Skilled Nursing Unit","1224 Trotwood Avenue","Columbia","Maury","TN",38401,null,600742]
[600842,"the Reserve at Spring Hill","2000 Reserve Boulevard","Spring Hill","Maury","TN",37174,null,600842]
[610132,"Grace Healthcare of Decatur","332 River Road","Decatur","Meigs","TN",37322,null,610132]
[620122,"Sweetwater Nursing Center","978 Highway 11 South","Sweetwater","Monroe","TN",37874,null,620122]
[620222,"Wood Presbyterian Home","520 Old Highway 68","Sweetwater","Monroe","TN",37874,null,620222]
[620322,"Madisonville Health and Rehabilitation Center","465 Isbill Road","Madisonville","Monroe","TN",37354,null,620322]
[630142,"Clarksville Nursing and Rehabilitation Center","900 Professional Park Drive","Clarksville","Montgomery","TN",37043,null,630142]
[630242,"Ahava Healthcare of Clarksville","111 Ussery Road","Clarksville","Montgomery","TN",37043,null,630242]
[630342,"Signature Healthcare of Clarksville","198 Old Farmer Road","Clarksville","Montgomery","TN",37043,null,630342]
[630442,"Palmyra Health Care Center","2727 Palmyra Road","Palmyra","Montgomery","TN",37142,null,630442]
[630542,"Spring Meadows Health Care Center","220 Highway 76","Clarksville","Montgomery","TN",37043,null,630542]
[630642,"Brigadier General Wendell H. Gilbert TN State Veterans' Home","250 Arrow Wood Drive","Clarksville","Montgomery","TN",37042,null,630642]
[640142,"Lynchburg Nursing Center","40 Nursing Home Road","Lynchburg","Moore","TN",37352,null,640142]
[650122,"Life Care Center of Morgan County","419 South Kingston Street","Wartburg","Morgan","TN",37887,null,650122]
[660252,"Obion County Nursing Home","1084 East County Home Road","Union City","Obion","TN",38261,null,660252]
[660352,"The Waters of Union City","1105 Sunswept Drive","Union City","Obion","TN",38261,null,660352]
[660452,"Union City Nursing and Rehabilitation Center, Inc.","P.O. Box 509, 1630 East Reelfoot Avenue","Union City","Obion","TN",38261,null,660452]
[670142,"Overton County Nursing Home","318 Bilbrey Street","Livingston","Overton","TN",38570,null,670142]
[680142,"Perry County Nursing Home","127 East Brooklyn Avenue","Linden","Perry","TN",37096,null,680142]
[690142,"Pickett Care and Rehabilitation Center","129 Hillcrest Drive","Byrdstown","Pickett","TN",38549,null,690142]
[700232,"Life Care Center of Copper Basin","166 Cooper Basin Industrial Park","Ducktown","Polk","TN",37326,null,700232]
[710242,"Signature of Putnam County","278 Dry Valley Road","Algood","Putnam","TN",38501,null,710242]
[710342,"NHC HealthCare, Cookeville","815 South Walnut Avenue","Cookeville","Putnam","TN",38501,null,710342]
[710442,"Standing Stone Care and Rehabilitation Center","410 West Crawford Avenue","Monterey","Putnam","TN",38574,null,710442]
[710542,"Bethesda Health Care Center","444 One Eleven Place","Cookeville","Putnam","TN",38506,null,710542]
[720232,"Laurelbrook Nursing Home","200 Sanitarium Circle","Dayton","Rhea","TN",37321,null,720232]
[720332,"Life Care Center of Rhea County","10055 Rhea County Highway","Dayton","Rhea","TN",37321,null,720332]
[720532,"Spring City Care and Rehabilitation Center","331 Hinch Street","Spring City","Rhea","TN",37381,null,720532]
[730122,"Harriman Care and Rehabilitation Center","240 Hannah Road","Harriman","Roane","TN",37748,null,730122]
[730222,"Signature Healthcare of Rockwood Rehab & Wellness","5580 Roane State Highway","Rockwood","Roane","TN",37854,null,730222]
[730322,"Renaissance Terrace","257 Patton Lane","Harriman","Roane","TN",37748,null,730322]
[740142,"The Waters of Springfield","704 Fifth Avenue East","Springfield","Robertson","TN",37172,null,740142]
[740242,"NHC HealthCare, Springfield","608 Eighth Avenue East","Springfield","Robertson","TN",37172,null,740242]
[740342,"Stoneridge Healthcare LLC","P.O. Box 590, 2002 Greer Road","Ridgetop","Robertson","TN",37152,null,740342]
[740442,"The Waters of Robertson","104 Watson Road","Springfield","Robertson","TN",37172,null,740442]
[740452,"White House Health Care, Inc.","2871 highway 31W","White House","Robertson","TN",37188,null,740452]
[750142,"Boulevard Terrace Rehabilitation and Nursing Center","1530 Middle Tennessee Boulevard","Murfreesboro","Rutherford","TN",37130,null,750142]
[750442,"Community Care of Rutherford County, Inc.","901 East County Farm Road","Murfreesboro","Rutherford","TN",37130,null,750442]
[750442,"Community Care of Rutherford County, Inc.","901 East County Farm Road","Murfreesboro","Rutherford","TN",37130,null,750442]
[750642,"NHC HealthCare, Murfreesboro","420 North University Street","Murfreesboro","Rutherford","TN",37130,null,750642]
[750742,"The Waters of Smyrna","202 Enon Springs Road, East","Smyrna","Rutherford","TN",37167,null,750742]
[751042,"Diversicare of Smyrna","200 Mayfield Drive","Smyrna","Rutherford","TN",37167,null,751042]
[751242,"Tennessee Veterans Home","345 Compton Road","Murfreesboro","Rutherford","TN",37129,null,751242]
[751342,"Northside Health Care Nursing and Rehabilitation Center, Inc.","202 East MTCS Road","Murfreesboro","Rutherford","TN",37130,null,751342]
[751442,"Adams Place","1927 Memorial Boulevard","Murfreesboro","Rutherford","TN",37129,null,751442]
[751542,"Stones River Manor Inc","205 Haynes Drive","Murfreesboro","Rutherford","TN",37129,null,751542]
[760122,"Oneida Nursing/Rehab Center","18805 Alberta Drive","Oneida","Scott","TN",37841,null,760122]
[760222,"Huntsville Manor","287 Baker Street","Huntsville","Scott","TN",37756,null,760222]
[770132,"NHC HealthCare, Sequatchie","360 Dell Trail","Dunlap","Sequatchie","TN",37327,null,770132]
[780122,"Fort Sanders Sevier Nursing Home","731 Middle Creek Road","Sevierville","Sevier","TN",37862,null,780122]
[780222,"Sevierville Health & Rehabilitation Center","415 Catlett Road","Sevierville","Sevier","TN",37862,null,780222]
[780322,"Pigeon Forge Care and Rehabilitation Center","415 Cole Drive","Pigeon Forge","Sevier","TN",37863,null,780322]
[790162,"Ave Maria Home","2805 Charles Bryan Road","Bartlett","Shelby","TN",38134,null,790162]
[790262,"Bright Glade Health and Rehabilitation Center","5070 Sanderlin Avenue","Memphis","Shelby","TN",38117,null,790262]
[790462,"Dove Health and Rehab of Collierville","490 West Poplar","Collierville","Shelby","TN",38017,null,790462]
[790462,"Collierville Nursing and Rehabilitation LLC","490 West Poplar","Collierville","Shelby","TN",38017,null,790462]
[790562,"Rainbow Health and Rehab of Memphis","8119 Memphis Arlington Road","Barlett","Shelby","TN",38133,null,790562]
[790762,"The King's Daughters and Sons Home","3568 Appling Road","Bartlett","Shelby","TN",38133,null,790762]
[790962,"Saint Clare Health and Rehabilitation Center, LLC","1755 Eldridge Avenue","Memphis","Shelby","TN",38108,null,790962]
[791462,"Midsouth Health and Rehabilitation Center","2380 James Road","Memphis","Shelby","TN",38127,null,791462]
[791562,"Signature Healthcare of Memphis","1150 Dovecrest Road","Memphis","Shelby","TN",38134,null,791562]
[791762,"Harbor View Nursing and Rehabilitation Center","1513 North Second Street","Memphis","Shelby","TN",38107,null,791762]
[792162,"Ashton Place Health and Rehab Center","3030 Walnut Grove Road","Memphis","Shelby","TN",38111,null,792162]
[792262,"Whitehaven Community Living Center","1076 Chambliss Road","Memphis","Shelby","TN",38116,null,792262]
[792662,"The Highlands of Memphis Health and Rehab","3549 Norriswood Avenue","Memphis","Shelby","TN",38111,null,792662]
[792862,"Spring Gate Rehabilitation and Healthcare Center","3909 Covington Pike","Memphis","Shelby","TN",38135,null,792862]
[793062,"Allen Morgan Health and Rehabilitation Center","177 North Highland Street","Memphis","Shelby","TN",38111,null,793062]
[793162,"Grace Healthcare of Cordova","955 Germantown Parkway","Cordova","Shelby","TN",38018,null,793162]
[793262,"Quince Nursing and Rehabilitation Center","6733 Quince Road","Memphis","Shelby","TN",38119,null,793262]
[793362,"Signature Health Care of Primacy ","6025 Primacy Parkway","Memphis","Shelby","TN",38119,null,793362]
[793462,"Midtown Center for Health and Rehabilitation","141 North McClean Boulevard","Memphis","Shelby","TN",38104,null,793462]
[793662,"Allenbrooke Nursing and Rehabilitation Center","3933 Allenbrooke Cove","Memphis","Shelby","TN",38118,null,793662]
[793762,"Signature Healthcare at Saint Francis","6007 Park Avenue","Memphis","Shelby","TN",38119,null,793762]
[793962,"Kirby Pines Manor","3535 Kirby Road","Memphis","Shelby","TN",38115,null,793962]
[794062,"Signature Healthcare at Methodist","1265 Union Avenue","Memphis","Shelby","TN",38104,null,794062]
[794162,"Poplar Point Health and Rehabilitation","131 North Tucker Street","Memphis","Shelby","TN",38104,null,794162]
[794262,"Memphis Jewish Home","36 Bazeberry Road","Cordova","Shelby","TN",38018,null,794262]
[794362,"Millington Healthcare Center","5081 Easley Avenue","Millington","Shelby","TN",38053,null,794362]
[794462,"Graceland Nursing Center","1250 Farrow Road","Memphis","Shelby","TN",38116,null,794462]
[794662,"Parkway Health and Rehabilitation Center","200 South Parkway West","Memphis","Shelby","TN",38109,null,794662]
[794862,"Baptist Memorial Hospital-Memphis Skilled Nursing Facility","6019 Walnut Grove Road","Memphis","Shelby","TN",38120,null,794862]
[794962,"Applingwood Health Care Center","1536 Appling Care Lane","Cordova","Shelby","TN",38016,null,794962]
[795062,"The Village at Germantown","7930 Walking Horse Circle","Germantown","Shelby","TN",38138,null,795062]
[795162,"Baptist Skilled Rehabilitation Unit - Germantown","2100 Exeter Road","Germantown","Shelby","TN",38138,null,795162]
[795262,"Regional One Health Subacute Care","877 Jefferson Avenue Adams Pavilliion  3rd Floor","Memphis","Shelby","TN",38103,null,795162]
[795362,"Christian Care Center of Memphis","6500 Kirby Gate Boulevard","Memphis","Shelby","TN",38119,null,795362]
[800142,"Concordia Nursing and Rehabilitation - Smith County","112 Healthcare Drive","Carthage","Smith","TN",37030,null,800142]
[810142,"Diversicare of Dover","537 Spring Street","Dover","Stewart","TN",37058,null,810142]
[820112,"Bristol Nursing Home","261 North Street","Bristol","Sullivan","TN",37620,null,820112]
[820212,"Holston Manor","3641 Memorial Boulevard","Kingsport","Sullivan","TN",37664,null,820212]
[820412,"Greystone Health Care Center","181 Dunlap Road","Blountville","Sullivan","TN",37617,null,820412]
[820512,"Brookhaven Manor","2035 Stonebrook Place","Kingsport","Sullivan","TN",37660,null,820512]
[820612,"The Cambridge House","250 Bellebrook Road","Bristol","Sullivan","TN",37620,null,820612]
[820712,"The Wexford House","2421 John B. Dennis Parkway","Kingsport","Sullivan","TN",37660,null,820712]
[820712,"Christian Care Center of Bristol","2830 Highway 394","Bristol","Sullivan","TN",37617,null,820712]
[821012,"Indian Path Medical Center Transitional Care Unit","2000 Brookside Drive","Kingsport","Sullivan","TN",37660,null,821012]
[821112,"NHC Health Care Kingsport","2300 Pavillion Drive","Kingsport","Sullivan","TN",37660,null,821112]
[830242,"Gallatin Health Care Center","438 North Water Avenue","Gallatin","Sumner","TN",37066,null,830242]
[830442,"The Waters of Gallatin","555 East Bledsoe Street","Gallatin","Sumner","TN",37066,null,830442]
[830642,"Signature Healthcare of Portland Rehab & Wellness Center","215 Highland Circle Drive","Portland","Sumner","TN",37148,null,830642]
[830742,"NHC HealthCare, Hendersonville","370 Old Shackle Island Road","Hendersonville","Sumner","TN",37075,null,830742]
[830756,"NHC Place - Sumner","140 Thorne Boulevard","Gallatin","Sumner","TN",37075,null,830752]
[831242,"Westmoreland Care and Rehabilitation Center","1559 New Highway 52","Westmoreland","Sumner","TN",37186,null,831242]
[840162,"Magnolia Creek Nursing and Rehabilitation","1992 Highway 51 South","Covington","Tipton","TN",38019,null,840162]
[840362,"Covington Care Nursing and Rehabilitation Center","765 Bert Johnston Avenue","Covington","Tipton","TN",38019,null,840362]
[850142,"Hartsville Convalescent Center","649 McMurry Boulevard","Hartsville","Trousdale","TN",37074,null,850142]
[860112,"Unicoi County Nursing Home","100 Greenway Circle","Erwin","Unicoi","TN",37650,null,860112]
[860212,"Erwin Health Care Center","100 Stalling Lane","Erwin","Unicoi","TN",37650,null,860212]
[860312,"Center on Aging and Health","880 South Mohawk Drive","Erwin","Unicoi","TN",37650,null,860312]
[870122,"Willow Ridge Center","215 Richardson Way","Maynardville","Union","TN",37807,null,870122]
[880542,"Generations Center of Spencer","87 Generations Drive","Spencer","Van Buren","TN",38585,null,880542]
[890242,"NHC HealthCare, McMinnville","P.O. Box 528, 928 Old Smithville Road","McMinnville","Warren","TN",37110,null,890242]
[890342,"Raintree Manor","415 Pace Street","McMinnville","Warren","TN",37110,null,890342]
[900112,"NHC HealthCare, Johnson City","3209 Bristol Highway","Johnson City","Washington","TN",37601,null,900112]
[900212,"Cornerstone Village","2012 Sherwood Drive","Johnson City","Washington","TN",37601,null,900212]
[900312,"John M. Reed Health and Rehab","124 John Reed Home Road","Limestone","Washington","TN",37681,null,900312]
[900512,"Agape Nursing and Rehabilitation Center, LLC","105 West Myrtle Avenue","Johnson City","Washington","TN",37604,null,900512]
[900712,"Life Care Center of Gray","791 Old Gray Station Road","Gray","Washington","TN",37615,null,900712]
[901012,"Four Oaks Health Care Center","1101 Persimmon Ridge Road","Jonesborough","Washington","TN",37659,null,901012]
[901112,"Franklin Transitional Care","2511 Wesley Street","Johnson City","Washington","TN",37601,null,901112]
[901212,"Princeton Transitional Care","2511 Wesley Street","Johnson City","Washington","TN",37601,null,901212]
[901312,"Lakebridge Health Care Center","115 Woodlawn Drive","Johnson City","Washington","TN",37604,null,901312]
[901412,"The Waters of Johnson City","140 Technology Lane","Johnson City","Washington","TN",37604,null,901412]
[910142,"Waynesboro Health and Rehabilitation Center","P.O. Box 510, 104 J.V. Mangubat Drive","Waynesboro","Wayne","TN",38485,null,910142]
[910242,"Wayne Care Nursing Home","P.O. Box 777, 505 South High Street","Waynesboro","Wayne","TN",38485,null,910242]
[920152,"Hillview Community Living Center","897 Evergreen Street","Dresden","Weakley","TN",38225,null,920152]
[920252,"Weakley County Nursing Home","700 W. C. Nursing Home Road","Dresden","Weakley","TN",38225,null,920252]
[920352,"Vanayer Healthcare and Rehab Center","640 Hannings Lane","Martin","Weakley","TN",38237,null,920352]
[920552,"Diversicare of Martin Health Care Facility","158 Mt. Pelia Road","Martin","Weakley","TN",38237,null,920552]
[930242,"NHC HealthCare, Sparta","34 Gracey Street","Sparta","White","TN",38583,null,930242]
[930342,"Life Care Center of Sparta","508 Mose Drive","Sparta","White","TN",38583,null,930342]
[940242,"Grace Healthcare of Franklin","1287 West Main Street","Franklin","Williamson","TN",37064,null,940242]
[940542,"NHC HealthCare, Franklin","216 Fairground Street","Franklin","Williamson","TN",37064,null,940542]
[940642,"Claiborne and Hughes Health Center","200 Strahl Street","Franklin","Williamson","TN",37064,null,940642]
[940742,"NHC Place at Cool Springs","211 Cool Springs Boulevard","Franklin","Williamson","TN",37067,null,940742]
[940842,"Somerfield at the Heritage","900 Heritage Way","Brentwood","Williamson","TN",37027,null,940842]
[950242,"The Pavilion","1406 Medical Center Drive","Lebanon","Wilson","TN",37087,null,950242]
[950342,"Quality Care Health Center","932 Baddour Parkway","Lebanon","Wilson","TN",37087,null,950342]
[950742,"Lebanon Health and Rehabilitation Center","731 Castle Heights Court","Lebanon","Wilson","TN",37087,null,950742]
[950842,"Mount Juliet Health Care Center","2650 North Mt. Juliet Road","Mount Juliet","Wilson","TN",37122,null,950842]

{"sheet":"Sch A","index":3,"n_rows":358,"n_cols":48,"rows_kept":358,"cut":false,"hidden":false,"merged":[[0,36,0,38],[2,0,2,35],[3,0,3,35],[4,5,4,11],[9,21,9,26],[9,12,9,20],[1,33,1,35],[7,5,7,11],[6,33,6,35],[6,5,6,32],[7,12,7,35],[7,36,8,36],[4,37,7,37],[1,15,1,32],[1,0,1,3],[1,4,1,8],[4,36,5,36],[13,5,13,11],[14,12,14,35],[16,27,16,35],[19,0,22,4],[18,12,18,35],[15,21,15,26],[11,5,11,11],[12,5,12,32],[15,27,15,35],[16,5,16,11],[5,5,5,11],[4,12,4,35],[4,0,15,4],[5,12,5,35],[12,33,12,35],[0,0,0,35],[21,21,21,29],[17,12,17,35],[19,5,19,35],[18,5,18,11],[1,9,1,14],[8,12,8,35],[9,5,9,11],[8,5,8,11],[9,27,9,35],[10,21,10,26],[10,12,10,20],[10,5,10,11],[16,0,18,4],[17,5,17,11],[15,12,15,20],[23,37,24,37],[23,5,23,35],[24,5,24,11],[14,37,16,37],[10,37,12,37],[11,36,14,36],[10,27,10,35],[18,37,21,37],[11,12,11,35],[14,5,14,11],[15,5,15,11],[13,12,13,35],[16,12,16,20],[16,21,16,26],[28,0,28,35],[20,5,20,32],[21,30,21,35],[27,0,27,35],[22,30,22,35],[26,0,26,35],[24,12,24,35],[25,12,25,35],[22,21,22,29],[21,5,22,20],[23,0,25,4],[20,33,20,35],[25,5,25,11]]}
["2018 - NURSING HOMES - PROVISIONAL",null,null,null,null,null,null,null,null,null,null,null,null,null,null,null,null,null,null,null,null,null,null,null,null,null,null,null,null,null,null,null,null,null,null,null,"'OK' = Likely no Error\n'Error\" = Maybe Error\nin data provided"]
["State ID:",null,null,null,{"$f":"NHA_StateID","v":0},null,null,null,null,"Facility Name:",null,null,null,null,null,{"$f":"NHA_Name","v":"-"},null,null,null,null,null,null,null,null,null,null,null,null,null,null,null,null,null,2018]
["Tennessee Joint Annual Report of Nursing Homes - Schedule A - Identification"]
["According to the Department of Health rules and regulations section 1200-8-6-.11(4), “a yearly statistical report, the ‘Joint Annual Report of Nursing Homes’, shall be submitted to the Department.” Report data for the year indicated above. Please read all information carefully before completing your Joint Annual Report. Please complete all applicable items on the Joint Annual Report. Check all computations.  Please check all checkboxes. Any items which appear to be inconsistent will be queried.  Facilities will be reported to the Board for Licensing Health Care Facilities for failure to timely file a report or respond to queries."]
["Facility",null,null,null,null," State ID",null,null,null,null,null,null,0,null,null,null,null,null,null,null,null,null,null,null,null,null,null,null,null,null,null,null,null,null,null,null,"Yes/No\nQuestion","Facility\nStreet\nAddress\ndata\nprovided",null,{"$f":"IF(NHA_StreetAddress=\"-\",0,1)","v":0},{"$f":"IF(NHA_State=\"\",0,1)","v":0},null,null,null,null,null,{"$f":"VLOOKUP(NHA_StateID,DBase!$A:$G,2,FALSE)","v":"-"},{"$f":"VLOOKUP(NHA_StateID,DBase!$A:$G,2,FALSE)","v":"-"}]
[null,null,null,null,null," Nursing Home Name",null,null,null,null,null,null,{"$f":"IF(AU5=\"#N/A\",\" \",AU5)","v":"-"},null,null,null,null,null,null,null,null,null,null,null,null,null,null,null,null,null,null,null,null,null,null,null,null,null,null,2,{"$f":"IF(NHA_Zip=\"\",0,1)","v":1},null,null,null,null,null,{"$f":"VLOOKUP(NHA_StateID,DBase!$A:$G,3,FALSE)","v":"-"},{"$f":"VLOOKUP(NHA_StateID,DBase!$A:$G,3,FALSE)","v":"-"}]
[null,null,null,null,null," Did the facility name change during the reporting period?                                  Yes/No",null,null,null,null,null,null,null,null,null,null,null,null,null,null,null,null,null,null,null,null,null,null,null,null,null,null,null,"-",null,null,{"$f":"IF(AO9=TRUE,\"Ok\",\"Error\")","v":"Error"},null,null,{"$f":"IF(NHA_City=\"\",0,1)","v":1},{"$f":"IF(NHA_Phone=\"\",0,1)","v":0},null,null,null,null,null,{"$f":"VLOOKUP(NHA_StateID,DBase!$A:$G,4,FALSE)","v":"-"},{"$f":"VLOOKUP(NHA_StateID,DBase!$A:$G,4,FALSE)","v":"-"}]
[null,null,null,null,null," If Yes, Prior Name",null,null,null,null,null,null,null,null,null,null,null,null,null,null,null,null,null,null,null,null,null,null,null,null,null,null,null,null,null,null,"Prior\nName",null,null,{"$f":"IF(NHA_County=\" \",0,1)","v":1},1,null,null,null,null,null,{"$f":"VLOOKUP(NHA_StateID,DBase!$A:$G,5,FALSE)","v":"-"},{"$f":"VLOOKUP(NHA_StateID,DBase!$A:$G,5,FALSE)","v":"-"}]
[null,null,null,null,null," Street Address",null,null,null,null,null,null,{"$f":"AU6","v":"-"},null,null,null,null,null,null,null,null,null,null,null,null,null,null,null,null,null,null,null,null,null,null,null,null,{"$f":"IF(AN9=8,\"Ok\",\"Error\")","v":"Error"},null,{"$f":"SUM(AN5:AN8,AO5:AO6,AO8)","v":6},{"$f":"OR(NHA_NameChange=\"Yes\",NHA_NameChange=\"No\")","v":false},null,null,null,null,null,{"$f":"VLOOKUP(NHA_StateID,DBase!$A:$G,6,FALSE)","v":"-"},{"$f":"VLOOKUP(NHA_StateID,DBase!$A:$G,6,FALSE)","v":"-"}]
[null,null,null,null,null," City",null,null,null,null,null,null,{"$f":"AU7","v":"-"},null,null,null,null,null,null,null,null," County",null,null,null,null,null,{"$f":"AU8","v":"-"},null,null,null,null,null,null,null,null,{"$f":"IF(AO10=AN10,\"Ok\", \"Error\")","v":"Ok"},null,null,{"$f":"IF(NHA_PriorName=\"\",0,1)","v":0},{"$f":"IF(NHA_NameChange=\"Yes\",1,0)","v":0},null,null,null,null,null,{"$f":"VLOOKUP(NHA_StateID,DBase!$A:$G,7,FALSE)","v":"-"},{"$f":"VLOOKUP(NHA_StateID,DBase!$A:$G,7,FALSE)","v":"-"}]
[null,null,null,null,null," State    ",null,null,null,null,null,null,null,null,null,null,null,null,null,null,null," Zip Code (5 digit)",null,null,null,null,null,{"$f":"AU10","v":"-"},null,null,null,null,null,null,null,null,null,"Mail\nAddress\nYes/No\nQuestion",null,{"$f":"OR(NHA_MAYN=\"Yes\",NHA_MAYN=\"No\")","v":false}]
[null,null,null,null,null," Phone",null,null,null,null,null,null,null,null,null,null,null,null,null,null,null,null,null,null,null,null,null,null,null,null,null,null,null,null,null,null,"Facility\nMailing\nAddress\ndata\nprovided",null,null,{"$f":"IF(NHA_MailAddress=\"\",0,1)","v":0},{"$f":"IF(NHA_MAYN=\"Yes\",1,0)","v":0}]
[null,null,null,null,null," Mailing Address same as Street Address?  If Yes, proceed to next section.           Yes/No",null,null,null,null,null,null,null,null,null,null,null,null,null,null,null,null,null,null,null,null,null,null,null,null,null,null,null,"-",null,null,null,null,null,{"$f":"IF(NHA_MailCity=\"\",0,1)","v":0},{"$f":"IF(NHA_MailZip=\"\",0,1)","v":0}]
[null,null,null,null,null," Mailing Address",null,null,null,null,null,null,{"$f":"IF(NHA_MAYN=  \"Yes\", AV6, \"\")","v":""},null,null,null,null,null,null,null,null,null,null,null,null,null,null,null,null,null,null,null,null,null,null,null,null,{"$f":"IF(AN11=TRUE,\"Ok\",\"Error\")","v":"Error"},null,{"$f":"IF(NHA_MailState=\"\",0,1)","v":0},{"$f":"IF(NHA_MAYN=\"No\",6,0)","v":0}]
[null,null,null,null,null," City",null,null,null,null,null,null,{"$f":"IF(NHA_MAYN=  \"Yes\", AV7, \"\")","v":""},null,null,null,null,null,null,null,null,null,null,null,null,null,null,null,null,null,null,null,null,null,null,null,null,"Preparer\ndata\nprovided",null,{"$f":"SUM(AN12:AO14)","v":0},{"$f":"OR(AN15=5,AN15=10)","v":false}]
[null,null,null,null,null," State",null,null,null,null,null,null,{"$f":"IF(NHA_MAYN=  \"Yes\", AV9, \"\")","v":""},null,null,null,null,null,null,null,null," Zip Code (5 digit)",null,null,null,null,null,{"$f":"IF(NHA_MAYN=  \"Yes\", AV10, \"\")","v":""},null,null,null,null,null,null,null,null,{"$f":"IF(AO15=TRUE,\"Ok\",\"Error\")","v":"Error"},null,null,null,{"$f":"IF(NHA_PrepName=\"\",0,1)","v":0}]
["Preparer ",null,null,null,null," Preparer Name",null,null,null,null,null,null,null,null,null,null,null,null,null,null,null," Preparer Phone",null,null,null,null,null,null,null,null,null,null,null,null,null,null,null,null,null,null,{"$f":"IF(NHA_PrepPhone=\"\",0,1)","v":0}]
[null,null,null,null,null," Preparer Title",null,null,null,null,null,null,null,null,null,null,null,null,null,null,null,null,null,null,null,null,null,null,null,null,null,null,null,null,null,null,null,{"$f":"IF(AO20=4,\"Ok\",\"Error\")","v":"Error"},null,null,{"$f":"IF(NHA_PrepTitle=\"\",0,1)","v":0},null,null,null,null,null,"ID list"]
[null,null,null,null,null," Preparer Email",null,null,null,null,null,null,null,null,null,null,null,null,null,null,null,null,null,null,null,null,null,null,null,null,null,null,null,null,null,null,null,"Reporting\nPeriod\nanswered\nNo;\nhowever,\nBeginning\nand Ending\ndate(s)\nnot changed",null,null,{"$f":"IF(NHA_PrepEMail=\"\",0,1)","v":0},null,null,null,null,null,0]
["2018                       Reporting\nPeriod",null,null,null,null,"In the event that a reporting period other than January 1 through December 31 is used for statistical information, please report data for the last day of your reporting period when information is requested for December 31.  If you are reporting for less than a full year, utilization and financial data should be presented for days reported only. The reporting period for the nursing home JAR report does not need to match the reporting period for an affiliated hospital.",null,null,null,null,null,null,null,null,null,null,null,null,null,null,null,null,null,null,null,null,null,null,null,null,null,null,null,null,null,null,"Yes/No\nQuestion",null,null,null,{"$f":"SUM(AO16:AO19)","v":0},null,null,null,null,null,10122]
[null,null,null,null,null," Is the reporting period from January 1 through December 31, 2018?                              Yes/No",null,null,null,null,null,null,null,null,null,null,null,null,null,null,null,null,null,null,null,null,null,null,null,null,null,null,null,"-",null,null,{"$f":"IF(AO21=TRUE,\"Ok\",\"Error\")","v":"Error"},null,null,{"$f":"IF(NHA_RptPeriodYN=\"No\",3,0)","v":0},{"$f":"OR(NHA_RptPeriodYN=\"Yes\",NHA_RptPeriodYN=\"No\")","v":false},null,null,null,null,null,10322]
[null,null,null,null,null," If unable to report based on above dates, provide\n the beginning and ending dates (used for all\n utilization and financial data)",null,null,null,null,null,null,null,null,null,null,null,null,null,null,null," Beginning      (mm/dd/yyyy)",null,null,null,null,null,null,null,null,{"$f":"IF(NHA_RptPeriodYN=\"Yes\",\"01/01/2018\",\"\")","v":""},null,null,null,null,null,null,null,null,{"$f":"IF(NHA_RptBegDate>42005,1,0)","v":1},null,null,null,null,null,null,10422]
[null,null,null,null,null,null,null,null,null,null,null,null,null,null,null,null,null,null,null,null,null," Ending          (mm/dd/yyyy)",null,null,null,null,null,null,null,null,{"$f":"IF(NHA_RptPeriodYN=\"Yes\",\"12/31/2018\",\"\")","v":""},null,null,null,null,null,null,{"$f":"IF(AN24=5,\"Error\", \"Ok\")","v":"Ok"},null,{"$f":"IF(NHA_RptEndDate>42005,1,0)","v":1},null,null,null,null,null,null,10522]
["Administration                  ",null,null,null,null,"TCA 63-16-111 (b) No nursing home in the state may operate unless it is under the supervision of an administrator who holds a currently valid nursing home administrator license and registration, or provisional license issued pursuant to this chapter.",null,null,null,null,null,null,null,null,null,null,null,null,null,null,null,null,null,null,null,null,null,null,null,null,null,null,null,null,null,null,null,"Admin-\nstrator\ndata\nprovided",null,{"$f":"SUM(AN21:AN23)","v":2},{"$f":"IF(NHA_Admin=\"\",0,1)","v":0},null,null,null,null,null,10622]
[null,null,null,null,null," Name of\n Administrator",null,null,null,null,null,null,null,null,null,null,null,null,null,null,null,null,null,null,null,null,null,null,null,null,null,null,null,null,null,null,null,null,null,null,{"$f":"IF(NHA_AdminLic=\"\",0,1)","v":0},null,null,null,null,null,20142]
[null,null,null,null,null," Administrator\n License",null,null,null,null,null,null,null,null,null,null,null,null,null,null,null,null,null,null,null,null,null,null,null,null,null,null,null,null,null,null,null,{"$f":"IF(AO26=2,\"Ok\",\"Error\")","v":"Error"},null,null,{"$f":"SUM(AO24:AO25)","v":0},null,null,null,null,null,20242]
["Go to Next Schedule",null,null,null,null,null,null,null,null,null,null,null,null,null,null,null,null,null,null,null,null,null,null,null,null,null,null,null,null,null,null,null,null,null,null,null,null,null,null,null,null,null,null,null,null,null,30252]
["Return to Main Menu",null,null,null,null,null,null,null,null,null,null,null,null,null,null,null,null,null,null,null,null,null,null,null,null,null,null,null,null,null,null,null,null,null,null,null,null,null,null,null,null,null,null,null,null,null,40132]
["Go to Error Listing",null,null,null,null,null,null,null,null,null,null,null,null,null,null,null,null,null,null,null,null,null,null,null,null,null,null,null,null,null,null,null,null,null,null,null,null,null,null,null,null,null,null,null,null,null,50422]
[null,null,null,null,null,null,null,null,null,null,null,null,null,null,null,null,null,null,null,null,null,null,null,null,null,null,null,null,null,null,null,null,null,null,null,null,null,null,null,null,null,null,null,null,null,null,50522]
[null,null,null,null,null,null,null,null,null,null,null,null,null,null,null,null,null,null,null,null,null,null,null,null,null,null,null,null,null,null,null,null,null,null,null,null,null,null,null,null,null,null,null,null,null,null,50622]
[null,null,null,null,null,null,null,null,null,null,null,null,null,null,null,null,null,null,null,null,null,null,null,null,null,null,null,null,null,null,null,null,null,null,null,null,null,null,null,null,null,null,null,null,null,null,50822]
[null,null,null,null,null,null,null,null,null,null,null,null,null,null,null,null,null,null,null,null,null,null,null,null,null,null,null,null,null,null,null,null,null,null,null,null,null,null,null,null,null,null,null,null,null,null,50922]
[null,null,null,null,null,null,null,null,null,null,null,null,null,null,null,null,null,null,null,null,null,null,null,null,null,null,null,null,null,null,null,null,null,null,null,null,null,null,null,null,null,null,null,null,null,null,51022]
[null,null,null,null,null,null,null,null,null,null,null,null,null,null,null,null,null,null,null,null,null,null,null,null,null,null,null,null,null,null,null,null,null,null,null,null,null,null,null,null,null,null,null,null,null,null,51122]
[null,null,null,null,null,null,null,null,null,null,null,null,null,null,null,null,null,null,null,null,null,null,null,null,null,null,null,null,null,null,null,null,null,null,null,null,null,null,null,null,null,null,null,null,null,null,60132]
[null,null,null,null,null,null,null,null,null,null,null,null,null,null,null,null,null,null,null,null,null,null,null,null,null,null,null,null,null,null,null,null,null,null,null,null,null,null,null,null,null,null,null,null,null,null,60232]
[null,null,null,null,null,null,null,null,null,null,null,null,null,null,null,null,null,null,null,null,null,null,null,null,null,null,null,null,null,null,null,null,null,null,null,null,null,null,null,null,null,null,null,null,null,null,60432]
[null,null,null,null,null,null,null,null,null,null,null,null,null,null,null,null,null,null,null,null,null,null,null,null,null,null,null,null,null,null,null,null,null,null,null,null,null,null,null,null,null,null,null,null,null,null,70122]
[null,null,null,null,null,null,null,null,null,null,null,null,null,null,null,null,null,null,null,null,null,null,null,null,null,null,null,null,null,null,null,null,null,null,null,null,null,null,null,null,null,null,null,null,null,null,70222]
[null,null,null,null,null,null,null,null,null,null,null,null,null,null,null,null,null,null,null,null,null,null,null,null,null,null,null,null,null,null,null,null,null,null,null,null,null,null,null,null,null,null,null,null,null,null,70322]
[null,null,null,null,null,null,null,null,null,null,null,null,null,null,null,null,null,null,null,null,null,null,null,null,null,null,null,null,null,null,null,null,null,null,null,null,null,null,null,null,null,null,null,null,null,null,80142]
[null,null,null,null,null,null,null,null,null,null,null,null,null,null,null,null,null,null,null,null,null,null,null,null,null,null,null,null,null,null,null,null,null,null,null,null,null,null,null,null,null,null,null,null,null,null,90252]
[null,null,null,null,null,null,null,null,null,null,null,null,null,null,null,null,null,null,null,null,null,null,null,null,null,null,null,null,null,null,null,null,null,null,null,null,null,null,null,null,null,null,null,null,null,null,90352]
[null,null,null,null,null,null,null,null,null,null,null,null,null,null,null,null,null,null,null,null,null,null,null,null,null,null,null,null,null,null,null,null,null,null,null,null,null,null,null,null,null,null,null,null,null,null,90452]
[null,null,null,null,null,null,null,null,null,null,null,null,null,null,null,null,null,null,null,null,null,null,null,null,null,null,null,null,null,null,null,null,null,null,null,null,null,null,null,null,null,null,null,null,null,null,90552]
[null,null,null,null,null,null,null,null,null,null,null,null,null,null,null,null,null,null,null,null,null,null,null,null,null,null,null,null,null,null,null,null,null,null,null,null,null,null,null,null,null,null,null,null,null,null,100112]
[null,null,null,null,null,null,null,null,null,null,null,null,null,null,null,null,null,null,null,null,null,null,null,null,null,null,null,null,null,null,null,null,null,null,null,null,null,null,null,null,null,null,null,null,null,null,100212]
[null,null,null,null,null,null,null,null,null,null,null,null,null,null,null,null,null,null,null,null,null,null,null,null,null,null,null,null,null,null,null,null,null,null,null,null,null,null,null,null,null,null,null,null,null,null,100312]
[null,null,null,null,null,null,null,null,null,null,null,null,null,null,null,null,null,null,null,null,null,null,null,null,null,null,null,null,null,null,null,null,null,null,null,null,null,null,null,null,null,null,null,null,null,null,100412]
[null,null,null,null,null,null,null,null,null,null,null,null,null,null,null,null,null,null,null,null,null,null,null,null,null,null,null,null,null,null,null,null,null,null,null,null,null,null,null,null,null,null,null,null,null,null,100512]
[null,null,null,null,null,null,null,null,null,null,null,null,null,null,null,null,null,null,null,null,null,null,null,null,null,null,null,null,null,null,null,null,null,null,null,null,null,null,null,null,null,null,null,null,null,null,100712]
[null,null,null,null,null,null,null,null,null,null,null,null,null,null,null,null,null,null,null,null,null,null,null,null,null,null,null,null,null,null,null,null,null,null,null,null,null,null,null,null,null,null,null,null,null,null,110142]
[null,null,null,null,null,null,null,null,null,null,null,null,null,null,null,null,null,null,null,null,null,null,null,null,null,null,null,null,null,null,null,null,null,null,null,null,null,null,null,null,null,null,null,null,null,null,110342]
[null,null,null,null,null,null,null,null,null,null,null,null,null,null,null,null,null,null,null,null,null,null,null,null,null,null,null,null,null,null,null,null,null,null,null,null,null,null,null,null,null,null,null,null,null,null,120152]
[null,null,null,null,null,null,null,null,null,null,null,null,null,null,null,null,null,null,null,null,null,null,null,null,null,null,null,null,null,null,null,null,null,null,null,null,null,null,null,null,null,null,null,null,null,null,130122]
[null,null,null,null,null,null,null,null,null,null,null,null,null,null,null,null,null,null,null,null,null,null,null,null,null,null,null,null,null,null,null,null,null,null,null,null,null,null,null,null,null,null,null,null,null,null,130222]
[null,null,null,null,null,null,null,null,null,null,null,null,null,null,null,null,null,null,null,null,null,null,null,null,null,null,null,null,null,null,null,null,null,null,null,null,null,null,null,null,null,null,null,null,null,null,130422]
[null,null,null,null,null,null,null,null,null,null,null,null,null,null,null,null,null,null,null,null,null,null,null,null,null,null,null,null,null,null,null,null,null,null,null,null,null,null,null,null,null,null,null,null,null,null,140142]
[null,null,null,null,null,null,null,null,null,null,null,null,null,null,null,null,null,null,null,null,null,null,null,null,null,null,null,null,null,null,null,null,null,null,null,null,null,null,null,null,null,null,null,null,null,null,150122]
[null,null,null,null,null,null,null,null,null,null,null,null,null,null,null,null,null,null,null,null,null,null,null,null,null,null,null,null,null,null,null,null,null,null,null,null,null,null,null,null,null,null,null,null,null,null,150222]
[null,null,null,null,null,null,null,null,null,null,null,null,null,null,null,null,null,null,null,null,null,null,null,null,null,null,null,null,null,null,null,null,null,null,null,null,null,null,null,null,null,null,null,null,null,null,160142]
[null,null,null,null,null,null,null,null,null,null,null,null,null,null,null,null,null,null,null,null,null,null,null,null,null,null,null,null,null,null,null,null,null,null,null,null,null,null,null,null,null,null,null,null,null,null,160242]
[null,null,null,null,null,null,null,null,null,null,null,null,null,null,null,null,null,null,null,null,null,null,null,null,null,null,null,null,null,null,null,null,null,null,null,null,null,null,null,null,null,null,null,null,null,null,160442]
[null,null,null,null,null,null,null,null,null,null,null,null,null,null,null,null,null,null,null,null,null,null,null,null,null,null,null,null,null,null,null,null,null,null,null,null,null,null,null,null,null,null,null,null,null,null,160542]
[null,null,null,null,null,null,null,null,null,null,null,null,null,null,null,null,null,null,null,null,null,null,null,null,null,null,null,null,null,null,null,null,null,null,null,null,null,null,null,null,null,null,null,null,null,null,170152]
[null,null,null,null,null,null,null,null,null,null,null,null,null,null,null,null,null,null,null,null,null,null,null,null,null,null,null,null,null,null,null,null,null,null,null,null,null,null,null,null,null,null,null,null,null,null,170252]
[null,null,null,null,null,null,null,null,null,null,null,null,null,null,null,null,null,null,null,null,null,null,null,null,null,null,null,null,null,null,null,null,null,null,null,null,null,null,null,null,null,null,null,null,null,null,180242]
[null,null,null,null,null,null,null,null,null,null,null,null,null,null,null,null,null,null,null,null,null,null,null,null,null,null,null,null,null,null,null,null,null,null,null,null,null,null,null,null,null,null,null,null,null,null,180342]
[null,null,null,null,null,null,null,null,null,null,null,null,null,null,null,null,null,null,null,null,null,null,null,null,null,null,null,null,null,null,null,null,null,null,null,null,null,null,null,null,null,null,null,null,null,null,180442]
[null,null,null,null,null,null,null,null,null,null,null,null,null,null,null,null,null,null,null,null,null,null,null,null,null,null,null,null,null,null,null,null,null,null,null,null,null,null,null,null,null,null,null,null,null,null,180742]
[null,null,null,null,null,null,null,null,null,null,null,null,null,null,null,null,null,null,null,null,null,null,null,null,null,null,null,null,null,null,null,null,null,null,null,null,null,null,null,null,null,null,null,null,null,null,190142]
[null,null,null,null,null,null,null,null,null,null,null,null,null,null,null,null,null,null,null,null,null,null,null,null,null,null,null,null,null,null,null,null,null,null,null,null,null,null,null,null,null,null,null,null,null,null,190342]
[null,null,null,null,null,null,null,null,null,null,null,null,null,null,null,null,null,null,null,null,null,null,null,null,null,null,null,null,null,null,null,null,null,null,null,null,null,null,null,null,null,null,null,null,null,null,190842]
[null,null,null,null,null,null,null,null,null,null,null,null,null,null,null,null,null,null,null,null,null,null,null,null,null,null,null,null,null,null,null,null,null,null,null,null,null,null,null,null,null,null,null,null,null,null,190942]
[null,null,null,null,null,null,null,null,null,null,null,null,null,null,null,null,null,null,null,null,null,null,null,null,null,null,null,null,null,null,null,null,null,null,null,null,null,null,null,null,null,null,null,null,null,null,191042]
[null,null,null,null,null,null,null,null,null,null,null,null,null,null,null,null,null,null,null,null,null,null,null,null,null,null,null,null,null,null,null,null,null,null,null,null,null,null,null,null,null,null,null,null,null,null,191642]
[null,null,null,null,null,null,null,null,null,null,null,null,null,null,null,null,null,null,null,null,null,null,null,null,null,null,null,null,null,null,null,null,null,null,null,null,null,null,null,null,null,null,null,null,null,null,191842]
[null,null,null,null,null,null,null,null,null,null,null,null,null,null,null,null,null,null,null,null,null,null,null,null,null,null,null,null,null,null,null,null,null,null,null,null,null,null,null,null,null,null,null,null,null,null,191942]
[null,null,null,null,null,null,null,null,null,null,null,null,null,null,null,null,null,null,null,null,null,null,null,null,null,null,null,null,null,null,null,null,null,null,null,null,null,null,null,null,null,null,null,null,null,null,192042]
[null,null,null,null,null,null,null,null,null,null,null,null,null,null,null,null,null,null,null,null,null,null,null,null,null,null,null,null,null,null,null,null,null,null,null,null,null,null,null,null,null,null,null,null,null,null,192142]
[null,null,null,null,null,null,null,null,null,null,null,null,null,null,null,null,null,null,null,null,null,null,null,null,null,null,null,null,null,null,null,null,null,null,null,null,null,null,null,null,null,null,null,null,null,null,192542]
[null,null,null,null,null,null,null,null,null,null,null,null,null,null,null,null,null,null,null,null,null,null,null,null,null,null,null,null,null,null,null,null,null,null,null,null,null,null,null,null,null,null,null,null,null,null,192742]
[null,null,null,null,null,null,null,null,null,null,null,null,null,null,null,null,null,null,null,null,null,null,null,null,null,null,null,null,null,null,null,null,null,null,null,null,null,null,null,null,null,null,null,null,null,null,192842]
[null,null,null,null,null,null,null,null,null,null,null,null,null,null,null,null,null,null,null,null,null,null,null,null,null,null,null,null,null,null,null,null,null,null,null,null,null,null,null,null,null,null,null,null,null,null,192843]
[null,null,null,null,null,null,null,null,null,null,null,null,null,null,null,null,null,null,null,null,null,null,null,null,null,null,null,null,null,null,null,null,null,null,null,null,null,null,null,null,null,null,null,null,null,null,192942]
[null,null,null,null,null,null,null,null,null,null,null,null,null,null,null,null,null,null,null,null,null,null,null,null,null,null,null,null,null,null,null,null,null,null,null,null,null,null,null,null,null,null,null,null,null,null,193042]
[null,null,null,null,null,null,null,null,null,null,null,null,null,null,null,null,null,null,null,null,null,null,null,null,null,null,null,null,null,null,null,null,null,null,null,null,null,null,null,null,null,null,null,null,null,null,193142]
[null,null,null,null,null,null,null,null,null,null,null,null,null,null,null,null,null,null,null,null,null,null,null,null,null,null,null,null,null,null,null,null,null,null,null,null,null,null,null,null,null,null,null,null,null,null,193542]
[null,null,null,null,null,null,null,null,null,null,null,null,null,null,null,null,null,null,null,null,null,null,null,null,null,null,null,null,null,null,null,null,null,null,null,null,null,null,null,null,null,null,null,null,null,null,193842]
[null,null,null,null,null,null,null,null,null,null,null,null,null,null,null,null,null,null,null,null,null,null,null,null,null,null,null,null,null,null,null,null,null,null,null,null,null,null,null,null,null,null,null,null,null,null,193942]
[null,null,null,null,null,null,null,null,null,null,null,null,null,null,null,null,null,null,null,null,null,null,null,null,null,null,null,null,null,null,null,null,null,null,null,null,null,null,null,null,null,null,null,null,null,null,194542]
[null,null,null,null,null,null,null,null,null,null,null,null,null,null,null,null,null,null,null,null,null,null,null,null,null,null,null,null,null,null,null,null,null,null,null,null,null,null,null,null,null,null,null,null,null,null,194642]
[null,null,null,null,null,null,null,null,null,null,null,null,null,null,null,null,null,null,null,null,null,null,null,null,null,null,null,null,null,null,null,null,null,null,null,null,null,null,null,null,null,null,null,null,null,null,194742]
[null,null,null,null,null,null,null,null,null,null,null,null,null,null,null,null,null,null,null,null,null,null,null,null,null,null,null,null,null,null,null,null,null,null,null,null,null,null,null,null,null,null,null,null,null,null,194842]
[null,null,null,null,null,null,null,null,null,null,null,null,null,null,null,null,null,null,null,null,null,null,null,null,null,null,null,null,null,null,null,null,null,null,null,null,null,null,null,null,null,null,null,null,null,null,200252]
[null,null,null,null,null,null,null,null,null,null,null,null,null,null,null,null,null,null,null,null,null,null,null,null,null,null,null,null,null,null,null,null,null,null,null,null,null,null,null,null,null,null,null,null,null,null,200352]
[null,null,null,null,null,null,null,null,null,null,null,null,null,null,null,null,null,null,null,null,null,null,null,null,null,null,null,null,null,null,null,null,null,null,null,null,null,null,null,null,null,null,null,null,null,null,210142]
[null,null,null,null,null,null,null,null,null,null,null,null,null,null,null,null,null,null,null,null,null,null,null,null,null,null,null,null,null,null,null,null,null,null,null,null,null,null,null,null,null,null,null,null,null,null,220442]
[null,null,null,null,null,null,null,null,null,null,null,null,null,null,null,null,null,null,null,null,null,null,null,null,null,null,null,null,null,null,null,null,null,null,null,null,null,null,null,null,null,null,null,null,null,null,220542]
[null,null,null,null,null,null,null,null,null,null,null,null,null,null,null,null,null,null,null,null,null,null,null,null,null,null,null,null,null,null,null,null,null,null,null,null,null,null,null,null,null,null,null,null,null,null,230152]
[null,null,null,null,null,null,null,null,null,null,null,null,null,null,null,null,null,null,null,null,null,null,null,null,null,null,null,null,null,null,null,null,null,null,null,null,null,null,null,null,null,null,null,null,null,null,230252]
[null,null,null,null,null,null,null,null,null,null,null,null,null,null,null,null,null,null,null,null,null,null,null,null,null,null,null,null,null,null,null,null,null,null,null,null,null,null,null,null,null,null,null,null,null,null,230352]
[null,null,null,null,null,null,null,null,null,null,null,null,null,null,null,null,null,null,null,null,null,null,null,null,null,null,null,null,null,null,null,null,null,null,null,null,null,null,null,null,null,null,null,null,null,null,240162]
[null,null,null,null,null,null,null,null,null,null,null,null,null,null,null,null,null,null,null,null,null,null,null,null,null,null,null,null,null,null,null,null,null,null,null,null,null,null,null,null,null,null,null,null,null,null,240262]
[null,null,null,null,null,null,null,null,null,null,null,null,null,null,null,null,null,null,null,null,null,null,null,null,null,null,null,null,null,null,null,null,null,null,null,null,null,null,null,null,null,null,null,null,null,null,250142]
[null,null,null,null,null,null,null,null,null,null,null,null,null,null,null,null,null,null,null,null,null,null,null,null,null,null,null,null,null,null,null,null,null,null,null,null,null,null,null,null,null,null,null,null,null,null,260142]
[null,null,null,null,null,null,null,null,null,null,null,null,null,null,null,null,null,null,null,null,null,null,null,null,null,null,null,null,null,null,null,null,null,null,null,null,null,null,null,null,null,null,null,null,null,null,260342]
[null,null,null,null,null,null,null,null,null,null,null,null,null,null,null,null,null,null,null,null,null,null,null,null,null,null,null,null,null,null,null,null,null,null,null,null,null,null,null,null,null,null,null,null,null,null,260442]
[null,null,null,null,null,null,null,null,null,null,null,null,null,null,null,null,null,null,null,null,null,null,null,null,null,null,null,null,null,null,null,null,null,null,null,null,null,null,null,null,null,null,null,null,null,null,270152]
[null,null,null,null,null,null,null,null,null,null,null,null,null,null,null,null,null,null,null,null,null,null,null,null,null,null,null,null,null,null,null,null,null,null,null,null,null,null,null,null,null,null,null,null,null,null,270252]
[null,null,null,null,null,null,null,null,null,null,null,null,null,null,null,null,null,null,null,null,null,null,null,null,null,null,null,null,null,null,null,null,null,null,null,null,null,null,null,null,null,null,null,null,null,null,270352]
[null,null,null,null,null,null,null,null,null,null,null,null,null,null,null,null,null,null,null,null,null,null,null,null,null,null,null,null,null,null,null,null,null,null,null,null,null,null,null,null,null,null,null,null,null,null,270452]
[null,null,null,null,null,null,null,null,null,null,null,null,null,null,null,null,null,null,null,null,null,null,null,null,null,null,null,null,null,null,null,null,null,null,null,null,null,null,null,null,null,null,null,null,null,null,270552]
[null,null,null,null,null,null,null,null,null,null,null,null,null,null,null,null,null,null,null,null,null,null,null,null,null,null,null,null,null,null,null,null,null,null,null,null,null,null,null,null,null,null,null,null,null,null,270752]
[null,null,null,null,null,null,null,null,null,null,null,null,null,null,null,null,null,null,null,null,null,null,null,null,null,null,null,null,null,null,null,null,null,null,null,null,null,null,null,null,null,null,null,null,null,null,270852]
[null,null,null,null,null,null,null,null,null,null,null,null,null,null,null,null,null,null,null,null,null,null,null,null,null,null,null,null,null,null,null,null,null,null,null,null,null,null,null,null,null,null,null,null,null,null,271052]
[null,null,null,null,null,null,null,null,null,null,null,null,null,null,null,null,null,null,null,null,null,null,null,null,null,null,null,null,null,null,null,null,null,null,null,null,null,null,null,null,null,null,null,null,null,null,271152]
[null,null,null,null,null,null,null,null,null,null,null,null,null,null,null,null,null,null,null,null,null,null,null,null,null,null,null,null,null,null,null,null,null,null,null,null,null,null,null,null,null,null,null,null,null,null,280142]
[null,null,null,null,null,null,null,null,null,null,null,null,null,null,null,null,null,null,null,null,null,null,null,null,null,null,null,null,null,null,null,null,null,null,null,null,null,null,null,null,null,null,null,null,null,null,280242]
[null,null,null,null,null,null,null,null,null,null,null,null,null,null,null,null,null,null,null,null,null,null,null,null,null,null,null,null,null,null,null,null,null,null,null,null,null,null,null,null,null,null,null,null,null,null,280342]
[null,null,null,null,null,null,null,null,null,null,null,null,null,null,null,null,null,null,null,null,null,null,null,null,null,null,null,null,null,null,null,null,null,null,null,null,null,null,null,null,null,null,null,null,null,null,290122]
[null,null,null,null,null,null,null,null,null,null,null,null,null,null,null,null,null,null,null,null,null,null,null,null,null,null,null,null,null,null,null,null,null,null,null,null,null,null,null,null,null,null,null,null,null,null,300112]
[null,null,null,null,null,null,null,null,null,null,null,null,null,null,null,null,null,null,null,null,null,null,null,null,null,null,null,null,null,null,null,null,null,null,null,null,null,null,null,null,null,null,null,null,null,null,300312]
[null,null,null,null,null,null,null,null,null,null,null,null,null,null,null,null,null,null,null,null,null,null,null,null,null,null,null,null,null,null,null,null,null,null,null,null,null,null,null,null,null,null,null,null,null,null,300412]
[null,null,null,null,null,null,null,null,null,null,null,null,null,null,null,null,null,null,null,null,null,null,null,null,null,null,null,null,null,null,null,null,null,null,null,null,null,null,null,null,null,null,null,null,null,null,300512]
[null,null,null,null,null,null,null,null,null,null,null,null,null,null,null,null,null,null,null,null,null,null,null,null,null,null,null,null,null,null,null,null,null,null,null,null,null,null,null,null,null,null,null,null,null,null,310132]
[null,null,null,null,null,null,null,null,null,null,null,null,null,null,null,null,null,null,null,null,null,null,null,null,null,null,null,null,null,null,null,null,null,null,null,null,null,null,null,null,null,null,null,null,null,null,320122]
[null,null,null,null,null,null,null,null,null,null,null,null,null,null,null,null,null,null,null,null,null,null,null,null,null,null,null,null,null,null,null,null,null,null,null,null,null,null,null,null,null,null,null,null,null,null,320222]
[null,null,null,null,null,null,null,null,null,null,null,null,null,null,null,null,null,null,null,null,null,null,null,null,null,null,null,null,null,null,null,null,null,null,null,null,null,null,null,null,null,null,null,null,null,null,330132]
[null,null,null,null,null,null,null,null,null,null,null,null,null,null,null,null,null,null,null,null,null,null,null,null,null,null,null,null,null,null,null,null,null,null,null,null,null,null,null,null,null,null,null,null,null,null,330232]
[null,null,null,null,null,null,null,null,null,null,null,null,null,null,null,null,null,null,null,null,null,null,null,null,null,null,null,null,null,null,null,null,null,null,null,null,null,null,null,null,null,null,null,null,null,null,330332]
[null,null,null,null,null,null,null,null,null,null,null,null,null,null,null,null,null,null,null,null,null,null,null,null,null,null,null,null,null,null,null,null,null,null,null,null,null,null,null,null,null,null,null,null,null,null,330432]
[null,null,null,null,null,null,null,null,null,null,null,null,null,null,null,null,null,null,null,null,null,null,null,null,null,null,null,null,null,null,null,null,null,null,null,null,null,null,null,null,null,null,null,null,null,null,330732]
[null,null,null,null,null,null,null,null,null,null,null,null,null,null,null,null,null,null,null,null,null,null,null,null,null,null,null,null,null,null,null,null,null,null,null,null,null,null,null,null,null,null,null,null,null,null,330832]
[null,null,null,null,null,null,null,null,null,null,null,null,null,null,null,null,null,null,null,null,null,null,null,null,null,null,null,null,null,null,null,null,null,null,null,null,null,null,null,null,null,null,null,null,null,null,330932]
[null,null,null,null,null,null,null,null,null,null,null,null,null,null,null,null,null,null,null,null,null,null,null,null,null,null,null,null,null,null,null,null,null,null,null,null,null,null,null,null,null,null,null,null,null,null,331032]
[null,null,null,null,null,null,null,null,null,null,null,null,null,null,null,null,null,null,null,null,null,null,null,null,null,null,null,null,null,null,null,null,null,null,null,null,null,null,null,null,null,null,null,null,null,null,331432]
[null,null,null,null,null,null,null,null,null,null,null,null,null,null,null,null,null,null,null,null,null,null,null,null,null,null,null,null,null,null,null,null,null,null,null,null,null,null,null,null,null,null,null,null,null,null,332232]
[null,null,null,null,null,null,null,null,null,null,null,null,null,null,null,null,null,null,null,null,null,null,null,null,null,null,null,null,null,null,null,null,null,null,null,null,null,null,null,null,null,null,null,null,null,null,332332]
[null,null,null,null,null,null,null,null,null,null,null,null,null,null,null,null,null,null,null,null,null,null,null,null,null,null,null,null,null,null,null,null,null,null,null,null,null,null,null,null,null,null,null,null,null,null,332432]
[null,null,null,null,null,null,null,null,null,null,null,null,null,null,null,null,null,null,null,null,null,null,null,null,null,null,null,null,null,null,null,null,null,null,null,null,null,null,null,null,null,null,null,null,null,null,340112]
[null,null,null,null,null,null,null,null,null,null,null,null,null,null,null,null,null,null,null,null,null,null,null,null,null,null,null,null,null,null,null,null,null,null,null,null,null,null,null,null,null,null,null,null,null,null,350152]
[null,null,null,null,null,null,null,null,null,null,null,null,null,null,null,null,null,null,null,null,null,null,null,null,null,null,null,null,null,null,null,null,null,null,null,null,null,null,null,null,null,null,null,null,null,null,350252]
[null,null,null,null,null,null,null,null,null,null,null,null,null,null,null,null,null,null,null,null,null,null,null,null,null,null,null,null,null,null,null,null,null,null,null,null,null,null,null,null,null,null,null,null,null,null,360152]
[null,null,null,null,null,null,null,null,null,null,null,null,null,null,null,null,null,null,null,null,null,null,null,null,null,null,null,null,null,null,null,null,null,null,null,null,null,null,null,null,null,null,null,null,null,null,360252]
[null,null,null,null,null,null,null,null,null,null,null,null,null,null,null,null,null,null,null,null,null,null,null,null,null,null,null,null,null,null,null,null,null,null,null,null,null,null,null,null,null,null,null,null,null,null,360352]
[null,null,null,null,null,null,null,null,null,null,null,null,null,null,null,null,null,null,null,null,null,null,null,null,null,null,null,null,null,null,null,null,null,null,null,null,null,null,null,null,null,null,null,null,null,null,360452]
[null,null,null,null,null,null,null,null,null,null,null,null,null,null,null,null,null,null,null,null,null,null,null,null,null,null,null,null,null,null,null,null,null,null,null,null,null,null,null,null,null,null,null,null,null,null,360552]
[null,null,null,null,null,null,null,null,null,null,null,null,null,null,null,null,null,null,null,null,null,null,null,null,null,null,null,null,null,null,null,null,null,null,null,null,null,null,null,null,null,null,null,null,null,null,370212]
[null,null,null,null,null,null,null,null,null,null,null,null,null,null,null,null,null,null,null,null,null,null,null,null,null,null,null,null,null,null,null,null,null,null,null,null,null,null,null,null,null,null,null,null,null,null,370312]
[null,null,null,null,null,null,null,null,null,null,null,null,null,null,null,null,null,null,null,null,null,null,null,null,null,null,null,null,null,null,null,null,null,null,null,null,null,null,null,null,null,null,null,null,null,null,370512]
[null,null,null,null,null,null,null,null,null,null,null,null,null,null,null,null,null,null,null,null,null,null,null,null,null,null,null,null,null,null,null,null,null,null,null,null,null,null,null,null,null,null,null,null,null,null,380152]
[null,null,null,null,null,null,null,null,null,null,null,null,null,null,null,null,null,null,null,null,null,null,null,null,null,null,null,null,null,null,null,null,null,null,null,null,null,null,null,null,null,null,null,null,null,null,390152]
[null,null,null,null,null,null,null,null,null,null,null,null,null,null,null,null,null,null,null,null,null,null,null,null,null,null,null,null,null,null,null,null,null,null,null,null,null,null,null,null,null,null,null,null,null,null,390252]
[null,null,null,null,null,null,null,null,null,null,null,null,null,null,null,null,null,null,null,null,null,null,null,null,null,null,null,null,null,null,null,null,null,null,null,null,null,null,null,null,null,null,null,null,null,null,400152]
[null,null,null,null,null,null,null,null,null,null,null,null,null,null,null,null,null,null,null,null,null,null,null,null,null,null,null,null,null,null,null,null,null,null,null,null,null,null,null,null,null,null,null,null,null,null,400252]
[null,null,null,null,null,null,null,null,null,null,null,null,null,null,null,null,null,null,null,null,null,null,null,null,null,null,null,null,null,null,null,null,null,null,null,null,null,null,null,null,null,null,null,null,null,null,400352]
[null,null,null,null,null,null,null,null,null,null,null,null,null,null,null,null,null,null,null,null,null,null,null,null,null,null,null,null,null,null,null,null,null,null,null,null,null,null,null,null,null,null,null,null,null,null,410142]
[null,null,null,null,null,null,null,null,null,null,null,null,null,null,null,null,null,null,null,null,null,null,null,null,null,null,null,null,null,null,null,null,null,null,null,null,null,null,null,null,null,null,null,null,null,null,410242]
[null,null,null,null,null,null,null,null,null,null,null,null,null,null,null,null,null,null,null,null,null,null,null,null,null,null,null,null,null,null,null,null,null,null,null,null,null,null,null,null,null,null,null,null,null,null,420242]
[null,null,null,null,null,null,null,null,null,null,null,null,null,null,null,null,null,null,null,null,null,null,null,null,null,null,null,null,null,null,null,null,null,null,null,null,null,null,null,null,null,null,null,null,null,null,430142]
[null,null,null,null,null,null,null,null,null,null,null,null,null,null,null,null,null,null,null,null,null,null,null,null,null,null,null,null,null,null,null,null,null,null,null,null,null,null,null,null,null,null,null,null,null,null,430242]
[null,null,null,null,null,null,null,null,null,null,null,null,null,null,null,null,null,null,null,null,null,null,null,null,null,null,null,null,null,null,null,null,null,null,null,null,null,null,null,null,null,null,null,null,null,null,440142]
[null,null,null,null,null,null,null,null,null,null,null,null,null,null,null,null,null,null,null,null,null,null,null,null,null,null,null,null,null,null,null,null,null,null,null,null,null,null,null,null,null,null,null,null,null,null,450122]
[null,null,null,null,null,null,null,null,null,null,null,null,null,null,null,null,null,null,null,null,null,null,null,null,null,null,null,null,null,null,null,null,null,null,null,null,null,null,null,null,null,null,null,null,null,null,450222]
[null,null,null,null,null,null,null,null,null,null,null,null,null,null,null,null,null,null,null,null,null,null,null,null,null,null,null,null,null,null,null,null,null,null,null,null,null,null,null,null,null,null,null,null,null,null,450422]
[null,null,null,null,null,null,null,null,null,null,null,null,null,null,null,null,null,null,null,null,null,null,null,null,null,null,null,null,null,null,null,null,null,null,null,null,null,null,null,null,null,null,null,null,null,null,460112]
[null,null,null,null,null,null,null,null,null,null,null,null,null,null,null,null,null,null,null,null,null,null,null,null,null,null,null,null,null,null,null,null,null,null,null,null,null,null,null,null,null,null,null,null,null,null,470622]
[null,null,null,null,null,null,null,null,null,null,null,null,null,null,null,null,null,null,null,null,null,null,null,null,null,null,null,null,null,null,null,null,null,null,null,null,null,null,null,null,null,null,null,null,null,null,470722]
[null,null,null,null,null,null,null,null,null,null,null,null,null,null,null,null,null,null,null,null,null,null,null,null,null,null,null,null,null,null,null,null,null,null,null,null,null,null,null,null,null,null,null,null,null,null,470822]
[null,null,null,null,null,null,null,null,null,null,null,null,null,null,null,null,null,null,null,null,null,null,null,null,null,null,null,null,null,null,null,null,null,null,null,null,null,null,null,null,null,null,null,null,null,null,471022]
[null,null,null,null,null,null,null,null,null,null,null,null,null,null,null,null,null,null,null,null,null,null,null,null,null,null,null,null,null,null,null,null,null,null,null,null,null,null,null,null,null,null,null,null,null,null,471122]
[null,null,null,null,null,null,null,null,null,null,null,null,null,null,null,null,null,null,null,null,null,null,null,null,null,null,null,null,null,null,null,null,null,null,null,null,null,null,null,null,null,null,null,null,null,null,471222]
[null,null,null,null,null,null,null,null,null,null,null,null,null,null,null,null,null,null,null,null,null,null,null,null,null,null,null,null,null,null,null,null,null,null,null,null,null,null,null,null,null,null,null,null,null,null,471322]
[null,null,null,null,null,null,null,null,null,null,null,null,null,null,null,null,null,null,null,null,null,null,null,null,null,null,null,null,null,null,null,null,null,null,null,null,null,null,null,null,null,null,null,null,null,null,471422]
[null,null,null,null,null,null,null,null,null,null,null,null,null,null,null,null,null,null,null,null,null,null,null,null,null,null,null,null,null,null,null,null,null,null,null,null,null,null,null,null,null,null,null,null,null,null,471522]
[null,null,null,null,null,null,null,null,null,null,null,null,null,null,null,null,null,null,null,null,null,null,null,null,null,null,null,null,null,null,null,null,null,null,null,null,null,null,null,null,null,null,null,null,null,null,471622]
[null,null,null,null,null,null,null,null,null,null,null,null,null,null,null,null,null,null,null,null,null,null,null,null,null,null,null,null,null,null,null,null,null,null,null,null,null,null,null,null,null,null,null,null,null,null,471722]
[null,null,null,null,null,null,null,null,null,null,null,null,null,null,null,null,null,null,null,null,null,null,null,null,null,null,null,null,null,null,null,null,null,null,null,null,null,null,null,null,null,null,null,null,null,null,471822]
[null,null,null,null,null,null,null,null,null,null,null,null,null,null,null,null,null,null,null,null,null,null,null,null,null,null,null,null,null,null,null,null,null,null,null,null,null,null,null,null,null,null,null,null,null,null,472022]
[null,null,null,null,null,null,null,null,null,null,null,null,null,null,null,null,null,null,null,null,null,null,null,null,null,null,null,null,null,null,null,null,null,null,null,null,null,null,null,null,null,null,null,null,null,null,472222]
[null,null,null,null,null,null,null,null,null,null,null,null,null,null,null,null,null,null,null,null,null,null,null,null,null,null,null,null,null,null,null,null,null,null,null,null,null,null,null,null,null,null,null,null,null,null,472422]
[null,null,null,null,null,null,null,null,null,null,null,null,null,null,null,null,null,null,null,null,null,null,null,null,null,null,null,null,null,null,null,null,null,null,null,null,null,null,null,null,null,null,null,null,null,null,472522]
[null,null,null,null,null,null,null,null,null,null,null,null,null,null,null,null,null,null,null,null,null,null,null,null,null,null,null,null,null,null,null,null,null,null,null,null,null,null,null,null,null,null,null,null,null,null,472622]
[null,null,null,null,null,null,null,null,null,null,null,null,null,null,null,null,null,null,null,null,null,null,null,null,null,null,null,null,null,null,null,null,null,null,null,null,null,null,null,null,null,null,null,null,null,null,480152]
[null,null,null,null,null,null,null,null,null,null,null,null,null,null,null,null,null,null,null,null,null,null,null,null,null,null,null,null,null,null,null,null,null,null,null,null,null,null,null,null,null,null,null,null,null,null,480452]
[null,null,null,null,null,null,null,null,null,null,null,null,null,null,null,null,null,null,null,null,null,null,null,null,null,null,null,null,null,null,null,null,null,null,null,null,null,null,null,null,null,null,null,null,null,null,490162]
[null,null,null,null,null,null,null,null,null,null,null,null,null,null,null,null,null,null,null,null,null,null,null,null,null,null,null,null,null,null,null,null,null,null,null,null,null,null,null,null,null,null,null,null,null,null,490262]
[null,null,null,null,null,null,null,null,null,null,null,null,null,null,null,null,null,null,null,null,null,null,null,null,null,null,null,null,null,null,null,null,null,null,null,null,null,null,null,null,null,null,null,null,null,null,500142]
[null,null,null,null,null,null,null,null,null,null,null,null,null,null,null,null,null,null,null,null,null,null,null,null,null,null,null,null,null,null,null,null,null,null,null,null,null,null,null,null,null,null,null,null,null,null,500242]
[null,null,null,null,null,null,null,null,null,null,null,null,null,null,null,null,null,null,null,null,null,null,null,null,null,null,null,null,null,null,null,null,null,null,null,null,null,null,null,null,null,null,null,null,null,null,500342]
[null,null,null,null,null,null,null,null,null,null,null,null,null,null,null,null,null,null,null,null,null,null,null,null,null,null,null,null,null,null,null,null,null,null,null,null,null,null,null,null,null,null,null,null,null,null,510142]
[null,null,null,null,null,null,null,null,null,null,null,null,null,null,null,null,null,null,null,null,null,null,null,null,null,null,null,null,null,null,null,null,null,null,null,null,null,null,null,null,null,null,null,null,null,null,520242]
[null,null,null,null,null,null,null,null,null,null,null,null,null,null,null,null,null,null,null,null,null,null,null,null,null,null,null,null,null,null,null,null,null,null,null,null,null,null,null,null,null,null,null,null,null,null,520342]
[null,null,null,null,null,null,null,null,null,null,null,null,null,null,null,null,null,null,null,null,null,null,null,null,null,null,null,null,null,null,null,null,null,null,null,null,null,null,null,null,null,null,null,null,null,null,530122]
[null,null,null,null,null,null,null,null,null,null,null,null,null,null,null,null,null,null,null,null,null,null,null,null,null,null,null,null,null,null,null,null,null,null,null,null,null,null,null,null,null,null,null,null,null,null,530222]
[null,null,null,null,null,null,null,null,null,null,null,null,null,null,null,null,null,null,null,null,null,null,null,null,null,null,null,null,null,null,null,null,null,null,null,null,null,null,null,null,null,null,null,null,null,null,540132]
[null,null,null,null,null,null,null,null,null,null,null,null,null,null,null,null,null,null,null,null,null,null,null,null,null,null,null,null,null,null,null,null,null,null,null,null,null,null,null,null,null,null,null,null,null,null,540232]
[null,null,null,null,null,null,null,null,null,null,null,null,null,null,null,null,null,null,null,null,null,null,null,null,null,null,null,null,null,null,null,null,null,null,null,null,null,null,null,null,null,null,null,null,null,null,540332]
[null,null,null,null,null,null,null,null,null,null,null,null,null,null,null,null,null,null,null,null,null,null,null,null,null,null,null,null,null,null,null,null,null,null,null,null,null,null,null,null,null,null,null,null,null,null,540432]
[null,null,null,null,null,null,null,null,null,null,null,null,null,null,null,null,null,null,null,null,null,null,null,null,null,null,null,null,null,null,null,null,null,null,null,null,null,null,null,null,null,null,null,null,null,null,550152]
[null,null,null,null,null,null,null,null,null,null,null,null,null,null,null,null,null,null,null,null,null,null,null,null,null,null,null,null,null,null,null,null,null,null,null,null,null,null,null,null,null,null,null,null,null,null,550352]
[null,null,null,null,null,null,null,null,null,null,null,null,null,null,null,null,null,null,null,null,null,null,null,null,null,null,null,null,null,null,null,null,null,null,null,null,null,null,null,null,null,null,null,null,null,null,560142]
[null,null,null,null,null,null,null,null,null,null,null,null,null,null,null,null,null,null,null,null,null,null,null,null,null,null,null,null,null,null,null,null,null,null,null,null,null,null,null,null,null,null,null,null,null,null,560242]
[null,null,null,null,null,null,null,null,null,null,null,null,null,null,null,null,null,null,null,null,null,null,null,null,null,null,null,null,null,null,null,null,null,null,null,null,null,null,null,null,null,null,null,null,null,null,570252]
[null,null,null,null,null,null,null,null,null,null,null,null,null,null,null,null,null,null,null,null,null,null,null,null,null,null,null,null,null,null,null,null,null,null,null,null,null,null,null,null,null,null,null,null,null,null,570452]
[null,null,null,null,null,null,null,null,null,null,null,null,null,null,null,null,null,null,null,null,null,null,null,null,null,null,null,null,null,null,null,null,null,null,null,null,null,null,null,null,null,null,null,null,null,null,570552]
[null,null,null,null,null,null,null,null,null,null,null,null,null,null,null,null,null,null,null,null,null,null,null,null,null,null,null,null,null,null,null,null,null,null,null,null,null,null,null,null,null,null,null,null,null,null,570652]
[null,null,null,null,null,null,null,null,null,null,null,null,null,null,null,null,null,null,null,null,null,null,null,null,null,null,null,null,null,null,null,null,null,null,null,null,null,null,null,null,null,null,null,null,null,null,571352]
[null,null,null,null,null,null,null,null,null,null,null,null,null,null,null,null,null,null,null,null,null,null,null,null,null,null,null,null,null,null,null,null,null,null,null,null,null,null,null,null,null,null,null,null,null,null,571452]
[null,null,null,null,null,null,null,null,null,null,null,null,null,null,null,null,null,null,null,null,null,null,null,null,null,null,null,null,null,null,null,null,null,null,null,null,null,null,null,null,null,null,null,null,null,null,580132]
[null,null,null,null,null,null,null,null,null,null,null,null,null,null,null,null,null,null,null,null,null,null,null,null,null,null,null,null,null,null,null,null,null,null,null,null,null,null,null,null,null,null,null,null,null,null,590142]
[null,null,null,null,null,null,null,null,null,null,null,null,null,null,null,null,null,null,null,null,null,null,null,null,null,null,null,null,null,null,null,null,null,null,null,null,null,null,null,null,null,null,null,null,null,null,590242]
[null,null,null,null,null,null,null,null,null,null,null,null,null,null,null,null,null,null,null,null,null,null,null,null,null,null,null,null,null,null,null,null,null,null,null,null,null,null,null,null,null,null,null,null,null,null,600142]
[null,null,null,null,null,null,null,null,null,null,null,null,null,null,null,null,null,null,null,null,null,null,null,null,null,null,null,null,null,null,null,null,null,null,null,null,null,null,null,null,null,null,null,null,null,null,600242]
[null,null,null,null,null,null,null,null,null,null,null,null,null,null,null,null,null,null,null,null,null,null,null,null,null,null,null,null,null,null,null,null,null,null,null,null,null,null,null,null,null,null,null,null,null,null,600342]
[null,null,null,null,null,null,null,null,null,null,null,null,null,null,null,null,null,null,null,null,null,null,null,null,null,null,null,null,null,null,null,null,null,null,null,null,null,null,null,null,null,null,null,null,null,null,600442]
[null,null,null,null,null,null,null,null,null,null,null,null,null,null,null,null,null,null,null,null,null,null,null,null,null,null,null,null,null,null,null,null,null,null,null,null,null,null,null,null,null,null,null,null,null,null,600542]
[null,null,null,null,null,null,null,null,null,null,null,null,null,null,null,null,null,null,null,null,null,null,null,null,null,null,null,null,null,null,null,null,null,null,null,null,null,null,null,null,null,null,null,null,null,null,600642]
[null,null,null,null,null,null,null,null,null,null,null,null,null,null,null,null,null,null,null,null,null,null,null,null,null,null,null,null,null,null,null,null,null,null,null,null,null,null,null,null,null,null,null,null,null,null,600742]
[null,null,null,null,null,null,null,null,null,null,null,null,null,null,null,null,null,null,null,null,null,null,null,null,null,null,null,null,null,null,null,null,null,null,null,null,null,null,null,null,null,null,null,null,null,null,600842]
[null,null,null,null,null,null,null,null,null,null,null,null,null,null,null,null,null,null,null,null,null,null,null,null,null,null,null,null,null,null,null,null,null,null,null,null,null,null,null,null,null,null,null,null,null,null,610132]
[null,null,null,null,null,null,null,null,null,null,null,null,null,null,null,null,null,null,null,null,null,null,null,null,null,null,null,null,null,null,null,null,null,null,null,null,null,null,null,null,null,null,null,null,null,null,620122]
[null,null,null,null,null,null,null,null,null,null,null,null,null,null,null,null,null,null,null,null,null,null,null,null,null,null,null,null,null,null,null,null,null,null,null,null,null,null,null,null,null,null,null,null,null,null,620222]
[null,null,null,null,null,null,null,null,null,null,null,null,null,null,null,null,null,null,null,null,null,null,null,null,null,null,null,null,null,null,null,null,null,null,null,null,null,null,null,null,null,null,null,null,null,null,620322]
[null,null,null,null,null,null,null,null,null,null,null,null,null,null,null,null,null,null,null,null,null,null,null,null,null,null,null,null,null,null,null,null,null,null,null,null,null,null,null,null,null,null,null,null,null,null,630142]
[null,null,null,null,null,null,null,null,null,null,null,null,null,null,null,null,null,null,null,null,null,null,null,null,null,null,null,null,null,null,null,null,null,null,null,null,null,null,null,null,null,null,null,null,null,null,630242]
[null,null,null,null,null,null,null,null,null,null,null,null,null,null,null,null,null,null,null,null,null,null,null,null,null,null,null,null,null,null,null,null,null,null,null,null,null,null,null,null,null,null,null,null,null,null,630342]
[null,null,null,null,null,null,null,null,null,null,null,null,null,null,null,null,null,null,null,null,null,null,null,null,null,null,null,null,null,null,null,null,null,null,null,null,null,null,null,null,null,null,null,null,null,null,630442]
[null,null,null,null,null,null,null,null,null,null,null,null,null,null,null,null,null,null,null,null,null,null,null,null,null,null,null,null,null,null,null,null,null,null,null,null,null,null,null,null,null,null,null,null,null,null,630542]
[null,null,null,null,null,null,null,null,null,null,null,null,null,null,null,null,null,null,null,null,null,null,null,null,null,null,null,null,null,null,null,null,null,null,null,null,null,null,null,null,null,null,null,null,null,null,630642]
[null,null,null,null,null,null,null,null,null,null,null,null,null,null,null,null,null,null,null,null,null,null,null,null,null,null,null,null,null,null,null,null,null,null,null,null,null,null,null,null,null,null,null,null,null,null,640142]
[null,null,null,null,null,null,null,null,null,null,null,null,null,null,null,null,null,null,null,null,null,null,null,null,null,null,null,null,null,null,null,null,null,null,null,null,null,null,null,null,null,null,null,null,null,null,650122]
[null,null,null,null,null,null,null,null,null,null,null,null,null,null,null,null,null,null,null,null,null,null,null,null,null,null,null,null,null,null,null,null,null,null,null,null,null,null,null,null,null,null,null,null,null,null,660252]
[null,null,null,null,null,null,null,null,null,null,null,null,null,null,null,null,null,null,null,null,null,null,null,null,null,null,null,null,null,null,null,null,null,null,null,null,null,null,null,null,null,null,null,null,null,null,660352]
[null,null,null,null,null,null,null,null,null,null,null,null,null,null,null,null,null,null,null,null,null,null,null,null,null,null,null,null,null,null,null,null,null,null,null,null,null,null,null,null,null,null,null,null,null,null,660452]
[null,null,null,null,null,null,null,null,null,null,null,null,null,null,null,null,null,null,null,null,null,null,null,null,null,null,null,null,null,null,null,null,null,null,null,null,null,null,null,null,null,null,null,null,null,null,670142]
[null,null,null,null,null,null,null,null,null,null,null,null,null,null,null,null,null,null,null,null,null,null,null,null,null,null,null,null,null,null,null,null,null,null,null,null,null,null,null,null,null,null,null,null,null,null,680142]
[null,null,null,null,null,null,null,null,null,null,null,null,null,null,null,null,null,null,null,null,null,null,null,null,null,null,null,null,null,null,null,null,null,null,null,null,null,null,null,null,null,null,null,null,null,null,690142]
[null,null,null,null,null,null,null,null,null,null,null,null,null,null,null,null,null,null,null,null,null,null,null,null,null,null,null,null,null,null,null,null,null,null,null,null,null,null,null,null,null,null,null,null,null,null,700232]
[null,null,null,null,null,null,null,null,null,null,null,null,null,null,null,null,null,null,null,null,null,null,null,null,null,null,null,null,null,null,null,null,null,null,null,null,null,null,null,null,null,null,null,null,null,null,710242]
[null,null,null,null,null,null,null,null,null,null,null,null,null,null,null,null,null,null,null,null,null,null,null,null,null,null,null,null,null,null,null,null,null,null,null,null,null,null,null,null,null,null,null,null,null,null,710342]
[null,null,null,null,null,null,null,null,null,null,null,null,null,null,null,null,null,null,null,null,null,null,null,null,null,null,null,null,null,null,null,null,null,null,null,null,null,null,null,null,null,null,null,null,null,null,710442]
[null,null,null,null,null,null,null,null,null,null,null,null,null,null,null,null,null,null,null,null,null,null,null,null,null,null,null,null,null,null,null,null,null,null,null,null,null,null,null,null,null,null,null,null,null,null,710542]
[null,null,null,null,null,null,null,null,null,null,null,null,null,null,null,null,null,null,null,null,null,null,null,null,null,null,null,null,null,null,null,null,null,null,null,null,null,null,null,null,null,null,null,null,null,null,720232]
[null,null,null,null,null,null,null,null,null,null,null,null,null,null,null,null,null,null,null,null,null,null,null,null,null,null,null,null,null,null,null,null,null,null,null,null,null,null,null,null,null,null,null,null,null,null,720332]
[null,null,null,null,null,null,null,null,null,null,null,null,null,null,null,null,null,null,null,null,null,null,null,null,null,null,null,null,null,null,null,null,null,null,null,null,null,null,null,null,null,null,null,null,null,null,720532]
[null,null,null,null,null,null,null,null,null,null,null,null,null,null,null,null,null,null,null,null,null,null,null,null,null,null,null,null,null,null,null,null,null,null,null,null,null,null,null,null,null,null,null,null,null,null,730122]
[null,null,null,null,null,null,null,null,null,null,null,null,null,null,null,null,null,null,null,null,null,null,null,null,null,null,null,null,null,null,null,null,null,null,null,null,null,null,null,null,null,null,null,null,null,null,730222]
[null,null,null,null,null,null,null,null,null,null,null,null,null,null,null,null,null,null,null,null,null,null,null,null,null,null,null,null,null,null,null,null,null,null,null,null,null,null,null,null,null,null,null,null,null,null,730322]
[null,null,null,null,null,null,null,null,null,null,null,null,null,null,null,null,null,null,null,null,null,null,null,null,null,null,null,null,null,null,null,null,null,null,null,null,null,null,null,null,null,null,null,null,null,null,740142]
[null,null,null,null,null,null,null,null,null,null,null,null,null,null,null,null,null,null,null,null,null,null,null,null,null,null,null,null,null,null,null,null,null,null,null,null,null,null,null,null,null,null,null,null,null,null,740242]
[null,null,null,null,null,null,null,null,null,null,null,null,null,null,null,null,null,null,null,null,null,null,null,null,null,null,null,null,null,null,null,null,null,null,null,null,null,null,null,null,null,null,null,null,null,null,740342]
[null,null,null,null,null,null,null,null,null,null,null,null,null,null,null,null,null,null,null,null,null,null,null,null,null,null,null,null,null,null,null,null,null,null,null,null,null,null,null,null,null,null,null,null,null,null,740442]
[null,null,null,null,null,null,null,null,null,null,null,null,null,null,null,null,null,null,null,null,null,null,null,null,null,null,null,null,null,null,null,null,null,null,null,null,null,null,null,null,null,null,null,null,null,null,740452]
[null,null,null,null,null,null,null,null,null,null,null,null,null,null,null,null,null,null,null,null,null,null,null,null,null,null,null,null,null,null,null,null,null,null,null,null,null,null,null,null,null,null,null,null,null,null,750142]
[null,null,null,null,null,null,null,null,null,null,null,null,null,null,null,null,null,null,null,null,null,null,null,null,null,null,null,null,null,null,null,null,null,null,null,null,null,null,null,null,null,null,null,null,null,null,750442]
[null,null,null,null,null,null,null,null,null,null,null,null,null,null,null,null,null,null,null,null,null,null,null,null,null,null,null,null,null,null,null,null,null,null,null,null,null,null,null,null,null,null,null,null,null,null,750642]
[null,null,null,null,null,null,null,null,null,null,null,null,null,null,null,null,null,null,null,null,null,null,null,null,null,null,null,null,null,null,null,null,null,null,null,null,null,null,null,null,null,null,null,null,null,null,750742]
[null,null,null,null,null,null,null,null,null,null,null,null,null,null,null,null,null,null,null,null,null,null,null,null,null,null,null,null,null,null,null,null,null,null,null,null,null,null,null,null,null,null,null,null,null,null,751042]
[null,null,null,null,null,null,null,null,null,null,null,null,null,null,null,null,null,null,null,null,null,null,null,null,null,null,null,null,null,null,null,null,null,null,null,null,null,null,null,null,null,null,null,null,null,null,751242]
[null,null,null,null,null,null,null,null,null,null,null,null,null,null,null,null,null,null,null,null,null,null,null,null,null,null,null,null,null,null,null,null,null,null,null,null,null,null,null,null,null,null,null,null,null,null,751342]
[null,null,null,null,null,null,null,null,null,null,null,null,null,null,null,null,null,null,null,null,null,null,null,null,null,null,null,null,null,null,null,null,null,null,null,null,null,null,null,null,null,null,null,null,null,null,751442]
[null,null,null,null,null,null,null,null,null,null,null,null,null,null,null,null,null,null,null,null,null,null,null,null,null,null,null,null,null,null,null,null,null,null,null,null,null,null,null,null,null,null,null,null,null,null,751542]
[null,null,null,null,null,null,null,null,null,null,null,null,null,null,null,null,null,null,null,null,null,null,null,null,null,null,null,null,null,null,null,null,null,null,null,null,null,null,null,null,null,null,null,null,null,null,760122]
[null,null,null,null,null,null,null,null,null,null,null,null,null,null,null,null,null,null,null,null,null,null,null,null,null,null,null,null,null,null,null,null,null,null,null,null,null,null,null,null,null,null,null,null,null,null,760222]
[null,null,null,null,null,null,null,null,null,null,null,null,null,null,null,null,null,null,null,null,null,null,null,null,null,null,null,null,null,null,null,null,null,null,null,null,null,null,null,null,null,null,null,null,null,null,770132]
[null,null,null,null,null,null,null,null,null,null,null,null,null,null,null,null,null,null,null,null,null,null,null,null,null,null,null,null,null,null,null,null,null,null,null,null,null,null,null,null,null,null,null,null,null,null,780122]
[null,null,null,null,null,null,null,null,null,null,null,null,null,null,null,null,null,null,null,null,null,null,null,null,null,null,null,null,null,null,null,null,null,null,null,null,null,null,null,null,null,null,null,null,null,null,780222]
[null,null,null,null,null,null,null,null,null,null,null,null,null,null,null,null,null,null,null,null,null,null,null,null,null,null,null,null,null,null,null,null,null,null,null,null,null,null,null,null,null,null,null,null,null,null,780322]
[null,null,null,null,null,null,null,null,null,null,null,null,null,null,null,null,null,null,null,null,null,null,null,null,null,null,null,null,null,null,null,null,null,null,null,null,null,null,null,null,null,null,null,null,null,null,790162]
[null,null,null,null,null,null,null,null,null,null,null,null,null,null,null,null,null,null,null,null,null,null,null,null,null,null,null,null,null,null,null,null,null,null,null,null,null,null,null,null,null,null,null,null,null,null,790262]
[null,null,null,null,null,null,null,null,null,null,null,null,null,null,null,null,null,null,null,null,null,null,null,null,null,null,null,null,null,null,null,null,null,null,null,null,null,null,null,null,null,null,null,null,null,null,790462]
[null,null,null,null,null,null,null,null,null,null,null,null,null,null,null,null,null,null,null,null,null,null,null,null,null,null,null,null,null,null,null,null,null,null,null,null,null,null,null,null,null,null,null,null,null,null,790562]
[null,null,null,null,null,null,null,null,null,null,null,null,null,null,null,null,null,null,null,null,null,null,null,null,null,null,null,null,null,null,null,null,null,null,null,null,null,null,null,null,null,null,null,null,null,null,790762]
[null,null,null,null,null,null,null,null,null,null,null,null,null,null,null,null,null,null,null,null,null,null,null,null,null,null,null,null,null,null,null,null,null,null,null,null,null,null,null,null,null,null,null,null,null,null,790962]
[null,null,null,null,null,null,null,null,null,null,null,null,null,null,null,null,null,null,null,null,null,null,null,null,null,null,null,null,null,null,null,null,null,null,null,null,null,null,null,null,null,null,null,null,null,null,791462]
[null,null,null,null,null,null,null,null,null,null,null,null,null,null,null,null,null,null,null,null,null,null,null,null,null,null,null,null,null,null,null,null,null,null,null,null,null,null,null,null,null,null,null,null,null,null,791562]
[null,null,null,null,null,null,null,null,null,null,null,null,null,null,null,null,null,null,null,null,null,null,null,null,null,null,null,null,null,null,null,null,null,null,null,null,null,null,null,null,null,null,null,null,null,null,791762]
[null,null,null,null,null,null,null,null,null,null,null,null,null,null,null,null,null,null,null,null,null,null,null,null,null,null,null,null,null,null,null,null,null,null,null,null,null,null,null,null,null,null,null,null,null,null,792162]
[null,null,null,null,null,null,null,null,null,null,null,null,null,null,null,null,null,null,null,null,null,null,null,null,null,null,null,null,null,null,null,null,null,null,null,null,null,null,null,null,null,null,null,null,null,null,792262]
[null,null,null,null,null,null,null,null,null,null,null,null,null,null,null,null,null,null,null,null,null,null,null,null,null,null,null,null,null,null,null,null,null,null,null,null,null,null,null,null,null,null,null,null,null,null,792662]
[null,null,null,null,null,null,null,null,null,null,null,null,null,null,null,null,null,null,null,null,null,null,null,null,null,null,null,null,null,null,null,null,null,null,null,null,null,null,null,null,null,null,null,null,null,null,792862]
[null,null,null,null,null,null,null,null,null,null,null,null,null,null,null,null,null,null,null,null,null,null,null,null,null,null,null,null,null,null,null,null,null,null,null,null,null,null,null,null,null,null,null,null,null,null,793062]
[null,null,null,null,null,null,null,null,null,null,null,null,null,null,null,null,null,null,null,null,null,null,null,null,null,null,null,null,null,null,null,null,null,null,null,null,null,null,null,null,null,null,null,null,null,null,793162]
[null,null,null,null,null,null,null,null,null,null,null,null,null,null,null,null,null,null,null,null,null,null,null,null,null,null,null,null,null,null,null,null,null,null,null,null,null,null,null,null,null,null,null,null,null,null,793262]
[null,null,null,null,null,null,null,null,null,null,null,null,null,null,null,null,null,null,null,null,null,null,null,null,null,null,null,null,null,null,null,null,null,null,null,null,null,null,null,null,null,null,null,null,null,null,793362]
[null,null,null,null,null,null,null,null,null,null,null,null,null,null,null,null,null,null,null,null,null,null,null,null,null,null,null,null,null,null,null,null,null,null,null,null,null,null,null,null,null,null,null,null,null,null,793462]
[null,null,null,null,null,null,null,null,null,null,null,null,null,null,null,null,null,null,null,null,null,null,null,null,null,null,null,null,null,null,null,null,null,null,null,null,null,null,null,null,null,null,null,null,null,null,793662]
[null,null,null,null,null,null,null,null,null,null,null,null,null,null,null,null,null,null,null,null,null,null,null,null,null,null,null,null,null,null,null,null,null,null,null,null,null,null,null,null,null,null,null,null,null,null,793762]
[null,null,null,null,null,null,null,null,null,null,null,null,null,null,null,null,null,null,null,null,null,null,null,null,null,null,null,null,null,null,null,null,null,null,null,null,null,null,null,null,null,null,null,null,null,null,793962]
[null,null,null,null,null,null,null,null,null,null,null,null,null,null,null,null,null,null,null,null,null,null,null,null,null,null,null,null,null,null,null,null,null,null,null,null,null,null,null,null,null,null,null,null,null,null,794062]
[null,null,null,null,null,null,null,null,null,null,null,null,null,null,null,null,null,null,null,null,null,null,null,null,null,null,null,null,null,null,null,null,null,null,null,null,null,null,null,null,null,null,null,null,null,null,794162]
[null,null,null,null,null,null,null,null,null,null,null,null,null,null,null,null,null,null,null,null,null,null,null,null,null,null,null,null,null,null,null,null,null,null,null,null,null,null,null,null,null,null,null,null,null,null,794262]
[null,null,null,null,null,null,null,null,null,null,null,null,null,null,null,null,null,null,null,null,null,null,null,null,null,null,null,null,null,null,null,null,null,null,null,null,null,null,null,null,null,null,null,null,null,null,794362]
[null,null,null,null,null,null,null,null,null,null,null,null,null,null,null,null,null,null,null,null,null,null,null,null,null,null,null,null,null,null,null,null,null,null,null,null,null,null,null,null,null,null,null,null,null,null,794462]
[null,null,null,null,null,null,null,null,null,null,null,null,null,null,null,null,null,null,null,null,null,null,null,null,null,null,null,null,null,null,null,null,null,null,null,null,null,null,null,null,null,null,null,null,null,null,794662]
[null,null,null,null,null,null,null,null,null,null,null,null,null,null,null,null,null,null,null,null,null,null,null,null,null,null,null,null,null,null,null,null,null,null,null,null,null,null,null,null,null,null,null,null,null,null,794862]
[null,null,null,null,null,null,null,null,null,null,null,null,null,null,null,null,null,null,null,null,null,null,null,null,null,null,null,null,null,null,null,null,null,null,null,null,null,null,null,null,null,null,null,null,null,null,794962]
[null,null,null,null,null,null,null,null,null,null,null,null,null,null,null,null,null,null,null,null,null,null,null,null,null,null,null,null,null,null,null,null,null,null,null,null,null,null,null,null,null,null,null,null,null,null,795062]
[null,null,null,null,null,null,null,null,null,null,null,null,null,null,null,null,null,null,null,null,null,null,null,null,null,null,null,null,null,null,null,null,null,null,null,null,null,null,null,null,null,null,null,null,null,null,795162]
[null,null,null,null,null,null,null,null,null,null,null,null,null,null,null,null,null,null,null,null,null,null,null,null,null,null,null,null,null,null,null,null,null,null,null,null,null,null,null,null,null,null,null,null,null,null,795222]
[null,null,null,null,null,null,null,null,null,null,null,null,null,null,null,null,null,null,null,null,null,null,null,null,null,null,null,null,null,null,null,null,null,null,null,null,null,null,null,null,null,null,null,null,null,null,795262]
[null,null,null,null,null,null,null,null,null,null,null,null,null,null,null,null,null,null,null,null,null,null,null,null,null,null,null,null,null,null,null,null,null,null,null,null,null,null,null,null,null,null,null,null,null,null,795362]
[null,null,null,null,null,null,null,null,null,null,null,null,null,null,null,null,null,null,null,null,null,null,null,null,null,null,null,null,null,null,null,null,null,null,null,null,null,null,null,null,null,null,null,null,null,null,800142]
[null,null,null,null,null,null,null,null,null,null,null,null,null,null,null,null,null,null,null,null,null,null,null,null,null,null,null,null,null,null,null,null,null,null,null,null,null,null,null,null,null,null,null,null,null,null,810142]
[null,null,null,null,null,null,null,null,null,null,null,null,null,null,null,null,null,null,null,null,null,null,null,null,null,null,null,null,null,null,null,null,null,null,null,null,null,null,null,null,null,null,null,null,null,null,820112]
[null,null,null,null,null,null,null,null,null,null,null,null,null,null,null,null,null,null,null,null,null,null,null,null,null,null,null,null,null,null,null,null,null,null,null,null,null,null,null,null,null,null,null,null,null,null,820212]
[null,null,null,null,null,null,null,null,null,null,null,null,null,null,null,null,null,null,null,null,null,null,null,null,null,null,null,null,null,null,null,null,null,null,null,null,null,null,null,null,null,null,null,null,null,null,820412]
[null,null,null,null,null,null,null,null,null,null,null,null,null,null,null,null,null,null,null,null,null,null,null,null,null,null,null,null,null,null,null,null,null,null,null,null,null,null,null,null,null,null,null,null,null,null,820512]
[null,null,null,null,null,null,null,null,null,null,null,null,null,null,null,null,null,null,null,null,null,null,null,null,null,null,null,null,null,null,null,null,null,null,null,null,null,null,null,null,null,null,null,null,null,null,820612]
[null,null,null,null,null,null,null,null,null,null,null,null,null,null,null,null,null,null,null,null,null,null,null,null,null,null,null,null,null,null,null,null,null,null,null,null,null,null,null,null,null,null,null,null,null,null,820712]
[null,null,null,null,null,null,null,null,null,null,null,null,null,null,null,null,null,null,null,null,null,null,null,null,null,null,null,null,null,null,null,null,null,null,null,null,null,null,null,null,null,null,null,null,null,null,821012]
[null,null,null,null,null,null,null,null,null,null,null,null,null,null,null,null,null,null,null,null,null,null,null,null,null,null,null,null,null,null,null,null,null,null,null,null,null,null,null,null,null,null,null,null,null,null,821112]
[null,null,null,null,null,null,null,null,null,null,null,null,null,null,null,null,null,null,null,null,null,null,null,null,null,null,null,null,null,null,null,null,null,null,null,null,null,null,null,null,null,null,null,null,null,null,830242]
[null,null,null,null,null,null,null,null,null,null,null,null,null,null,null,null,null,null,null,null,null,null,null,null,null,null,null,null,null,null,null,null,null,null,null,null,null,null,null,null,null,null,null,null,null,null,830442]
[null,null,null,null,null,null,null,null,null,null,null,null,null,null,null,null,null,null,null,null,null,null,null,null,null,null,null,null,null,null,null,null,null,null,null,null,null,null,null,null,null,null,null,null,null,null,830642]
[null,null,null,null,null,null,null,null,null,null,null,null,null,null,null,null,null,null,null,null,null,null,null,null,null,null,null,null,null,null,null,null,null,null,null,null,null,null,null,null,null,null,null,null,null,null,830742]
[null,null,null,null,null,null,null,null,null,null,null,null,null,null,null,null,null,null,null,null,null,null,null,null,null,null,null,null,null,null,null,null,null,null,null,null,null,null,null,null,null,null,null,null,null,null,830756]
[null,null,null,null,null,null,null,null,null,null,null,null,null,null,null,null,null,null,null,null,null,null,null,null,null,null,null,null,null,null,null,null,null,null,null,null,null,null,null,null,null,null,null,null,null,null,831242]
[null,null,null,null,null,null,null,null,null,null,null,null,null,null,null,null,null,null,null,null,null,null,null,null,null,null,null,null,null,null,null,null,null,null,null,null,null,null,null,null,null,null,null,null,null,null,840162]
[null,null,null,null,null,null,null,null,null,null,null,null,null,null,null,null,null,null,null,null,null,null,null,null,null,null,null,null,null,null,null,null,null,null,null,null,null,null,null,null,null,null,null,null,null,null,840362]
[null,null,null,null,null,null,null,null,null,null,null,null,null,null,null,null,null,null,null,null,null,null,null,null,null,null,null,null,null,null,null,null,null,null,null,null,null,null,null,null,null,null,null,null,null,null,850142]
[null,null,null,null,null,null,null,null,null,null,null,null,null,null,null,null,null,null,null,null,null,null,null,null,null,null,null,null,null,null,null,null,null,null,null,null,null,null,null,null,null,null,null,null,null,null,860112]
[null,null,null,null,null,null,null,null,null,null,null,null,null,null,null,null,null,null,null,null,null,null,null,null,null,null,null,null,null,null,null,null,null,null,null,null,null,null,null,null,null,null,null,null,null,null,860212]
[null,null,null,null,null,null,null,null,null,null,null,null,null,null,null,null,null,null,null,null,null,null,null,null,null,null,null,null,null,null,null,null,null,null,null,null,null,null,null,null,null,null,null,null,null,null,860312]
[null,null,null,null,null,null,null,null,null,null,null,null,null,null,null,null,null,null,null,null,null,null,null,null,null,null,null,null,null,null,null,null,null,null,null,null,null,null,null,null,null,null,null,null,null,null,870122]
[null,null,null,null,null,null,null,null,null,null,null,null,null,null,null,null,null,null,null,null,null,null,null,null,null,null,null,null,null,null,null,null,null,null,null,null,null,null,null,null,null,null,null,null,null,null,880542]
[null,null,null,null,null,null,null,null,null,null,null,null,null,null,null,null,null,null,null,null,null,null,null,null,null,null,null,null,null,null,null,null,null,null,null,null,null,null,null,null,null,null,null,null,null,null,890242]
[null,null,null,null,null,null,null,null,null,null,null,null,null,null,null,null,null,null,null,null,null,null,null,null,null,null,null,null,null,null,null,null,null,null,null,null,null,null,null,null,null,null,null,null,null,null,890342]
[null,null,null,null,null,null,null,null,null,null,null,null,null,null,null,null,null,null,null,null,null,null,null,null,null,null,null,null,null,null,null,null,null,null,null,null,null,null,null,null,null,null,null,null,null,null,900112]
[null,null,null,null,null,null,null,null,null,null,null,null,null,null,null,null,null,null,null,null,null,null,null,null,null,null,null,null,null,null,null,null,null,null,null,null,null,null,null,null,null,null,null,null,null,null,900212]
[null,null,null,null,null,null,null,null,null,null,null,null,null,null,null,null,null,null,null,null,null,null,null,null,null,null,null,null,null,null,null,null,null,null,null,null,null,null,null,null,null,null,null,null,null,null,900312]
[null,null,null,null,null,null,null,null,null,null,null,null,null,null,null,null,null,null,null,null,null,null,null,null,null,null,null,null,null,null,null,null,null,null,null,null,null,null,null,null,null,null,null,null,null,null,900512]
[null,null,null,null,null,null,null,null,null,null,null,null,null,null,null,null,null,null,null,null,null,null,null,null,null,null,null,null,null,null,null,null,null,null,null,null,null,null,null,null,null,null,null,null,null,null,900712]
[null,null,null,null,null,null,null,null,null,null,null,null,null,null,null,null,null,null,null,null,null,null,null,null,null,null,null,null,null,null,null,null,null,null,null,null,null,null,null,null,null,null,null,null,null,null,901012]
[null,null,null,null,null,null,null,null,null,null,null,null,null,null,null,null,null,null,null,null,null,null,null,null,null,null,null,null,null,null,null,null,null,null,null,null,null,null,null,null,null,null,null,null,null,null,901112]
[null,null,null,null,null,null,null,null,null,null,null,null,null,null,null,null,null,null,null,null,null,null,null,null,null,null,null,null,null,null,null,null,null,null,null,null,null,null,null,null,null,null,null,null,null,null,901212]
[null,null,null,null,null,null,null,null,null,null,null,null,null,null,null,null,null,null,null,null,null,null,null,null,null,null,null,null,null,null,null,null,null,null,null,null,null,null,null,null,null,null,null,null,null,null,901312]
[null,null,null,null,null,null,null,null,null,null,null,null,null,null,null,null,null,null,null,null,null,null,null,null,null,null,null,null,null,null,null,null,null,null,null,null,null,null,null,null,null,null,null,null,null,null,901412]
[null,null,null,null,null,null,null,null,null,null,null,null,null,null,null,null,null,null,null,null,null,null,null,null,null,null,null,null,null,null,null,null,null,null,null,null,null,null,null,null,null,null,null,null,null,null,910142]
[null,null,null,null,null,null,null,null,null,null,null,null,null,null,null,null,null,null,null,null,null,null,null,null,null,null,null,null,null,null,null,null,null,null,null,null,null,null,null,null,null,null,null,null,null,null,910242]
[null,null,null,null,null,null,null,null,null,null,null,null,null,null,null,null,null,null,null,null,null,null,null,null,null,null,null,null,null,null,null,null,null,null,null,null,null,null,null,null,null,null,null,null,null,null,920152]
[null,null,null,null,null,null,null,null,null,null,null,null,null,null,null,null,null,null,null,null,null,null,null,null,null,null,null,null,null,null,null,null,null,null,null,null,null,null,null,null,null,null,null,null,null,null,920252]
[null,null,null,null,null,null,null,null,null,null,null,null,null,null,null,null,null,null,null,null,null,null,null,null,null,null,null,null,null,null,null,null,null,null,null,null,null,null,null,null,null,null,null,null,null,null,920352]
[null,null,null,null,null,null,null,null,null,null,null,null,null,null,null,null,null,null,null,null,null,null,null,null,null,null,null,null,null,null,null,null,null,null,null,null,null,null,null,null,null,null,null,null,null,null,920552]
[null,null,null,null,null,null,null,null,null,null,null,null,null,null,null,null,null,null,null,null,null,null,null,null,null,null,null,null,null,null,null,null,null,null,null,null,null,null,null,null,null,null,null,null,null,null,930242]
[null,null,null,null,null,null,null,null,null,null,null,null,null,null,null,null,null,null,null,null,null,null,null,null,null,null,null,null,null,null,null,null,null,null,null,null,null,null,null,null,null,null,null,null,null,null,930342]
[null,null,null,null,null,null,null,null,null,null,null,null,null,null,null,null,null,null,null,null,null,null,null,null,null,null,null,null,null,null,null,null,null,null,null,null,null,null,null,null,null,null,null,null,null,null,940242]
[null,null,null,null,null,null,null,null,null,null,null,null,null,null,null,null,null,null,null,null,null,null,null,null,null,null,null,null,null,null,null,null,null,null,null,null,null,null,null,null,null,null,null,null,null,null,940542]
[null,null,null,null,null,null,null,null,null,null,null,null,null,null,null,null,null,null,null,null,null,null,null,null,null,null,null,null,null,null,null,null,null,null,null,null,null,null,null,null,null,null,null,null,null,null,940642]
[null,null,null,null,null,null,null,null,null,null,null,null,null,null,null,null,null,null,null,null,null,null,null,null,null,null,null,null,null,null,null,null,null,null,null,null,null,null,null,null,null,null,null,null,null,null,940742]
[null,null,null,null,null,null,null,null,null,null,null,null,null,null,null,null,null,null,null,null,null,null,null,null,null,null,null,null,null,null,null,null,null,null,null,null,null,null,null,null,null,null,null,null,null,null,940842]
[null,null,null,null,null,null,null,null,null,null,null,null,null,null,null,null,null,null,null,null,null,null,null,null,null,null,null,null,null,null,null,null,null,null,null,null,null,null,null,null,null,null,null,null,null,null,950242]
[null,null,null,null,null,null,null,null,null,null,null,null,null,null,null,null,null,null,null,null,null,null,null,null,null,null,null,null,null,null,null,null,null,null,null,null,null,null,null,null,null,null,null,null,null,null,950342]
[null,null,null,null,null,null,null,null,null,null,null,null,null,null,null,null,null,null,null,null,null,null,null,null,null,null,null,null,null,null,null,null,null,null,null,null,null,null,null,null,null,null,null,null,null,null,950742]
[null,null,null,null,null,null,null,null,null,null,null,null,null,null,null,null,null,null,null,null,null,null,null,null,null,null,null,null,null,null,null,null,null,null,null,null,null,null,null,null,null,null,null,null,null,null,950842]

{"sheet":"A-Data","index":4,"n_rows":4,"n_cols":36,"rows_kept":4,"cut":false,"hidden":true,"merged":[]}
["Facility ID Info",null,null,"Facility",null,"Facility",null,null,null,null,null,null,null,null,null,null,null,null,"Preparer  ",null,null,null,"Reporting Period",null,null,"Administration"]
[null,null,null,null,null,null,null,"Street Address",null,null,null,null,null,"Mailing Address"]
["State ID","NH Name","County","State ID","NH Name","Name Change","Prior Name","Street Address","City","County","State","Zip Code","Telephone","Mailing Address\nYes/No","Mailing Address","City","State","Zip","Name","Phone","Title","Email","Yes/No","Beg date","End Date","Administrator","Admin license"]
[{"$f":"NHA_StateID","v":0},{"$f":"NHA_Name","v":"-"},{"$f":"NHA_County","v":"-"},{"$f":"NHA_StateID","v":0},{"$f":"NHA_Name","v":"-"},{"$f":"NHA_NameChange","v":"-"},{"$f":"NHA_PriorName","v":0},{"$f":"NHA_StreetAddress","v":"-"},{"$f":"NHA_City","v":"-"},{"$f":"NHA_County","v":"-"},{"$f":"NHA_State","v":0},{"$f":"NHA_Zip","v":"-"},{"$f":"NHA_Phone","v":0},{"$f":"NHA_MAYN","v":"-"},{"$f":"NHA_MailAddress","v":""},{"$f":"NHA_MailCity","v":""},{"$f":"NHA_MailState","v":""},{"$f":"NHA_MailZip","v":""},{"$f":"NHA_PrepName","v":0},{"$f":"NHA_PrepPhone","v":0},{"$f":"NHA_PrepTitle","v":0},{"$f":"NHA_PrepEMail","v":0},{"$f":"NHA_RptPeriodYN","v":"-"},{"$f":"NHA_RptBegDate","v":""},{"$f":"NHA_RptEndDate","v":""},{"$f":"NHA_Admin","v":0},{"$f":"NHA_AdminLic","v":0},null,null,null,{"$f":"NHA_MAYN","v":"-"},{"$f":"NHA_MailAddress","v":""},{"$f":"NHA_MailCity","v":""},{"$f":"NHA_MailCounty","v":0},{"$f":"NHA_MailState","v":""},{"$f":"NHA_MailZip","v":""}]

{"sheet":"Sch B","index":5,"n_rows":55,"n_cols":45,"rows_kept":55,"cut":false,"hidden":false,"merged":[[44,38,46,38],[11,9,11,35],[17,7,17,8],[14,7,14,8],[15,7,15,8],[18,7,18,8],[30,26,30,35],[25,28,25,35],[25,12,25,15],[29,5,29,10],[30,5,30,10],[29,22,29,25],[30,22,30,25],[13,7,13,8],[16,7,16,8],[14,4,16,6],[21,7,21,8],[19,7,19,8],[20,7,20,8],[24,6,24,11],[28,5,28,10],[42,16,42,19],[38,20,38,35],[40,11,43,15],[5,8,5,19],[10,9,10,35],[5,20,5,23],[35,11,35,19],[33,30,33,35],[34,26,34,29],[35,8,35,10],[24,12,24,15],[26,6,26,11],[26,16,26,23],[25,24,25,27],[28,11,28,35],[27,11,27,35],[21,9,21,14],[40,16,40,19],[40,20,40,35],[43,27,43,30],[22,12,22,35],[26,12,26,15],[26,24,26,27],[25,6,25,11],[33,5,34,7],[43,20,43,26],[33,8,34,10],[36,16,36,19],[39,20,39,26],[36,5,39,7],[1,9,1,14],[8,7,8,8],[9,9,9,35],[5,4,5,7],[8,0,21,3],[3,8,3,35],[6,8,6,19],[0,0,0,35],[3,4,3,7],[3,0,6,3],[7,0,7,35],[5,24,5,35],[1,33,1,35],[1,15,1,32],[12,9,12,35],[16,9,16,35],[6,24,6,35],[14,9,14,35],[19,9,19,35],[9,7,9,8],[4,8,4,35],[6,4,6,7],[8,9,8,35],[6,20,6,23],[3,36,5,36],[31,5,31,7],[10,7,10,8],[8,4,13,6],[12,7,12,8],[11,7,11,8],[13,36,14,36],[13,9,13,35],[17,4,21,6],[24,16,24,35],[31,0,34,4],[34,30,34,35],[31,26,31,29],[31,30,31,35],[33,26,33,29],[32,11,32,25],[26,28,26,35],[32,30,32,35],[31,11,31,25],[25,16,25,23],[22,5,23,11],[33,11,34,25],[32,26,32,29],[20,9,20,35],[0,36,0,38],[15,9,15,35],[4,4,4,7],[33,38,38,38],[38,37,42,37],[2,0,2,35],[23,12,23,15],[1,0,1,3],[1,4,1,8],[27,0,30,4],[27,5,27,10],[32,8,32,10],[36,8,39,10],[35,5,35,7],[36,20,36,35],[17,9,17,35],[18,9,18,35],[32,5,32,7],[22,0,26,4],[35,0,43,4],[31,8,31,10],[38,16,38,19],[39,27,39,30],[39,31,39,35],[44,37,46,37],[16,36,18,36],[29,36,30,36],[27,37,30,37],[46,0,46,35],[41,16,41,19],[41,20,41,35],[44,0,44,35],[45,0,45,35],[43,31,43,35],[40,5,43,7],[43,16,43,19],[40,8,43,10],[35,20,35,35],[39,16,39,19],[36,11,39,15],[37,20,37,35],[37,16,37,19],[42,20,42,35],[29,11,29,21],[23,16,23,35],[29,26,29,35],[30,11,30,21],[21,15,21,35]]}
["2018 - NURSING HOMES - PROVISIONAL",null,null,null,null,null,null,null,null,null,null,null,null,null,null,null,null,null,null,null,null,null,null,null,null,null,null,null,null,null,null,null,null,null,null,null,"'OK' = Likely no Error\n'Error\" = Maybe Error\nin data provided"]
["State ID:",null,null,null,{"$f":"NHA_StateID","v":0},null,null,null,null,"Facility Name:",null,null,null,null,null,{"$f":"NHA_Name","v":"-"},null,null,null,null,null,null,null,null,null,null,null,null,null,null,null,null,null,2018]
["Tennessee Joint Annual Report of Nursing Homes - Schedule B - Organization Structure"]
["Owner         Data",null,null,null," Name",null,null,null,null,null,null,null,null,null,null,null,null,null,null,null,null,null,null,null,null,null,null,null,null,null,null,null,null,null,null,null,"Owner\naddress\nprovided",null,null,{"$f":"IF(NHB_OwnName=\"\",0,1)","v":0},{"$f":"IF(NHB_OwnPhone=\"\",0,1)","v":0}]
[null,null,null,null," Street",null,null,null,null,null,null,null,null,null,null,null,null,null,null,null,null,null,null,null,null,null,null,null,null,null,null,null,null,null,null,null,null,null,null,{"$f":"IF(NHB_OwnStreet=\"\",0,1)","v":0},{"$f":"IF(NHB_OwnState=\"\",0,1)","v":0}]
[null,null,null,null," City",null,null,null,null,null,null,null,null,null,null,null,null,null,null,null," Phone",null,null,null,null,null,null,null,null,null,null,null,null,null,null,null,null,null,null,{"$f":"IF(NHB_OwnCity=\"\",0,1)","v":0},{"$f":"IF(NHB_OwnZip=\"\",0,1)","v":0}]
[null,null,null,null," State",null,null,null,null,null,null,null,null,null,null,null,null,null,null,null," Zip Code",null,null,null,null,null,null,null,null,null,null,null,null,null,null,null,{"$f":"IF(AO7=6,\"Ok\",\"Error\")","v":"Error"},null,null,null,{"$f":"SUM(AN4:AO6)","v":0}]
[" The type of legal entity, except proprietorship, general partnerships and government entities, can\n be confirmed at the Secretary of State website:  https://tnbear.tn.gov/Ecommerce/FilingSearch.aspx"]
["Type of\nOwner\n(Choose\none)",null,null,null,"For\nProfit",null,null,"^",null," Proprietorship – a business owned by one person.",null,null,null,null,null,null,null,null,null,null,null,null,null,null,null,null,null,null,null,null,null,null,null,null,null,null,null,null,null,null,{"$f":"IF(NHB_TpeProfProp=\"X\",1,0)","v":0}]
[null,null,null,null,null,null,null,"^",null," Partnership – an association of two or more persons to carry on as co-owners of a\n business or other undertaking for profit formed under  61-1-202, predecessor law,\n or comparable law of another jurisdiction. TCA Title 61 Chapter 1.",null,null,null,null,null,null,null,null,null,null,null,null,null,null,null,null,null,null,null,null,null,null,null,null,null,null,"Select only\none type of\nowner",null,null,{"$f":"SUM(AO9:AO14)","v":0},{"$f":"IF(NHB_TypeProfPart=\"X\",1,0)","v":0}]
[null,null,null,null,null,null,null,"^",null," Limited Partnership (LP) – a partnership formed by two or more persons under the law\n of the state of Tennessee, and having one or more general partners and one or more\n limited partners. TCA Title 61 Chapter 2.",null,null,null,null,null,null,null,null,null,null,null,null,null,null,null,null,null,null,null,null,null,null,null,null,null,null,{"$f":"IF(AN11=1,\"Ok\", \"Error\")","v":"Error"},null,null,{"$f":"SUM(AN10+AN16+AN19)","v":0},{"$f":"IF(NHB_TypeProfLP=\"X\",1,0)","v":0}]
[null,null,null,null,null,null,null,"^",null," Limited Liability Partnership (LLP) – is governed by TCA § 61-1-106(C). The law of this\n state governs relations among the partners and between the partners and the\n partnership and the liability of partners for an obligation of a limited liability partnership\n that has filed an application as a limited liability partnership in this state.",null,null,null,null,null,null,null,null,null,null,null,null,null,null,null,null,null,null,null,null,null,null,null,null,null,null,"Other Govt\nChecked,\nSpecify \nName",null,null,null,{"$f":"IF(NHB_TypeProfLLP=\"X\",1,0)","v":0}]
[null,null,null,null,null,null,null,"^",null," Limited Liability Company (LLC) – established by the “The Tennessee Limited\n Liability Company Act” found in the TCA § 48-201-101 through § 48-248-606.",null,null,null,null,null,null,null,null,null,null,null,null,null,null,null,null,null,null,null,null,null,null,null,null,null,null,{"$f":"IF(AND(AN22=\"True\",AN23=\"True\"),\"Error\", \"Ok\")","v":"Ok"},null,null,null,{"$f":"IF(NHB_TypeProfLLC=\"X\",1,0)","v":0}]
[null,null,null,null,null,null,null,"^",null," Corporation – defined by the Tennessee Business Corporation Act codified in TCA\n Title 48 Chapters 11-27.",null,null,null,null,null,null,null,null,null,null,null,null,null,null,null,null,null,null,null,null,null,null,null,null,null,null,"Managed by\nCheck only 1",null,null,null,{"$f":"IF(NHB_TypeProfCorp=\"X\",1,0)","v":0}]
[null,null,null,null,"Not\nfor\nProfit",null,null,"^",null," Non-Religious Corporation or Association – defined by the “Tennessee Nonprofit\n Corporation Act” codified in TCA Title 48 Chapters 51-68.",null,null,null,null,null,null,null,null,null,null,null,null,null,null,null,null,null,null,null,null,null,null,null,null,null,null,null,null,null,null,{"$f":"IF(NHB_TypeNotPNonRelg=\"X\",1,0)","v":0}]
[null,null,null,null,null,null,null,"^",null," Religious Corporation or Association – either a corporation or association that is\n organized and operated primarily or exclusively for religious purposes. Most of the\n provisions of the Tennessee Nonprofit Corporation Act apply to a religious\n corporation. Exceptions are specified in TCA § 48-67.",null,null,null,null,null,null,null,null,null,null,null,null,null,null,null,null,null,null,null,null,null,null,null,null,null,null,{"$f":"IF(AN27=1,\"Ok\",\"Error\")","v":"Error"},"Provide\ncomplete\nmanage-\nment\ninformation",null,{"$f":"SUM(AO15:AO17)","v":0},{"$f":"IF(NHB_TypeNotPRelg=\"X\",1,0)","v":0}]
[null,null,null,null,null,null,null,"^",null," Limited Liability Company (LLC) – a company that is disregarded as an entity for\n federal income tax purposes, and whose sole member is a nonprofit corporation,\n foreign or domestic, incorporated under or subject to the provisions of the\n Tennessee Nonprofit Corporation Act and who is exempt from franchise and\n excise tax as not-for-profit as defined in TCA § 67-4-1004(15).",null,null,null,null,null,null,null,null,null,null,null,null,null,null,null,null,null,null,null,null,null,null,null,null,null,null,"Building Owner\nadditional\naddress data\nprovided",{"$f":"IF(AQ24=0,\"Ok\",\"Error\")","v":"Error"},null,null,{"$f":"IF(NHB_TypeNotPLLC=\"X\",1,0)","v":0}]
[null,null,null,null,"Govern-\nment",null,null,"^",null," City",null,null,null,null,null,null,null,null,null,null,null,null,null,null,null,null,null,null,null,null,null,null,null,null,null,null,null,null,null,null,{"$f":"IF(NHB_TypeGovtCity=\"X\",1,0)","v":0}]
[null,null,null,null,null,null,null,"^",null," County",null,null,null,null,null,null,null,null,null,null,null,null,null,null,null,null,null,null,null,null,null,null,null,null,null,null,null,null,null,{"$f":"SUM(AO18:AO22)","v":0},{"$f":"IF(NHB_TypeGovtCounty=\"X\",1,0)","v":0}]
[null,null,null,null,null,null,null,"^",null," State",null,null,null,null,null,null,null,null,null,null,null,null,null,null,null,null,null,null,null,null,null,null,null,null,null,null,{"$f":"IF(AQ28=0,\"Ok\",\"Error\")","v":"Error"},null,null,null,{"$f":"IF(NHB_TypeGovtState=\"X\",1,0)","v":0}]
[null,null,null,null,null,null,null,"^",null," Federal",null,null,null,null,null,null,null,null,null,null,null,null,null,null,null,null,null,null,null,null,null,null,null,null,null,null,null,null,null,null,{"$f":"IF(NHB_TypeGovtFed=\"X\",1,0)","v":0}]
[null,null,null,null,null,null,null,"^",null," Other\n Government,\n specify",null,null,null,null,null,null,null,null,null,null,null,null,null,null,null,null,null,null,null,null,null,null,null,null,null,null,null,null,null,{"$f":"IF(NHB_TypeGovtOther=\"X\",\"True\", \"False\")","v":"False"},{"$f":"IF(NHB_TypeGovtOther=\"X\",1,0)","v":0}]
["Managed\nBy",null,null,null,null,null,null,null,null,null,null,null," Management Information",null,null,null,null,null,null,null,null,null,null,null,null,null,null,null,null,null,null,null,null,null,null,null,null,null,null,{"$f":"IF(NHB_TypeGovtOtherName=\"\",\"True\",\"False\")","v":"True"}]
[null,null,null,null,null,null,null,null,null,null,null,null," Name",null,null,null,null,null,null,null,null,null,null,null,null,null,null,null,null,null,null,null,null,null,null,null,null,null,null,{"$f":"IF(NHB_MangOwn=\"X\",1,0)","v":0},{"$f":"IF(NHB_MangName=\"\",1,0)","v":1},{"$f":"IF(NHB_MangPhone=\"\",1,0)","v":1},{"$f":"SUM(AO24:AP26)","v":6}]
[null,null,null,null,null,"^"," Owner",null,null,null,null,null," Street",null,null,null,null,null,null,null,null,null,null,null,null,null,null,null,null,null,null,null,null,null,null,null,null,null,null,{"$f":"IF(NHB_MangContract=\"X\",1,0)","v":0},{"$f":"IF(NHB_MangStreet=\"\",1,0)","v":1},{"$f":"IF(NHB_MangState=\"\",1,0)","v":1}]
[null,null,null,null,null,"^"," Contract with Firm",null,null,null,null,null," City",null,null,null,null,null,null,null,null,null,null,null," Phone",null,null,null,null,null,null,null,null,null,null,null,null,null,null,{"$f":"IF(NHB_MangOther=\"X\",1,0)","v":0},{"$f":"IF(NHB_MangCity=\"\",1,0)","v":1},{"$f":"IF(NHB_MangZip=\"\",1,0)","v":1}]
[null,null,null,null,null,"^"," Other",null,null,null,null,null," State",null,null,null,null,null,null,null,null,null,null,null," Zip Code",null,null,null,null,null,null,null,null,null,null,null,null,null,null,{"$f":"SUM(AN24:AN26)","v":0}]
["Building\nOwner",null,null,null,null," Name",null,null,null,null,null,null,null,null,null,null,null,null,null,null,null,null,null,null,null,null,null,null,null,null,null,null,null,null,null,null,null,"Building =\nYes,\nis additional\ndata\nprovided?",null,null,{"$f":"IF(NHB_BldgOwnName=\"\",1,0)","v":1},{"$f":"IF(NHB_BldgOwnPhone=\"\",1,0)","v":1},{"$f":"SUM(AO28:AP30)","v":6}]
[null,null,null,null,null," Street",null,null,null,null,null,null,null,null,null,null,null,null,null,null,null,null,null,null,null,null,null,null,null,null,null,null,null,null,null,null,null,null,null,null,{"$f":"IF(NHB_BldgOwnStreet=\"\",1,0)","v":1},{"$f":"IF(NHB_BldgOwnState=\"\",1,0)","v":1}]
[null,null,null,null,null," City",null,null,null,null,null,null,null,null,null,null,null,null,null,null,null,null," Phone",null,null,null,null,null,null,null,null,null,null,null,null,null,"Yes/No\nQuestion",null,null,null,{"$f":"IF(NHB_BldgOwnCity=\"\",1,0)","v":1},{"$f":"IF(NHB_BldgOwnZip=\"\",1,0)","v":1}]
[null,null,null,null,null," State",null,null,null,null,null,null,null,null,null,null,null,null,null,null,null,null," Zip Code"]
["Building",null,null,null,null,"Yes/No",null,null,"-",null,null," Do you know the year of the original \n construction date?",null,null,null,null,null,null,null,null,null,null,null,null,null,null," Year",null,null,null,null,null,null,null,null,null,{"$f":"IF(AO32=TRUE,\"Ok\",\"Error\")","v":"Error"},{"$f":"IF(AS32=TRUE,\"Ok\", \"Error\")","v":"Ok"},null,null,{"$f":"OR(NHB_BldgConstYN=\"Yes\",NHB_BldgConstYN=\"No\")","v":false},{"$f":"IF(NHB_BldgConstYN=\"Yes\",1,0)","v":0},{"$f":"IF(NHB_BldgConstYr<>\"\",1,0)","v":0},{"$f":"(AP32+AQ32)","v":0},{"$f":"OR(AR32=0,AR32=2)","v":true}]
[null,null,null,null,null,"Yes/No",null,null,"-",null,null," Has the building had a major renovation?  A\n major renovation is any project that includes\n the addition of beds, services, or medical\n equipment.",null,null,null,null,null,null,null,null,null,null,null,null,null,null," Year",null,null,null,null,null,null,null,null,null,{"$f":"IF(AO33=TRUE,\"Ok\",\"Error\")","v":"Error"},{"$f":"IF(AS33=TRUE,\"Ok\", \"Error\")","v":"Ok"},null,null,{"$f":"OR(NHB_BldgRenYN=\"Yes\",NHB_BldgRenYN=\"No\")","v":false},{"$f":"IF(NHB_BldgRenYN=\"Yes\",1,0)","v":0},{"$f":"IF(NHB_BldgRenYr<>\"\",1,0)","v":0},{"$f":"(AP33+AQ33)","v":0},{"$f":"OR(AR33=0,AR33=2)","v":true}]
[null,null,null,null,null,"Yes/No",null,null,"-",null,null," Has there been new construction that\n increased licensed bed count?",null,null,null,null,null,null,null,null,null,null,null,null,null,null," Year",null,null,null,null,null,null,null,null,null,{"$f":"IF(AO34=TRUE,\"Ok\",\"Error\")","v":"Error"},{"$f":"IF(AS34=TRUE,\"Ok\", \"Error\")","v":"Ok"},"Organiza-\ntion\nStructure:\nHospital\nbased,\nprovide name",null,{"$f":"OR(NHB_BldgNewCYN=\"Yes\",NHB_BldgNewCYN=\"No\")","v":false},{"$f":"IF(NHB_BldgNewCYN=\"Yes\",1,0)","v":0},{"$f":"IF(NHB_BldgNewCYr<>\"\",1,0)","v":0},{"$f":"(AP34+AQ34)","v":0},{"$f":"OR(AR34=0,AR34=2)","v":true}]
[null,null,null,null,null,null,null,null,null,null,null,null,null,null,null,null,null,null,null,null,null,null,null,null,null,null," Cost",null,null,null,null,null,null,null,null,null,null,{"$f":"IF(AS35=TRUE,\"Ok\", \"Error\")","v":"Ok"},null,null,null,null,{"$f":"IF(NHB_BldgNewCCs<>\"\",1,0)","v":0},{"$f":"(AP34+AQ35)","v":0},{"$f":"OR(AR35=0,AR35=2)","v":true}]
["Organization\nStructure",null,null,null,null,"Yes/No",null,null,"-",null,null," Hospital Based, specify:",null,null,null,null,null,null,null,null,null,null,null,null,null,null,null,null,null,null,null,null,null,null,null,null,{"$f":"IF(AO36=TRUE,\"Ok\",\"Error\")","v":"Error"},null,null,null,{"$f":"OR(NHB_OrgSHBYN=\"Yes\",NHB_OrgSHBYN=\"No\")","v":false},{"$f":"IF(NHB_OrgSHBYN=\"Yes\",1,0)","v":0},{"$f":"OR(AP38=2,AP38=0)","v":true}]
[null,null,null,null,null,"Yes/No",null,null,"-",null,null,"Chain",null,null,null,null," Name",null,null,null,null,null,null,null,null,null,null,null,null,null,null,null,null,null,null,null,{"$f":"IF(AO37=TRUE,\"Ok\",\"Error\")","v":"Error"},null,null,null,{"$f":"OR(NHB_OrgSChYN=\"Yes\",NHB_OrgSChYN=\"No\")","v":false},{"$f":"IF(NHB_OrgSHBSpecify=\"\",0,1)","v":0},{"$f":"IF(NHB_OrgSHBYN=\"Yes\",1,0)","v":0},{"$f":"(AQ37+AQ38)","v":0},{"$f":"OR(AR37=0,AR37=2)","v":true}]
[null,null,null,null,null,null,null,null,null,null,null,null,null,null,null,null," Street",null,null,null,null,null,null,null,null,null,null,null,null,null,null,null,null,null,null,null,null,null,null,{"$f":"IF(NHB_OrgSChName=\"\",0,1)","v":0},{"$f":"IF(NHB_OrgSChState=\"\",0,1)","v":0},{"$f":"(AP36+AP37)","v":0},{"$f":"IF(NHB_OrgSHBSpecify<>\"\",1,0)","v":0}]
[null,null,null,null,null,null,null,null,null,null,null,null,null,null,null,null," City",null,null,null,null,null,null,null,null,null,null,null,null,null,null,null,null,null,null,null,null,"IF Chain           = Yes;\nprovide\ncomplete\ninformation",null,{"$f":"IF(NHB_OrgSChStreet=\"\",0,1)","v":0},{"$f":"IF(NHB_OrgSChZip=\"\",0,1)","v":0},{"$f":"OR(AP40=0,AP40=6)","v":true}]
[null,null,null,null,null,null,null,null,null,null,null,null,null,null,null,null," State",null,null,null,null,null,null,null,null,null,null," Zip Code",null,null,null,null,null,null,null,null,null,null,{"$f":"IF(AQ36=TRUE,\"Ok\", \"Error\")","v":"Ok"},{"$f":"IF(NHB_OrgSChCity=\"\",0,1)","v":0},{"$f":"IF(NHB_OrgSChYN=\"Yes\",1,0)","v":0},{"$f":"SUM(AN38:AO40)","v":0}]
[null,null,null,null,null,"Yes/No",null,null,"-",null,null,"Holding\nCompany/\nParent\nCorporation",null,null,null,null," Name",null,null,null,null,null,null,null,null,null,null,null,null,null,null,null,null,null,null,null,"  ",null,null,null,{"$f":"OR(NHB_OrgSHCYN=\"Yes\",NHB_OrgSHCYN=\"No\")","v":false}]
[null,null,null,null,null,null,null,null,null,null,null,null,null,null,null,null," Street",null,null,null,null,null,null,null,null,null,null,null,null,null,null,null,null,null,null,null,null,null,null,{"$f":"IF(NHB_OrgSHCName=\"\",0,1)","v":0},{"$f":"IF(NHB_OrgSHCState=\"\",0,1)","v":0}]
[null,null,null,null,null,null,null,null,null,null,null,null,null,null,null,null," City",null,null,null,null,null,null,null,null,null,null,null,null,null,null,null,null,null,null,null,null,null,null,{"$f":"IF(NHB_OrgSHCStreet=\"\",0,1)","v":0},{"$f":"IF(NHB_OrgSCHCZip=\"\",0,1)","v":0},{"$f":"OR(AP44=0,AP44=6)","v":true}]
[null,null,null,null,null,null,null,null,null,null,null,null,null,null,null,null," State",null,null,null,null,null,null,null,null,null,null," Zip Code",null,null,null,null,null,null,null,null,null,{"$f":"IF(AP39=TRUE,\"Ok\", \"Error\")","v":"Ok"},null,{"$f":"IF(NHB_OrgSHCCity=\"\",0,1)","v":0},{"$f":"IF(NHB_OrgSHCYN=\"Yes\",1,0)","v":0},{"$f":"SUM(AN42:AO44)","v":0}]
["Go to Next Schedule",null,null,null,null,null,null,null,null,null,null,null,null,null,null,null,null,null,null,null,null,null,null,null,null,null,null,null,null,null,null,null,null,null,null,null,null,"IF HCPC             = Yes;\nProvide data","HCPC           Data Provided"]
["Return to Main Menu"]
["Go to Error Listing"]
["",null,null,null,null,null,null,null,null,null,null,null,null,null,null,null,null,null,null,null,null,null,null,null,null,null,null,null,null,null,null,null,null,null,null,null,null,{"$f":"IF(AP43=TRUE,\"Ok\", \"Error\")","v":"Ok"}]
[""]
[""]
[""]
[""]
[""]
[""]
["","","","","","","","","","","","","","","","","","","","","","","","","","","","","","","","","","","",""]

{"sheet":"B-Data","index":6,"n_rows":4,"n_cols":60,"rows_kept":4,"cut":false,"hidden":true,"merged":[]}
["Facility ID Info",null,null,"Owner",null,null,null,null,null,"Type of Owner (Choose one)",null,null,null,null,null,null,null,null,null,null,null,null,null,null,"Managed By",null,null,null,null,null,null,null,null,"Building Owner",null,null,null,null,null,"Building",null,null,null,null,null,null,"Organization Structure"]
[null,null,null,null,null,null,null,null,null,"For Profit",null,null,null,null,null,"Not for Profit",null,null,"Government",null,null,null,null,null,"Select only one",null,null,"Management Information",null,null,null,null,null,null,null,null,null,null,null,"Original Construction",null,"Major Renovation",null,"New Construction",null,null,"Hospital Based",null,"Chain",null,null,null,null,null,"Holding Company/Parent Corporation"]
["State ID","NH Name","County","Name","Street","City","Phone","State","Own Zip","Proprietor-\nship","Partnership","Limited\nPartnership","Limited\nLiability\nPartnership","Limited\nLiability\nCompany","Corporation","Non-\nReligious\nCorporation","Religious","Limited\nLiability\nCompany","City","County","State","Federal","Other\nGovernment","Other Government\nSpecify","Owner","Contract\nwith\nFirm","Other","Name","Street","City","Phone","State","Zip","Name","Street","City","Phone","State ","Zip","Yes/No","Year","Yes/No","Year","Yes/No","Year","Cost","Yes/No","Specify","Yes/No","Name","Street","City","State","Zip","Yes/No","Name","Street","City","State","Zip"]
[{"$f":"NHA_StateID","v":0},{"$f":"NHA_Name","v":"-"},{"$f":"NHA_County","v":"-"},{"$f":"NHB_OwnName","v":0},{"$f":"NHB_OwnStreet","v":0},{"$f":"NHB_OwnCity","v":0},{"$f":"NHB_OwnPhone","v":0},{"$f":"NHB_OwnState","v":0},{"$f":"NHB_OwnZip","v":0},{"$f":"NHB_TpeProfProp","v":"^"},{"$f":"NHB_TypeProfPart","v":"^"},{"$f":"NHB_TypeProfLP","v":"^"},{"$f":"NHB_TypeProfLLP","v":"^"},{"$f":"NHB_TypeProfLLC","v":"^"},{"$f":"NHB_TypeProfCorp","v":"^"},{"$f":"NHB_TypeNotPNonRelg","v":"^"},{"$f":"NHB_TypeNotPRelg","v":"^"},{"$f":"NHB_TypeNotPLLC","v":"^"},{"$f":"NHB_TypeGovtCity","v":"^"},{"$f":"NHB_TypeGovtCounty","v":"^"},{"$f":"NHB_TypeGovtState","v":"^"},{"$f":"NHB_TypeGovtFed","v":"^"},{"$f":"NHB_TypeGovtOther","v":"^"},{"$f":"NHB_TypeGovtOtherName","v":0},{"$f":"NHB_MangOwn","v":"^"},{"$f":"NHB_MangContract","v":"^"},{"$f":"NHB_MangOther","v":"^"},{"$f":"NHB_MangName","v":0},{"$f":"NHB_MangStreet","v":0},{"$f":"NHB_MangCity","v":0},{"$f":"NHB_MangPhone","v":0},{"$f":"NHB_MangState","v":0},{"$f":"NHB_MangZip","v":0},{"$f":"NHB_BldgOwnName","v":0},{"$f":"NHB_BldgOwnStreet","v":0},{"$f":"NHB_BldgOwnCity","v":0},{"$f":"NHB_BldgOwnPhone","v":0},{"$f":"NHB_BldgOwnState","v":0},{"$f":"NHB_BldgOwnZip","v":0},{"$f":"NHB_BldgConstYN","v":"-"},{"$f":"NHB_BldgConstYr","v":0},{"$f":"NHB_BldgRenYN","v":"-"},{"$f":"NHB_BldgRenYr","v":0},{"$f":"NHB_BldgNewCYN","v":"-"},{"$f":"NHB_BldgNewCYr","v":0},{"$f":"NHB_BldgNewCCs","v":0},{"$f":"NHB_OrgSHBYN","v":"-"},{"$f":"NHB_OrgSHBSpecify","v":0},{"$f":"NHB_OrgSChYN","v":"-"},{"$f":"NHB_OrgSChName","v":0},{"$f":"NHB_OrgSChStreet","v":0},{"$f":"NHB_OrgSChCity","v":0},{"$f":"NHB_OrgSChState","v":0},{"$f":"NHB_OrgSChZip","v":0},{"$f":"NHB_OrgSHCYN","v":"-"},{"$f":"NHB_OrgSHCName","v":0},{"$f":"NHB_OrgSHCStreet","v":0},{"$f":"NHB_OrgSHCCity","v":0},{"$f":"NHB_OrgSHCState","v":0},{"$f":"NHB_OrgSCHCZip","v":0}]

{"sheet":"Sch C","index":7,"n_rows":20,"n_cols":41,"rows_kept":20,"cut":false,"hidden":false,"merged":[[1,4,1,8],[0,36,0,38],[2,0,2,35],[3,0,4,6],[2,36,4,36],[4,7,4,18],[0,0,0,35],[1,37,2,37],[1,9,1,14],[1,33,1,35],[3,19,3,35],[4,19,4,35],[1,0,1,3],[3,7,3,18],[1,15,1,32],[5,0,7,6],[5,7,6,9],[6,24,6,29],[5,10,6,12],[7,10,7,12],[7,7,7,9],[8,7,8,9],[14,10,14,12],[9,7,9,9],[7,37,8,37],[6,30,6,35],[5,13,6,23],[9,13,9,35],[8,13,8,35],[4,37,5,37],[5,24,5,29],[7,13,7,21],[7,22,7,35],[5,30,5,35],[13,13,13,35],[10,13,10,35],[11,7,11,9],[16,36,18,36],[11,13,11,35],[12,13,12,35],[15,7,15,9],[14,7,14,9],[15,22,15,35],[12,7,12,9],[13,10,13,12],[16,37,18,37],[15,10,15,12],[11,37,14,37],[14,13,14,35],[17,0,17,35],[16,0,16,35],[13,7,13,9],[18,0,18,35],[12,10,12,12],[8,0,15,6],[11,10,11,12],[8,10,8,12],[15,13,15,21],[9,10,9,12],[10,7,10,9],[10,10,10,12]]}
["2018 - NURSING HOMES - PROVISIONAL",null,null,null,null,null,null,null,null,null,null,null,null,null,null,null,null,null,null,null,null,null,null,null,null,null,null,null,null,null,null,null,null,null,null,null,"'OK' = Likely no Error\n'Error\" = Maybe Error\nin data provided"]
["State ID:",null,null,null,{"$f":"NHA_StateID","v":0},null,null,null,null,"Facility Name:",null,null,null,null,null,{"$f":"NHA_Name","v":"-"},null,null,null,null,null,null,null,null,null,null,null,null,null,null,null,null,null,2018,null,null,null,"JCAHO =\nYes, dates\nprovided",null,{"$f":"IF(NHC_AcrJComYN=\"Yes\",1,0)","v":0}]
["TennesseeJoint Annual Report of Nursing Homes - Schedule C - Licensure, Accreditations, and Memberships",null,null,null,null,null,null,null,null,null,null,null,null,null,null,null,null,null,null,null,null,null,null,null,null,null,null,null,null,null,null,null,null,null,null,null,"Yes/No\nQuestion",null,null,{"$f":"IF(NHC_AcrJcomAD=\"\",0,1)","v":0}]
["Licensure",null,null,null,null,null,null," License Number for reporting year",null,null,null,null,null,null,null,null,null,null,null,null,null,null,null,null,null,null,null,null,null,null,null,null,null,null,null,null,null,{"$f":"IF(AO5=TRUE,\"Ok\", \"Error\")","v":"Ok"},null,{"$f":"IF(NHC_AcrJcomED=\"\",0,1)","v":0}]
[null,null,null,null,null,null,null," Most recent survey date",null,null,null,null,null,null,null,null,null,null,null,null,null,null,null,null,null,null,null,null,null,null,null,null,null,null,null,null,null,"JCAHO\nApprove <\nExpiration",null,{"$f":"SUM(AN2:AN4)","v":0},{"$f":"OR(AN5=0,AN5=3)","v":true}]
["Accreditation",null,null,null,null,null,null,"Yes/No",null,null,"-",null,null," Joint Commission on\n Accreditation of\n Healthcare Organizations",null,null,null,null,null,null,null,null,null,null," Approval Year",null,null,null,null,null,null,null,null,null,null,null,{"$f":"IF(AN6=TRUE,\"Ok\",\"Error\")","v":"Error"},null,null,{"$f":"OR(NHC_AcrJComYN=\"Yes\",NHC_AcrJComYN=\"No\")","v":false}]
[null,null,null,null,null,null,null,null,null,null,null,null,null,null,null,null,null,null,null,null,null,null,null,null," Expiration Year",null,null,null,null,null,null,null,null,null,null,null,null,{"$f":"IF(NHC_AcrJcomAD<=NHC_AcrJcomED,\"Ok\", \"Error\")","v":"Ok"},null,null,{"$f":"IF(NHC_AcrOtherYN=\"Yes\",1,0)","v":0}]
[null,null,null,null,null,null,null,"Yes/No",null,null,"-",null,null," Other Accreditation,\n specify:",null,null,null,null,null,null,null,null,null,null,null,null,null,null,null,null,null,null,null,null,null,null,{"$f":"IF(AN8=TRUE,\"Ok\",\"Error\")","v":"Error"},"Other\nAccred =\nYes,\nSpecify",null,{"$f":"OR(NHC_AcrOtherYN=\"Yes\",NHC_AcrOtherYN=\"No\")","v":false},{"$f":"IF(NHC_AcrOther=\"\",0,1)","v":0}]
["Membership",null,null,null,null,null,null,"Yes/No",null,null,"-",null,null," National Hospice Organization",null,null,null,null,null,null,null,null,null,null,null,null,null,null,null,null,null,null,null,null,null,null,"Error",null,null,{"$f":"OR(NHC_MemNHOYN=\"Yes\",NHC_MemNHOYN=\"No\")","v":false},{"$f":"SUM(AO7:AO8)","v":0}]
[null,null,null,null,null,null,null,"Yes/No",null,null,"-",null,null," Tennessee Association for Home Care",null,null,null,null,null,null,null,null,null,null,null,null,null,null,null,null,null,null,null,null,null,null,"Error",{"$f":"IF(AO10=TRUE,\"Ok\", \"Error\")","v":"Ok"},null,{"$f":"OR(NHC_MemTAHCYN=\"Yes\",NHC_MemTAHCYN=\"No\")","v":false},{"$f":"OR(AO9=0,AO9=2)","v":true}]
[null,null,null,null,null,null,null,"Yes/No",null,null,"-",null,null," LeadingAge Tennessee (formerly TNAHSA)",null,null,null,null,null,null,null,null,null,null,null,null,null,null,null,null,null,null,null,null,null,null,"Error",null,null,{"$f":"OR(NHC_MemTAHSAgeYN=\"Yes\",NHC_MemTAHSAgeYN=\"No\")","v":false}]
[null,null,null,null,null,null,null,"Yes/No",null,null,"-",null,null," Tennessee Health Care Association",null,null,null,null,null,null,null,null,null,null,null,null,null,null,null,null,null,null,null,null,null,null,"Error","Other\nMember =\nYes,\nspecify",null,{"$f":"OR(NHC_MemTHCAYN=\"Yes\",NHC_MemTHCAYN=\"No\")","v":false}]
[null,null,null,null,null,null,null,"Yes/No",null,null,"-",null,null," Tennessee Hospice Organization",null,null,null,null,null,null,null,null,null,null,null,null,null,null,null,null,null,null,null,null,null,null,"Error",null,null,{"$f":"OR(NHC_MemTHOYN=\"Yes\",NHC_MemTHOYN=\"No\")","v":false},{"$f":"IF(NHC_MemOtherYN=\"Yes\",1,0)","v":0}]
[null,null,null,null,null,null,null,"Yes/No",null,null,"-",null,null," American Health Care Association",null,null,null,null,null,null,null,null,null,null,null,null,null,null,null,null,null,null,null,null,null,null,{"$f":"IF(AN14=TRUE,\"Ok\",\"Error\")","v":"Error"},null,null,{"$f":"OR(NHC_MemAHCAYN=\"Yes\",NHC_MemAHCAYN=\"No\")","v":false}]
[null,null,null,null,null,null,null,"Yes/No",null,null,"-",null,null," THA Home Care Alliance",null,null,null,null,null,null,null,null,null,null,null,null,null,null,null,null,null,null,null,null,null,null,{"$f":"IF(AN15=TRUE,\"Ok\",\"Error\")","v":"Error"},null,null,{"$f":"OR(NHC_MemTHAYN=\"Yes\",NHC_MemTHAYN=\"No\")","v":false},{"$f":"IF(NHC_MemOther=\"\",0,1)","v":0}]
[null,null,null,null,null,null,null,"Yes/No",null,null,"-",null,null," Other memberships,\n specify",null,null,null,null,null,null,null,null,null,null,null,null,null,null,null,null,null,null,null,null,null,null,{"$f":"IF(AN16=TRUE,\"Ok\",\"Error\")","v":"Error"},{"$f":"IF(AO17=TRUE,\"Ok\", \"Error\")","v":"Ok"},null,{"$f":"OR(NHC_MemOtherYN=\"Yes\",NHC_MemOtherYN=\"No\")","v":false},{"$f":"SUM(AO13:AO15)","v":0}]
["Go to Next Schedule",null,null,null,null,null,null,null,null,null,null,null,null,null,null,null,null,null,null,null,null,null,null,null,null,null,null,null,null,null,null,null,null,null,null,null,"License\nNumber\nprovided","Most Recent\nSurvey date\nprovided",null,null,{"$f":"OR(AO16=0,AO16=2)","v":true}]
["Return to Main Menu"]
["Go to Error Listing"]
[null,null,null,null,null,null,null,null,null,null,null,null,null,null,null,null,null,null,null,null,null,null,null,null,null,null,null,null,null,null,null,null,null,null,null,null,{"$f":"IF(NHC_LicYear=\"\",\"Error\",\"Ok\")","v":"Error"},{"$f":"IF(NHC_LicSurvey=\"\",\"Error\",\"Ok\")","v":"Error"}]

{"sheet":"Sheet2","index":8,"n_rows":0,"n_cols":0,"rows_kept":0,"cut":false,"hidden":true,"merged":[]}

{"sheet":"C-Data","index":9,"n_rows":4,"n_cols":23,"rows_kept":4,"cut":false,"hidden":true,"merged":[]}
["Facility ID Info",null,null,"Licensure",null,"Accreditation",null,null,null,null,"Membership"]
[null,null,null,null,null,"JCAHO",null,null,"Other Accreditation"]
["State ID","NH Name","County","License\nNumber\nfor year","Most\nrecent\nsurvey date","Yes/No","Approval\nYear","Expiration\nYear","Yes/No","Specify","National\nHospice\nOrg","TN Assoc\nfor \nHome Care","TN Assoc\nH & S for\nAging","TN Health\nCare \nAssoc","TN\nHospice\nOrg","American\nHealth Care\nAssociation","THA\nHome Care\nAlliance","Other\nYes/No","Other\nSpecify","","","",""]
[{"$f":"NHA_StateID","v":0},{"$f":"NHA_Name","v":"-"},{"$f":"NHA_County","v":"-"},{"$f":"NHC_LicYear","v":0},{"$f":"NHC_LicSurvey","v":"00:00:00"},{"$f":"NHC_AcrJComYN","v":"-"},{"$f":"NHC_AcrJcomAD","v":0},{"$f":"NHC_AcrJcomED","v":0},{"$f":"NHC_AcrOtherYN","v":"-"},{"$f":"NHC_AcrOther","v":0},{"$f":"NHC_MemNHOYN","v":"-"},{"$f":"NHC_MemTAHCYN","v":"-"},{"$f":"NHC_MemTAHSAgeYN","v":"-"},{"$f":"NHC_MemTHCAYN","v":"-"},{"$f":"NHC_MemTHOYN","v":"-"},{"$f":"NHC_MemAHCAYN","v":"-"},{"$f":"NHC_MemTHAYN","v":"-"},{"$f":"NHC_MemOtherYN","v":"-"},{"$f":"NHC_MemOther","v":0}]

{"sheet":"Sch D-1","index":10,"n_rows":39,"n_cols":42,"rows_kept":39,"cut":false,"hidden":false,"merged":[[34,11,34,16],[34,17,34,35],[33,11,33,35],[33,8,34,10],[31,33,31,35],[32,11,32,35],[31,11,31,29],[31,30,31,32],[30,11,30,29],[30,8,30,10],[31,8,31,10],[1,33,1,35],[1,15,1,32],[23,5,23,7],[23,8,23,10],[22,8,22,10],[22,5,22,7],[23,11,23,35],[20,11,20,35],[38,0,38,35],[36,0,36,35],[37,0,37,35],[35,11,35,35],[35,8,35,10],[35,5,35,7],[22,0,35,4],[30,33,30,35],[30,30,30,32],[26,8,26,10],[26,5,26,7],[25,5,25,7],[25,8,25,10],[27,11,27,35],[28,33,28,35],[30,5,30,7],[9,0,21,4],[9,5,9,35],[18,5,19,7],[21,8,21,10],[20,8,20,10],[20,5,20,7],[12,11,12,30],[16,31,16,35],[21,5,21,7],[14,11,14,30],[14,31,14,35],[12,31,12,35],[19,11,19,30],[19,31,19,35],[10,11,10,35],[13,31,13,35],[11,11,11,30],[13,11,13,30],[10,5,14,7],[10,8,14,10],[11,31,11,35],[3,5,3,7],[5,5,5,10],[5,29,5,35],[6,11,6,28],[3,0,8,4],[8,5,8,10],[7,5,7,10],[0,36,0,38],[4,29,4,35],[1,36,2,36],[8,29,8,35],[7,29,7,35],[2,0,2,35],[3,8,3,10],[3,11,3,35],[4,5,4,10],[6,29,6,35],[3,37,5,37],[7,11,7,28],[6,5,6,10],[0,0,0,35],[1,0,1,3],[1,4,1,8],[1,9,1,14],[11,37,13,37],[8,11,8,28],[4,11,4,28],[15,5,17,7],[15,8,17,10],[16,11,16,30],[17,31,17,35],[18,11,18,35],[15,37,16,37],[18,37,19,37],[17,11,17,30],[15,11,15,35],[5,11,5,28],[33,37,34,37],[26,37,28,37],[22,37,23,37],[27,5,27,7],[28,8,28,10],[18,8,19,10],[28,30,28,32],[21,11,21,35],[32,5,32,7],[32,8,32,10],[26,11,26,35],[24,11,24,35],[24,8,24,10],[24,5,24,7],[22,11,22,35],[28,11,28,29],[28,5,28,7],[29,5,29,7],[29,11,29,35],[27,8,27,10],[25,11,25,35],[29,8,29,10],[31,5,31,7],[33,5,34,7]]}
["2018 - NURSING HOMES - PROVISIONAL",null,null,null,null,null,null,null,null,null,null,null,null,null,null,null,null,null,null,null,null,null,null,null,null,null,null,null,null,null,null,null,null,null,null,null,"'OK' = Likely no Error\n'Error\" = Maybe Error\nin data provided"]
["State ID:",null,null,null,{"$f":"NHA_StateID","v":0},null,null,null,null,"Facility Name:",null,null,null,null,null,{"$f":"NHA_Name","v":"-"},null,null,null,null,null,null,null,null,null,null,null,null,null,null,null,null,null,2018,null,null,"Yes/No\nquestion"]
["Tennessee Joint Annual Report of Nursing Homes -Schedule D - Facilities and Services - Part 1",null,null,null,null,null,null,null,null,null,null,null,null,null,null,null,null,null,null,null,null,null,null,null,null,null,null,null,null,null,null,null,null,null,null,null,null,null,null,null,{"$f":"IF(NHD1_ConProjectYN=\"Yes\",1,0)","v":0}]
["Certificate\nof Need\nProjects",null,null,null,null,"Yes/No",null,null,"-",null,null,"  Do you have an approved, but not completed, Certificate of Need?",null,null,null,null,null,null,null,null,null,null,null,null,null,null,null,null,null,null,null,null,null,null,null,null,{"$f":"IF(AN4=TRUE,\"Ok\",\"Error\")","v":"Error"},"CON = Yes;\nProvide data",null,{"$f":"OR(NHD1_ConProjectYN=\"Yes\",NHD1_ConProjectYN=\"No\")","v":false},{"$f":"IF(NHD1_ConDate1=\"\",0,1)","v":0}]
[null,null,null,null,null,"Date of Approval",null,null,null,null,null,"Name of Service or Activity",null,null,null,null,null,null,null,null,null,null,null,null,null,null,null,null,null,"Number of Beds\n(if applicable)",null,null,null,null,null,null,null,null,null,null,{"$f":"IF(NHD1_ConName1=\"\",0,1)","v":0}]
[null,null,null,null,null,null,null,null,null,null,null,null,null,null,null,null,null,null,null,null,null,null,null,null,null,null,null,null,null,null,null,null,null,null,null,null,null,null,null,null,{"$f":"SUM(AO3:AO5)","v":0}]
[null,null,null,null,null,null,null,null,null,null,null,null,null,null,null,null,null,null,null,null,null,null,null,null,null,null,null,null,null,null,null,null,null,null,null,null,null,{"$f":"IF(AO7=TRUE, \"OK\", \"Error\")","v":"OK"},null,null,{"$f":"OR(AO6=0,AO6=3)","v":true}]
[]
[]
["Services",null,null,null,null,"Indicate ‘Yes’ or 'No' for the services that the facility provides or makes available.  The services to be provided to these persons may include case management, personal care services, respite care services, adult day health services, homemaker/home health aide, habilitation, and other services requested by the State and approved by CMS (previously HCFA).",null,null,null,null,null,null,null,null,null,null,null,null,null,null,null,null,null,null,null,null,null,null,null,null,null,null,null,null,null,null,null,null,null,null,{"$f":"IF(NHD1_SrvCCRCYN=\"Yes\",1,0)","v":0}]
[null,null,null,null,null,"Yes/No",null,null,"-",null,null,"Continuing Care Retirement Community",null,null,null,null,null,null,null,null,null,null,null,null,null,null,null,null,null,null,null,null,null,null,null,null,{"$f":"IF(AN11=TRUE,\"Ok\",\"Error\")","v":"Error"},null,null,{"$f":"OR(NHD1_SrvCCRCYN=\"Yes\",NHD1_SrvCCRCYN=\"No\")","v":false},{"$f":"IF(NHD1_SrvCCRCIAL=\"\",0,1)","v":0}]
[null,null,null,null,null,null,null,null,null,null,null,"Type of Continuing Care",null,null,null,null,null,null,null,null,null,null,null,null,null,null,null,null,null,null,null,"Number of\nUnits",null,null,null,null,null,"Continuing\nCare = Yes;\nprovide data",null,null,{"$f":"IF(NHD1_SrvCCRCACL=\"\",0,1)","v":0}]
[null,null,null,null,null,null,null,null,null,null,null,"  Independent Apartment Living",null,null,null,null,null,null,null,null,null,null,null,null,null,null,null,null,null,null,null,null,null,null,null,null,null,null,null,null,{"$f":"IF(NHD1_SrvCCRCHA=\"\",0,1)","v":0}]
[null,null,null,null,null,null,null,null,null,null,null,"  Assisted Care Living",null,null,null,null,null,null,null,null,null,null,null,null,null,null,null,null,null,null,null,null,null,null,null,null,null,null,null,null,{"$f":"SUM(AO10:AO13)","v":0}]
[null,null,null,null,null,null,null,null,null,null,null,"  Home for the Aged",null,null,null,null,null,null,null,null,null,null,null,null,null,null,null,null,null,null,null,null,null,null,null,null,null,{"$f":"IF(AO15=TRUE,\"Ok\", \"Error\")","v":"Ok"},null,null,{"$f":"OR(AO14=0,AO14=4)","v":true}]
[null,null,null,null,null,"Yes/No",null,null,"-",null,null,"Home Health Care Services: Usually furnished on a visiting basis in a place of residence used as the individual’s home.  However, outpatient services in a hospital, SNF, or rehabilitation center are covered home health services, if arranged for by a home health agency, when equipment is required that cannot be made available in the patient’s home.",null,null,null,null,null,null,null,null,null,null,null,null,null,null,null,null,null,null,null,null,null,null,null,null,{"$f":"IF(AN16=TRUE,\"Ok\",\"Error\")","v":"Error"},"Home\nHealth\nCare\nServices\n= Yes;\nprovide data",null,{"$f":"OR(NHD1_SrvHHCSYN=\"Yes\",NHD1_SrvHHCSYN=\"No\")","v":false},{"$f":"IF(NHD1_SrvHHCSYN=\"Yes\",1,0)","v":0}]
[null,null,null,null,null,null,null,null,null,null,null,"Number of former nursing home residents discharged from this facility that received home health care services from this facility.",null,null,null,null,null,null,null,null,null,null,null,null,null,null,null,null,null,null,null,null,null,null,null,null,null,null,null,{"$f":"SUM(AO16:AO18)","v":0},{"$f":"IF(NHD1_SrvHHCSDisch=\"\",0,1)","v":0}]
[null,null,null,null,null,null,null,null,null,null,null,"Number of individuals who were not former nursing home residents from this facility who received home health care services from this facility.",null,null,null,null,null,null,null,null,null,null,null,null,null,null,null,null,null,null,null,null,null,null,null,null,null,{"$f":"IF(AN18=TRUE,\"Ok\", \"Error\")","v":"Ok"},null,{"$f":"OR(AN17=0,AN17=3)","v":true},{"$f":"IF(NHD1_SrvHHCSIndv=\"\",0,1)","v":0}]
[null,null,null,null,null,"Yes/No",null,null,"-",null,null,"Home Health Care Services Referrals: Residents referred to a home health care agency at the time of discharge.",null,null,null,null,null,null,null,null,null,null,null,null,null,null,null,null,null,null,null,null,null,null,null,null,{"$f":"IF(AN19=TRUE,\"Ok\",\"Error\")","v":"Error"},"HHCS\nReferrals\n=Yes;\nprovide data",null,{"$f":"OR(NHD1_SrvHHRefYN=\"Yes\",NHD1_SrvHHRefYN=\"No\")","v":false},{"$f":"IF(NHD1_SrvHHRefYN=\"Yes\",1,0)","v":0}]
[null,null,null,null,null,null,null,null,null,null,null,"Number of former nursing home residents discharged from this facility that were referred to a home health care agency.",null,null,null,null,null,null,null,null,null,null,null,null,null,null,null,null,null,null,null,null,null,null,null,null,null,null,null,null,{"$f":"IF(NHD1_SrvHHRefDisch=\"\",0,1)","v":0}]
[null,null,null,null,null,"Yes/No",null,null,"-",null,null,"Adult Day Care: Minimal medical and social supervision for the older person who has help at home during the evening, but whose family or spouse is employed during the day.  Services can include general assistance with the needs of daily living, socialization and lunches.  In some instances, restorative and therapeutic programs may be included.",null,null,null,null,null,null,null,null,null,null,null,null,null,null,null,null,null,null,null,null,null,null,null,null,{"$f":"IF(AN21=TRUE,\"Ok\",\"Error\")","v":"Error"},{"$f":"IF(AO22=TRUE,\"Ok\", \"Error\")","v":"Ok"},null,{"$f":"OR(NHD1_SrvADCYN=\"Yes\",NHD1_SrvADCYN=\"No\")","v":false},{"$f":"SUM(AO19:AO20)","v":0}]
[null,null,null,null,null,"Yes/No",null,null,"-",null,null,"Outpatient/Rehabilitation Services: Services that may be obtained at the facility without the need for an overnight stay.  Examples of outpatient services include physician’s’ services, physical, occupational, and respiratory therapies as well as speech and pathology services; testing, fitting or training in the use of prosthetic and orthotic devices; social and psychological services; nursing care; drugs and biologicals that cannot be self-administered; and other items and services that are medically necessary for the rehabilitation of the patient.  Nursing homes may provide one, some or all of these services.",null,null,null,null,null,null,null,null,null,null,null,null,null,null,null,null,null,null,null,null,null,null,null,null,"Error",null,null,{"$f":"OR(NHD1_SrvORSYN=\"Yes\",NHD1_SrvORSYN=\"No\")","v":false},{"$f":"OR(AO21=0,AO21=2)","v":true}]
["Services\n(continued)",null,null,null,null,"Yes/No",null,null,"-",null,null,"Respite Care Services: The resident’s care program involves a short-term stay in the facility for the purpose of providing relief to a nursing facility-eligible resident’s primary home based caregiver(s).  Following this planned short stay, it is anticipated that the resident will return to his or her home in the community.",null,null,null,null,null,null,null,null,null,null,null,null,null,null,null,null,null,null,null,null,null,null,null,null,"Error","Licensed\nSpecialized \nAlzheimer's\nunit = Yes;\nprovide data",null,{"$f":"OR(NHD1_SrvRCSYN=\"Yes\",NHD1_SrvRCSYN=\"No\")","v":false},{"$f":"IF(NHD1_SrvAlzYN=\"Yes\",1,0)","v":0}]
[null,null,null,null,null,"Yes/No",null,null,"-",null,null,"Case Management Services: Services that assist individuals in obtaining home and community based services.  Case managers develop an individual’s plan of care and monitor the provision of services to that individual.",null,null,null,null,null,null,null,null,null,null,null,null,null,null,null,null,null,null,null,null,null,null,null,null,"Error",null,null,{"$f":"OR(NHD1_SrvCMSYN=\"Yes\",NHD1_SrvCMSYN=\"No\")","v":false},{"$f":"IF(NHD1_SrvAlzBed=\"\",0,1)","v":0}]
[null,null,null,null,null,"Yes/No",null,null,"-",null,null,"Homemaker Services: Assistance with general household activities and ongoing monitoring of the well being of the individual.",null,null,null,null,null,null,null,null,null,null,null,null,null,null,null,null,null,null,null,null,null,null,null,null,"Error",{"$f":"IF(AO26=TRUE,\"Ok\", \"Error\")","v":"Ok"},null,{"$f":"OR(NHD1_SrvHSYN=\"Yes\",NHD1_SrvHSYN=\"No\")","v":false},{"$f":"SUM(AO23:AO24)","v":0}]
[null,null,null,null,null,"Yes/No",null,null,"-",null,null,"Personal Care Services: Direct supervision and assistance in daily living skills and activities (e.g., assisting the individual in bathing and grooming.",null,null,null,null,null,null,null,null,null,null,null,null,null,null,null,null,null,null,null,null,null,null,null,null,"Error",null,null,{"$f":"OR(NHD1_SrvPCSYN=\"Yes\",NHD1_SrvPCSYN=\"No\")","v":false},{"$f":"OR(AO25=0,AO25=2)","v":true}]
[null,null,null,null,null,"Yes/No",null,null,"-",null,null,"  Home Delivered Meals",null,null,null,null,null,null,null,null,null,null,null,null,null,null,null,null,null,null,null,null,null,null,null,null,"Error","Secured\nUnit = Yes;\nprovide data",null,{"$f":"OR(NHD1_SrvHDMYN=\"Yes\",NHD1_SrvHDMYN=\"No\")","v":false},{"$f":"IF(NHD1_SrvSecUYN=\"Yes\",1,0)","v":0}]
[null,null,null,null,null,"Yes/No",null,null,"-",null,null,"  Transportation Services",null,null,null,null,null,null,null,null,null,null,null,null,null,null,null,null,null,null,null,null,null,null,null,null,"Error",null,null,{"$f":"OR(NHD1_SrvTSYN=\"Yes\",NHD1_SrvTSYN=\"No\")","v":false},{"$f":"IF(NHD1_SrvSecUBed=\"\",0,1)","v":0}]
[null,null,null,null,null,"Yes/No",null,null,"-",null,null,"Licensed  /  Approved Specialized Unit for Alzheimer’s Patients: Structurally distinct parts of a nursing home designated as special care units for ambulatory residents with dementia or Alzheimer’s Disease and related disorders.",null,null,null,null,null,null,null,null,null,null,null,null,null,null,null,null,null,null,"Number\nof\nBeds",null,null,null,null,null,{"$f":"IF(AN29=TRUE,\"Ok\",\"Error\")","v":"Error"},null,null,{"$f":"OR(NHD1_SrvAlzYN=\"Yes\",NHD1_SrvAlzYN=\"No\")","v":false},{"$f":"SUM(AO27:AO28)","v":0}]
[null,null,null,null,null,"Yes/No",null,null,"-",null,null,"  Specialized Programs for Alzheimer’s Patients",null,null,null,null,null,null,null,null,null,null,null,null,null,null,null,null,null,null,null,null,null,null,null,null,"Error",{"$f":"IF(AO30=TRUE,\"Ok\", \"Error\")","v":"Ok"},null,{"$f":"OR(NHD1_SrvAlzProgYN=\"Yes\",NHD1_SrvAlzProgYN=\"No\")","v":false},{"$f":"OR(AO29=0,AO29=2)","v":true}]
[null,null,null,null,null,"Yes/No",null,null,"-",null,null,"Secured Unit: A facility or distinct part of a facility where residents are intentionally denied egress by any means.",null,null,null,null,null,null,null,null,null,null,null,null,null,null,null,null,null,null,"Number\nof\nBeds",null,null,null,null,null,"Error",null,null,{"$f":"OR(NHD1_SrvSecUYN=\"Yes\",NHD1_SrvSecUYN=\"No\")","v":false},{"$f":"IF(NHD1_SrvBehUYN=\"Yes\",1,0)","v":0}]
[null,null,null,null,null,"Yes/No",null,null,"-",null,null,"Behavioral Health Unit: Structurally distinct parts of a nursing home designated as special care units for patients with dementia, cognitive disorders, psychiatric disorders, post-traumatic stress disorders, mania, schizophrenia, major depression, and mood disorders.",null,null,null,null,null,null,null,null,null,null,null,null,null,null,null,null,null,null,"Number\nof\nBeds",null,null,null,null,null,"Error","Behavior\nHealth\nUnit = Yes;\nprovide data",null,{"$f":"OR(NHD1_SrvBehUYN=\"Yes\",NHD1_SrvBehUYN=\"No\")","v":false},{"$f":"IF(NHD1_SrvBehUBed=\"\",0,1)","v":0}]
[null,null,null,null,null,"Yes/No",null,null,"-",null,null,"Hospice Care:  a program where the resident is identified as being in a program for terminally ill persons where services are necessary for the palliation and management of terminal illness and related conditions whether provided by the nursing home or by contracted services.",null,null,null,null,null,null,null,null,null,null,null,null,null,null,null,null,null,null,null,null,null,null,null,null,"Error",{"$f":"IF(AO34=TRUE,\"Ok\",\"Error\")","v":"Ok"},null,{"$f":"OR(NHD1_SrvHosCareYN=\"Yes\",NHD1_SrvHosCareYN=\"No\")","v":false},{"$f":"SUM(AO31:AO32)","v":0},{"$f":"IF(NHD1_HospiceYN=\"Yes\",1,0)","v":0}]
[null,null,null,null,null,"Yes/No",null,null,"-",null,null,"Are hospice services provided by a separately licensed hospice agency that also reports service utilization via a separated Joint Annual Report?",null,null,null,null,null,null,null,null,null,null,null,null,null,null,null,null,null,null,null,null,null,null,null,null,"Error","Hospice\nService =\nYes;\nprovide data",null,{"$f":"OR(NHD1_HospiceYN=\"Yes\",NHD1_HospiceYN=\"No\")","v":false},{"$f":"OR(AO33=0,AO33=2)","v":true},{"$f":"IF(R35=\"\",0,1)","v":0}]
[null,null,null,null,null,null,null,null,null,null,null,"Specify Facility:",null,null,null,null,null,null,null,null,null,null,null,null,null,null,null,null,null,null,null,null,null,null,null,null,null,null,null,null,null,{"$f":"SUM(AP33:AP34)","v":0}]
[null,null,null,null,null,"Yes/No",null,null,"-",null,null,"Training in Skills Required to Return to the Community: The resident is regularly involved in individual or group activities with a licensed skilled professional to attain goals necessary for community living (e.g., medication management, housework, shopping, using transportation, activities of daily living). May include training family or other caregivers.",null,null,null,null,null,null,null,null,null,null,null,null,null,null,null,null,null,null,null,null,null,null,null,null,{"$f":"IF(AN36=TRUE,\"Ok\",\"Error\")","v":"Error"},{"$f":"IF(AP36=TRUE,\"Ok\",\"Error\")","v":"Ok"},null,{"$f":"OR(NHD1_SrvTrainYN=\"Yes\",NHD1_SrvTrainYN=\"No\")","v":false},null,{"$f":"OR(AP35=0,AP35=2)","v":true}]
["Go to Next Schedule"]
["Return to Main Menu"]
["Go to Error Listing"]

{"sheet":"D-1-Data","index":11,"n_rows":4,"n_cols":44,"rows_kept":4,"cut":false,"hidden":true,"merged":[]}
["Facility ID Info",null,null,"Certificate of Need Projects",null,null,null,null,null,null,null,null,null,null,null,null,"Services"]
[null,null,null,null,"CON Project 1",null,null,"CON Project 2",null,null,"CON Project 3",null,null,"CON Project 4",null,null,"Continuing Care Retirement Community",null,null,null,"Home Health Care Services",null,null,"Home Health Referrals",null,null,null,null,null,null,null,null,null,"Alzheimer's",null,null,"Secured Unit",null,"Behavioral Health Unit",null,"Hospice Care",null,null,"Training   "]
["State ID","NH Name","County","Approved\nCON\nYes/No","Date","Name of\nService or\nActivity","Number\nof\nBeds","Date","Name of\nService or\nActivity","Number\nof\nBeds","Date","Name of\nService or\nActivity","Number\nof\nBeds","Date","Name of\nService or\nActivity","Number\nof\nBeds","Yes/No","Ind Apt\nLiving\nUnits","Assisted\nCare\nUnits","Home for\nthe Aged\nUnits","Yes/No","Res Disch\nfrom this\nfacility","Not former\nNH Res\nRec Serv","Yes/No","Num of NH\nRes Disch\nfrom Facility","Adult\nDay Care\nYes/No","Outpatient/\nRehab\nYes/No","Respite\nCare\nYes/No","Case\nMgmt\nYes/No","Home-\nmaker\nYes/No","Personal\nCare\nYes/No","Home delv\nmeals\nYes/No","Transport-\nation\nYes/No","Licensed\nUnit\nYes/No","Number \nof Beds","Special\nPrograms\nYes/No","Yes/No","Number\nof Beds","Yes/No","Number \nof Beds","Yes/No","Separately\nLic agency\nYes/No","Specify\nagency\nname","To return to\ncommunity\nYes/No"]
[{"$f":"NHA_StateID","v":0},{"$f":"NHA_Name","v":"-"},{"$f":"NHA_County","v":"-"},{"$f":"NHD1_ConProjectYN","v":"-"},{"$f":"IF(NHD1_ConDate1>=1/1/2009,NHD1_ConDate1,\"\")","v":""},{"$f":"NHD1_ConName1","v":0},{"$f":"NHD1_ConBed1","v":0},{"$f":"IF(NHD1_ConDate2>=1/1/2009,NHD1_ConDate2,\"\")","v":""},{"$f":"NHD1_ConName2","v":0},{"$f":"NHD1_ConBed2","v":0},{"$f":"IF(NHD1_ConDate3>=1/1/2009,NHD1_ConDate3,\"\")","v":""},{"$f":"NHD1_ConName3","v":0},{"$f":"NHD1_ConBed3","v":0},{"$f":"IF(NHD1_ConDate4>=1/1/2009,NHD1_ConDate4,\"\")","v":""},{"$f":"NHD1_ConName4","v":0},{"$f":"NHD1_ConBed4","v":0},{"$f":"NHD1_SrvCCRCYN","v":"-"},{"$f":"NHD1_SrvCCRCIAL","v":0},{"$f":"NHD1_SrvCCRCACL","v":0},{"$f":"NHD1_SrvCCRCHA","v":0},{"$f":"NHD1_SrvHHCSYN","v":"-"},{"$f":"NHD1_SrvHHCSDisch","v":0},{"$f":"NHD1_SrvHHCSIndv","v":0},{"$f":"NHD1_SrvHHRefYN","v":"-"},{"$f":"NHD1_SrvHHRefDisch","v":0},{"$f":"NHD1_SrvADCYN","v":"-"},{"$f":"NHD1_SrvORSYN","v":"-"},{"$f":"NHD1_SrvRCSYN","v":"-"},{"$f":"NHD1_SrvCMSYN","v":"-"},{"$f":"NHD1_SrvHSYN","v":"-"},{"$f":"NHD1_SrvPCSYN","v":"-"},{"$f":"NHD1_SrvHDMYN","v":"-"},{"$f":"NHD1_SrvTSYN","v":"-"},{"$f":"NHD1_SrvAlzYN","v":"-"},{"$f":"NHD1_SrvAlzBed","v":0},{"$f":"NHD1_SrvAlzProgYN","v":"-"},{"$f":"NHD1_SrvSecUYN","v":"-"},{"$f":"NHD1_SrvSecUBed","v":0},{"$f":"NHD1_SrvBehUYN","v":"-"},{"$f":"NHD1_SrvBehUBed","v":0},{"$f":"NHD1_SrvHosCareYN","v":"-"},{"$f":"NHD1_HospiceYN","v":"-"},{"$f":"(NHD1_HospiceData)","v":0},{"$f":"NHD1_SrvTrainYN","v":"-"}]

{"sheet":"Sch D-2","index":12,"n_rows":47,"n_cols":41,"rows_kept":47,"cut":false,"hidden":false,"merged":[[34,10,34,35],[32,19,32,22],[33,23,33,31],[31,23,31,31],[32,32,32,35],[41,5,43,9],[43,23,43,31],[41,23,41,31],[29,19,29,22],[31,19,31,22],[37,23,37,31],[39,10,39,35],[36,10,36,35],[35,23,35,31],[35,32,35,35],[35,19,35,22],[35,10,35,18],[33,32,33,35],[33,10,33,18],[32,23,32,31],[1,33,1,35],[1,15,1,32],[29,10,29,18],[40,23,40,31],[30,10,30,35],[31,10,31,18],[6,13,6,15],[41,10,43,22],[37,10,37,18],[38,32,38,35],[42,23,42,31],[38,10,38,31],[40,10,40,18],[40,32,40,35],[43,32,43,35],[37,32,37,35],[37,19,37,22],[40,19,40,22],[25,10,25,18],[33,19,33,22],[32,10,32,18],[27,32,27,35],[28,32,28,35],[29,32,29,35],[14,0,19,4],[30,5,33,9],[28,10,28,18],[23,32,23,35],[24,19,24,22],[24,23,24,31],[23,23,23,31],[23,19,23,22],[25,19,25,22],[31,32,31,35],[25,23,25,35],[28,23,28,31],[27,23,27,31],[28,19,28,22],[12,16,12,35],[10,13,10,15],[4,16,4,35],[9,16,9,35],[6,16,6,35],[3,0,13,4],[22,5,29,9],[45,0,45,35],[27,10,27,18],[44,0,44,35],[18,13,18,15],[13,16,13,35],[15,13,15,15],[17,13,17,15],[20,0,21,4],[15,5,19,9],[29,23,29,31],[6,10,6,12],[20,5,21,9],[8,16,8,35],[19,13,19,15],[21,13,21,15],[17,16,17,35],[20,10,20,12],[1,36,2,36],[7,16,7,35],[5,10,5,12],[8,10,8,12],[0,0,0,35],[46,0,46,35],[22,0,43,4],[34,5,40,9],[41,32,41,35],[42,32,42,35],[24,10,24,18],[3,16,3,35],[5,13,5,15],[20,16,20,35],[19,16,19,35],[16,16,16,35],[11,16,11,35],[20,13,20,15],[18,16,18,35],[17,10,17,12],[25,36,27,36],[30,36,31,36],[26,10,26,35],[27,19,27,22],[0,36,0,38],[24,32,24,35],[21,16,21,35],[23,10,23,18],[21,10,21,12],[40,36,42,36],[34,36,35,36],[10,10,10,12],[10,16,10,35],[19,10,19,12],[22,10,22,35],[18,10,18,12],[13,10,13,12],[15,10,15,12],[12,10,12,12],[2,0,2,35],[14,5,14,35],[3,13,3,15],[16,10,16,12],[11,13,11,15],[5,16,5,35],[16,13,16,15],[15,16,15,35],[4,10,4,12],[1,0,1,3],[1,4,1,8],[1,9,1,14],[3,10,3,12],[3,5,13,9],[4,13,4,15],[9,10,9,12],[11,10,11,12],[9,13,9,15],[7,13,7,15],[7,10,7,12],[8,13,8,15],[12,13,12,15],[13,13,13,15]]}
["2018 - NURSING HOMES - PROVISIONAL",null,null,null,null,null,null,null,null,null,null,null,null,null,null,null,null,null,null,null,null,null,null,null,null,null,null,null,null,null,null,null,null,null,null,null,"'OK' = Likely no Error\n'Error\" = Maybe Error\nin data provided"]
["State ID:",null,null,null,{"$f":"NHA_StateID","v":0},null,null,null,null,"Facility Name:",null,null,null,null,null,{"$f":"NHA_Name","v":"-"},null,null,null,null,null,null,null,null,null,null,null,null,null,null,null,null,null,2018,null,null,"Yes/No\nquestion"]
["Tennessee Joint Annual Report of Nursing Homes - Schedule D - Facilities and Services - Part 2"]
["Skilled\nCare\nProcedures",null,null,null,null,"Special\nTreatments",null,null,null,null,"Yes/No",null,null,"-",null,null,"Chemotherapy: includes any type of anticancer drug given by any route.",null,null,null,null,null,null,null,null,null,null,null,null,null,null,null,null,null,null,null,{"$f":"IF(AN4=TRUE,\"Ok\",\"Error\")","v":"Error"},null,null,{"$f":"OR(NHD2_SCPChemoYN=\"Yes\",NHD2_SCPChemoYN=\"No\")","v":false}]
[null,null,null,null,null,null,null,null,null,null,"Yes/No",null,null,"-",null,null,"Dialysis: includes peritoneal or renal dialysis that occurs at the nursing facility or at another facility.",null,null,null,null,null,null,null,null,null,null,null,null,null,null,null,null,null,null,null,"Error",null,null,{"$f":"OR(NHD2_SCPDialYN=\"Yes\",NHD2_SCPDialYN=\"No\")","v":false}]
[null,null,null,null,null,null,null,null,null,null,"Yes/No",null,null,"-",null,null,"IV Medication: includes any drug or biological given by intravenous push or drip through a central or peripheral port.",null,null,null,null,null,null,null,null,null,null,null,null,null,null,null,null,null,null,null,"Error",null,null,{"$f":"OR(NHD2_SCPIVmedYN=\"Yes\",NHD2_SCPIVmedYN=\"No\")","v":false}]
[null,null,null,null,null,null,null,null,null,null,"Yes/No",null,null,"-",null,null,"Intake / Output: the measurement and evaluation of all fluids the resident received and/or excreted for at least three consecutive shifts.",null,null,null,null,null,null,null,null,null,null,null,null,null,null,null,null,null,null,null,"Error",null,null,{"$f":"OR(NHD2_SCPInOutYN=\"Yes\",NHD2_SCPInOutYN=\"No\")","v":false}]
[null,null,null,null,null,null,null,null,null,null,"Yes/No",null,null,"-",null,null,"Ostomy Care: care that requires nursing assistance. Includes both ostomies used for intake and excretion.",null,null,null,null,null,null,null,null,null,null,null,null,null,null,null,null,null,null,null,"Error",null,null,{"$f":"OR(NHD2_SCPOstoYN=\"Yes\",NHD2_SCPOstoYN=\"No\")","v":false}]
[null,null,null,null,null,null,null,null,null,null,"Yes/No",null,null,"-",null,null,"Oxygen Therapy: continuous or intermittent oxygen via mask, cannula, etc. (does not include hyperbaric oxygen for wound therapy).",null,null,null,null,null,null,null,null,null,null,null,null,null,null,null,null,null,null,null,"Error",null,null,{"$f":"OR(NHD2_SCPOxyYN=\"Yes\",NHD2_SCPOxyYN=\"No\")","v":false}]
[null,null,null,null,null,null,null,null,null,null,"Yes/No",null,null,"-",null,null,"Radiation: includes radiation therapy or having a radiation implant.",null,null,null,null,null,null,null,null,null,null,null,null,null,null,null,null,null,null,null,"Error",null,null,{"$f":"OR(NHD2_SCPRadYN=\"Yes\",NHD2_SCPRadYN=\"No\")","v":false}]
[null,null,null,null,null,null,null,null,null,null,"Yes/No",null,null,"-",null,null,"Suctioning: includes nasopharyngeal or tracheal aspiration only.",null,null,null,null,null,null,null,null,null,null,null,null,null,null,null,null,null,null,null,"Error",null,null,{"$f":"OR(NHD2_SCPSuctYN=\"Yes\",NHD2_SCPSuctYN=\"No\")","v":false}]
[null,null,null,null,null,null,null,null,null,null,"Yes/No",null,null,"-",null,null,"Tracheotomy Care: includes cleansing of tracheotomy and cannula.",null,null,null,null,null,null,null,null,null,null,null,null,null,null,null,null,null,null,null,"Error",null,null,{"$f":"OR(NHD2_SCPTrachYN=\"Yes\",NHD2_SCPTrachYN=\"No\")","v":false}]
[null,null,null,null,null,null,null,null,null,null,"Yes/No",null,null,"-",null,null,"Transfusions: includes transfusions of blood or any blood products (e.g., platelets), which are administered directly into the bloodstream. Do not include transfusions that were administered during dialysis or chemotherapy.",null,null,null,null,null,null,null,null,null,null,null,null,null,null,null,null,null,null,null,"Error",null,null,{"$f":"OR(NHD2_SCPTransYN=\"Yes\",NHD2_SCPTransYN=\"No\")","v":false}]
[null,null,null,null,null,null,null,null,null,null,"Yes/No",null,null,"-",null,null,"Ventilator / Respirator: a ventilator or respirator assures adequate ventilation in residents who are, or who may become, unable to support their own respiration.",null,null,null,null,null,null,null,null,null,null,null,null,null,null,null,null,null,null,null,"Error",null,null,{"$f":"OR(NHD2_SCPVentYN=\"Yes\",NHD2_SCPVentYN=\"No\")","v":false}]
["Skilled\nCare\nProcedures\n(continued)",null,null,null,null,"Indicate therapies that occurred after admission/readmission to the nursing facility, were ordered by a physician, and were performed by a qualified therapist (i.e., one who meets state credentialing requirement or in some instances, under such a person’s direct supervision). Includes only medically necessary therapies furnished after admission to the nursing facility. Also includes only therapies ordered by a physician, based on a therapist’s assessment and treatment plan that is documented in the resident’s clinical record. The therapy treatment may occur either inside or outside the facility. For groups of four or fewer residents per supervising therapist (or assistant), each resident has received the full time in the therapy session."]
[null,null,null,null,null,"Therapies",null,null,null,null,"Yes/No",null,null,"-",null,null,"Occupational therapy: services are provided or directly \nsupervised by a licensed occupational therapist. A qualified \noccupational therapy assistant may provide therapy but not \nsupervise others (aides or volunteers) giving therapy. Include \nservices provided by a qualified occupational therapy assistant \nwho is employed by (or under contract to) the nursing facility \nonly if he or she is under the direction of a licensed \noccupational therapist.",null,null,null,null,null,null,null,null,null,null,null,null,null,null,null,null,null,null,null,"Error",null,null,{"$f":"OR(NHD2_SCPOccupYN=\"Yes\",NHD2_SCPOccupYN=\"No\")","v":false}]
[null,null,null,null,null,null,null,null,null,null,"Yes/No",null,null,"-",null,null,"Physical therapy: services are provided or directly supervised \nby a licensed physical therapist. A qualified physical therapy \nassistant may provide therapy but not supervise others (aides \nor volunteers) giving therapy. Include services provided by a \nqualified physical therapy assistant who is employed by (or \nunder contract to) the nursing facility only if he or she is \nunder the direction of a licensed physical therapist.",null,null,null,null,null,null,null,null,null,null,null,null,null,null,null,null,null,null,null,"Error",null,null,{"$f":"OR(NHD2_SCPPhysYN=\"Yes\",NHD2_SCPPhysYN=\"No\")","v":false}]
[null,null,null,null,null,null,null,null,null,null,"Yes/No",null,null,null,null,null,"Respiratory therapy: services are provided by a qualified \nprofessional (respiratory therapist, trained nurse). A trained \nnurse refers to a nurse who received specific training on the \nadministration of respiratory treatments and procedures. \nTherapies may have been provided at the facility during a \nprevious work experience or as part of an academic program. \nNurses do not necessarily learn these procedures as part of \ntheir formal nurse training programs.  Included treatments are \ncoughing, deep breathing, heated nebulizers, aerosol \ntreatments, assessing breath sounds, and mechanical \nventilation, etc., which must be provided by a qualified \nprofessional (i.e., trained nurse, respiratory therapist). It does \nnot include hand held medication dispensers. Count only the \ntime that the qualified professional spends with the resident.",null,null,null,null,null,null,null,null,null,null,null,null,null,null,null,null,null,null,null,"Error",null,null,{"$f":"OR(NHD2_SCPRespYN=\"Yes\",NHD2_SCPRespYN=\"No\")","v":false}]
[null,null,null,null,null,null,null,null,null,null,"Yes/No",null,null,"-",null,null,"Psychological therapy: provided only by any licensed mental health professional, such as a psychiatrist, psychologist, psychiatric nurse, or psychiatric social worker. Psychiatric nurses usually have a Masters degree and/or certification from the American Nurses Association.  Psychiatric technicians are not considered to be licensed mental health professionals and their services may not be counted in this item. If the state does not license a certain category of professionals working in your facility, you may not count the services of those unlicensed therapists in this item.",null,null,null,null,null,null,null,null,null,null,null,null,null,null,null,null,null,null,null,"Error",null,null,{"$f":"OR(NHD2_SCPPsychYN=\"Yes\",NHD2_SCPPsychYN=\"No\")","v":false}]
[null,null,null,null,null,null,null,null,null,null,"Yes/No",null,null,"-",null,null,"Speech therapies: language pathology and audiology services that are provided by a licensed speech-language pathologist.",null,null,null,null,null,null,null,null,null,null,null,null,null,null,null,null,null,null,null,"Error",null,null,{"$f":"OR(NHD2_SCPSpeecYN=\"Yes\",NHD2_SCPSpeecYN=\"No\")","v":false}]
["Skilled\nCare\nProcedures\n(continued)\n",null,null,null,null,"Enterostomy\nCare",null,null,null,null,"Yes/No",null,null,"-",null,null,"Colostomy Irrigation: care for a colostomy, the surgical creation of an opening between the colon and the surface of the body; also used to refer to the opening, or stoma, so created.",null,null,null,null,null,null,null,null,null,null,null,null,null,null,null,null,null,null,null,"Error",null,null,{"$f":"OR(NHD2_SCPColoYN=\"Yes\",NHD2_SCPColoYN=\"No\")","v":false}]
[null,null,null,null,null,null,null,null,null,null,"Yes/No",null,null,"-",null,null,"Ileostomy: care for an iIeostomy, the surgical creation of an opening into the ileum, usually by establishing an ileal stoma on the abdominal wall.",null,null,null,null,null,null,null,null,null,null,null,null,null,null,null,null,null,null,null,"Error",null,null,{"$f":"OR(NHD2_SCPIleoYN=\"Yes\",NHD2_SCPIleoYN=\"No\")","v":false}]
["Levels of\nResident\nCare",null,null,null,null,"Activities of\nDaily Living\n(ADL)",null,null,null,null," Number of residents on the last day of the reporting period who received assistance\n with these activities of daily living. Residents will be duplicated and should be \n counted in every category that applies.",null,null,null,null,null,null,null,null,null,null,null,null,null,null,null,null,null,null,null,null,null,null,null,null,null,"Activity\nof Daily\nLiving\nADL",null,null,{"$f":"IF(NHD2_ADLBath=\"\",0,1)","v":0},{"$f":"IF(NHD2_ADLEat=\"\",0,1)","v":0}]
[null,null,null,null,null,null,null,null,null,null," Bathing",null,null,null,null,null,null,null,null,null,null,null,null," Toileting",null,null,null,null,null,null,null,null,null,null,null,null,{"$f":"IF(AO25=5,\"Ok\",\"Error\")","v":"Error"},null,null,{"$f":"IF(NHD2_ADLToilet=\"\",0,1)","v":0},{"$f":"IF(NHD2_ADLTrans=\"\",0,1)","v":0}]
[null,null,null,null,null,null,null,null,null,null," Dressing",null,null,null,null,null,null,null,null,null,null,null,null," Eating",null,null,null,null,null,null,null,null,null,null,null,null,null,null,null,{"$f":"IF(NHD2_ADLDress=\"\",0,1)","v":0},{"$f":"SUM(AN23+AN24+AN25+AO23+AO24)","v":0}]
[null,null,null,null,null,null,null,null,null,null," Transferring",null,null,null,null,null,null,null,null,null,null,null,null,null,null,null,null,null,null,null,null,null,null,null,null,null,"Number \nof ADL's\ndata\nprovided",null,null,{"$f":"IF(NHD2_ADLNo=\"\",0,1)","v":0},{"$f":"IF(NHD2_ADLThree=\"\",0,1)","v":0}]
[null,null,null,null,null,null,null,null,null,null,"Number of residents on the last day of the reporting period",null,null,null,null,null,null,null,null,null,null,null,null,null,null,null,null,null,null,null,null,null,null,null,null,null,null,null,null,{"$f":"IF(NHD2_ADLOne=\"\",0,1)","v":0},{"$f":"IF(NHD2_ADLFour=\"\",0,1)","v":0}]
[null,null,null,null,null,null,null,null,null,null," No ADL's",null,null,null,null,null,null,null,null,null,null,null,null," One ADL's",null,null,null,null,null,null,null,null,null,null,null,null,null,null,null,{"$f":"IF(NHD2_ADLTwo=\"\",0,1)","v":0},{"$f":"IF(NHD2_ADL5more=\"\",0,1)","v":0}]
[null,null,null,null,null,null,null,null,null,null," Two ADL's",null,null,null,null,null,null,null,null,null,null,null,null," Three ADL's",null,null,null,null,null,null,null,null,null,null,null,null,{"$f":"IF(AO29=6,\"Ok\",\"Error\")","v":"Error"},null,null,null,{"$f":"SUM(AN26:AO28)","v":0}]
[null,null,null,null,null,null,null,null,null,null," Four ADL's",null,null,null,null,null,null,null,null,null,null,null,null," Five or more ADL's"]
[null,null,null,null,null,"Medication",null,null,null,null," Number of residents on the last day of reporting period that received medication(s).\n Include any of these medications given to the resident by any route in any setting\n (e.g., at the nursing facility, in a hospital emergency room). A list of commonly\n prescribed medications by category by brand is in Appendix A.",null,null,null,null,null,null,null,null,null,null,null,null,null,null,null,null,null,null,null,null,null,null,null,null,null,"Med-\nication\ndata\nprovided",null,null,{"$f":"IF(NHD2_MedAnxiety=\"\",0,1)","v":0},{"$f":"IF(NHD2_MedHypno=\"\",0,1)","v":0}]
[null,null,null,null,null,null,null,null,null,null," Antianxiety",null,null,null,null,null,null,null,null,null,null,null,null," Antidepressants",null,null,null,null,null,null,null,null,null,null,null,null,null,null,null,{"$f":"IF(NHD2_MEDAntiDep=\"\",0,1)","v":0},{"$f":"IF(NHD2_MedDiur=\"\",0,1)","v":0}]
[null,null,null,null,null,null,null,null,null,null," Antipsychotics",null,null,null,null,null,null,null,null,null,null,null,null," Hypnotics",null,null,null,null,null,null,null,null,null,null,null,null,{"$f":"IF(AO34=6,\"Ok\",\"Error\")","v":"Error"},null,null,{"$f":"IF(NHD2_MedAntipsy=\"\",0,1)","v":0},{"$f":"IF(NHD2_Med9Plus=\"\",0,1)","v":0}]
[null,null,null,null,null,null,null,null,null,null," Diuretic",null,null,null,null,null,null,null,null,null,null,null,null," Nine or More Medications",null,null,null,null,null,null,null,null,null,null,null,null,null,null,null,null,{"$f":"SUM(AN31:AO33)","v":0}]
[null,null,null,null,null,"Immunization\nActivity",null,null,null,null," Number of residents given influenza vaccine by this facility or any other source\n during the calendar year:",null,null,null,null,null,null,null,null,null,null,null,null,null,null,null,null,null,null,null,null,null,null,null,null,null,"Immun-\nization\ndata\nprovided"]
[null,null,null,null,null,null,null,null,null,null," Number given by this facility",null,null,null,null,null,null,null,null,null,null,null,null," Number given by any other\n source",null,null,null,null,null,null,null,null,null,null,null,null,null,null,null,{"$f":"IF(NHD2_ImmuGiven=\"\",0,1)","v":0},{"$f":"IF(NHD2_ImmuStaffOtherGiven=\"\",0,1)","v":0}]
[null,null,null,null,null,null,null,null,null,null," Number of staff given influenza vaccine during the calendar year:",null,null,null,null,null,null,null,null,null,null,null,null,null,null,null,null,null,null,null,null,null,null,null,null,null,{"$f":"IF(AO40=8,\"Ok\",\"Error\")","v":"Error"},null,null,{"$f":"IF(NHD2_ImmuOthgiven=\"\",0,1)","v":0},{"$f":"IF(NHD2_ImmuPneuNoDoc=\"\",0,1)","v":0}]
[null,null,null,null,null,null,null,null,null,null," Number given by this facility",null,null,null,null,null,null,null,null,null,null,null,null," Number given by any other\n source",null,null,null,null,null,null,null,null,null,null,null,null,null,null,null,{"$f":"IF(NHD2_ImmuStaffGiven=\"\",0,1)","v":0},{"$f":"IF(NHD2_ImmuPneuOthGiven=\"\",0,1)","v":0}]
[null,null,null,null,null,null,null,null,null,null," Number of new admissions without documentation of ever\n having pneumococcal vaccine:",null,null,null,null,null,null,null,null,null,null,null,null,null,null,null,null,null,null,null,null,null,null,null,null,null,null,null,null,{"$f":"IF(NHD2_ImmuPneuGiven=\"\",0,1)","v":0},1]
[null,null,null,null,null,null,null,null,null,null," Number of new admissions given pneumococcal vaccine during the calendar year:",null,null,null,null,null,null,null,null,null,null,null,null,null,null,null,null,null,null,null,null,null,null,null,null,null,null,null,null,null,{"$f":"SUM(AN36:AO39)","v":1}]
[null,null,null,null,null,null,null,null,null,null," Number given by this facility",null,null,null,null,null,null,null,null,null,null,null,null," Number given by any other\n source",null,null,null,null,null,null,null,null,null,null,null,null,"Mobility\ndata\nprovided"]
[null,null,null,null,null,"Mobility",null,null,null,null," Number of residents as of the last day\n of the reporting period whose mobility\n can be described as:",null,null,null,null,null,null,null,null,null,null,null,null," Bedfast",null,null,null,null,null,null,null,null,null,null,null,null,null,null,null,{"$f":"IF(NHD2_MobBed=\"\",0,1)","v":0},{"$f":"SUM(AN42:AN44)","v":0}]
[null,null,null,null,null,null,null,null,null,null,null,null,null,null,null,null,null,null,null,null,null,null,null," Chair bound",null,null,null,null,null,null,null,null,null,null,null,null,null,null,null,{"$f":"IF(NHD2_MobChair=\"\",0,1)","v":0}]
[null,null,null,null,null,null,null,null,null,null,null,null,null,null,null,null,null,null,null,null,null,null,null," Ambulatory",null,null,null,null,null,null,null,null,null,null,null,null,{"$f":"IF(AO42=3,\"Ok\",\"Error\")","v":"Error"},null,null,{"$f":"IF(NHD2_MobAmbul=\"\",0,1)","v":0}]
["Go to Next Schedule"]
["Return to Main menu"]
["Go to Error Listing"]

{"sheet":"D-2-Data","index":13,"n_rows":4,"n_cols":48,"rows_kept":4,"cut":false,"hidden":true,"merged":[]}
["Facility ID Info",null,null,"Skilled Care Procedures",null,null,null,null,null,null,null,null,null,null,null,null,null,null,null,null,null,"Levels of Resident Care"]
[null,null,null,"Special Treatments",null,null,null,null,null,null,null,null,null,null,"Therapies",null,null,null,null,"Enterostomy Care",null,"Activities of Daily Living (ADL)",null,null,null,null,null,null,null,null,null,null,"Medication",null,null,null,null,null,"Immunization Activity",null,null,null,null,null,null,"Mobility    "]
["State ID","NH Name","County","Chemo-\ntherapy\nYes/No","Dialysis\nYes/No","IV \nMedication\nYes/No","Intake/\nOutput\nYes/No","Ostomy\nCare\nYes/No","Oxygen\nTherapy\nYes/No","Radiation\nYes/No","Suctioning\nYes/No","Trach-\neotomy\nYes/No","Trans-\nFusions\nYes/No","Ventilator/\nRespirator\nYes/No","Occupational\nTherapy\nYes/No","Physical\nTherapy\nYes/No","Respiratory\nTherapy\nYes/No","Psychological\nTherapy\nYes/No","Speech\nTherapy\nYes/No","Colonstomy\nIrrigation","Ileostomy","Bathing","Toileting","Dressing","Eating","Transferring","No \nADL's","One \nADL'S","Two \nADL's","Three \nADL's","Four \nADL's","Five or\nMore \nADL's","Antianiety","Anti-\nDepress-\nants","Ani-\nsychotics","Hypnotics","Diuretic","Nine or\nMore \nMeds","Influenza \ngiven to Res\nby facility","Influenza\ngiven to Res\nby other","Infuenza\nGiven to Staff\nby facility","Influenza \ngiven to staff\nby other","New Admin\nw/out doc\nPneumococcal","Pneumococcal\ngiven by\nfacility","Pneumococcal\ngiven by\nother","Bedfast","Chairbound","Ambulatory"]
[{"$f":"NHA_StateID","v":0},{"$f":"NHA_Name","v":"-"},{"$f":"NHA_County","v":"-"},{"$f":"NHD2_SCPChemoYN","v":"-"},{"$f":"NHD2_SCPDialYN","v":"-"},{"$f":"NHD2_SCPIVmedYN","v":"-"},{"$f":"NHD2_SCPInOutYN","v":"-"},{"$f":"NHD2_SCPOstoYN","v":"-"},{"$f":"NHD2_SCPOxyYN","v":"-"},{"$f":"NHD2_SCPRadYN","v":"-"},{"$f":"NHD2_SCPSuctYN","v":"-"},{"$f":"NHD2_SCPTrachYN","v":"-"},{"$f":"NHD2_SCPTransYN","v":"-"},{"$f":"NHD2_SCPVentYN","v":"-"},{"$f":"NHD2_SCPOccupYN","v":"-"},{"$f":"NHD2_SCPPhysYN","v":"-"},{"$f":"NHD2_SCPRespYN","v":0},{"$f":"NHD2_SCPPsychYN","v":"-"},{"$f":"NHD2_SCPSpeecYN","v":"-"},{"$f":"NHD2_SCPColoYN","v":"-"},{"$f":"NHD2_SCPIleoYN","v":"-"},{"$f":"NHD2_ADLBath","v":0},{"$f":"NHD2_ADLToilet","v":0},{"$f":"NHD2_ADLDress","v":0},{"$f":"NHD2_ADLEat","v":0},{"$f":"NHD2_ADLTrans","v":0},{"$f":"NHD2_ADLNo","v":0},{"$f":"NHD2_ADLOne","v":0},{"$f":"NHD2_ADLTwo","v":0},{"$f":"NHD2_ADLThree","v":0},{"$f":"NHD2_ADLFour","v":0},{"$f":"NHD2_ADL5more","v":0},{"$f":"NHD2_MedAnxiety","v":0},{"$f":"NHD2_MEDAntiDep","v":0},{"$f":"NHD2_MedAntipsy","v":0},{"$f":"NHD2_MedHypno","v":0},{"$f":"NHD2_MedDiur","v":0},{"$f":"NHD2_Med9Plus","v":0},{"$f":"NHD2_ImmuGiven","v":0},{"$f":"NHD2_ImmuOthgiven","v":0},{"$f":"NHD2_ImmuStaffGiven","v":0},{"$f":"NHD2_ImmuStaffOtherGiven","v":0},{"$f":"NHD2_ImmuPneuNoDoc","v":0},{"$f":"NHD2_ImmuPneuGiven","v":0},{"$f":"NHD2_ImmuPneuOthGiven","v":0},{"$f":"NHD2_MobBed","v":0},{"$f":"NHD2_MobChair","v":0},{"$f":"NHD2_MobAmbul","v":0}]

{"sheet":"Sch D-3","index":14,"n_rows":22,"n_cols":43,"rows_kept":22,"cut":false,"hidden":false,"merged":[[9,8,9,10],[7,11,7,35],[8,11,8,35],[8,8,8,10],[10,8,10,10],[7,8,7,10],[20,0,20,35],[11,11,11,35],[12,11,12,35],[14,11,14,35],[19,0,19,35],[15,8,15,10],[11,8,11,10],[12,8,12,10],[11,5,11,7],[18,5,18,7],[18,8,18,10],[18,11,18,35],[21,0,21,35],[17,5,17,7],[17,8,17,10],[14,5,14,7],[14,8,14,10],[15,5,15,7],[3,0,18,4],[4,8,4,10],[15,11,15,35],[12,5,12,7],[8,5,8,7],[9,11,9,35],[7,5,7,7],[10,11,10,35],[9,5,9,7],[10,5,10,7],[15,37,17,37],[13,8,13,10],[13,5,13,7],[13,11,13,35],[17,11,17,35],[16,11,16,35],[16,5,16,7],[16,8,16,10],[4,11,4,35],[5,5,5,35],[6,11,6,35],[6,8,6,10],[4,5,4,7],[6,5,6,7],[0,36,0,38],[2,0,2,35],[0,0,0,35],[1,0,1,3],[1,4,1,8],[1,9,1,14],[1,33,1,35],[1,15,1,32],[2,36,3,36],[3,5,3,35]]}
["2018 -NURSING HOMES -PROVISIONAL",null,null,null,null,null,null,null,null,null,null,null,null,null,null,null,null,null,null,null,null,null,null,null,null,null,null,null,null,null,null,null,null,null,null,null,"'OK' = Likely no Error\n'Error\" = Maybe Error\nin data provided"]
["State ID:",null,null,null,{"$f":"NHA_StateID","v":0},null,null,null,null,"Facility Name:",null,null,null,null,null,{"$f":"NHA_Name","v":"-"},null,null,null,null,null,null,null,null,null,null,null,null,null,null,null,null,null,2018]
["Tennessee Joint Annual Report of Nursing Homes - Schedule D - Facilities & Services - Part 3",null,null,null,null,null,null,null,null,null,null,null,null,null,null,null,null,null,null,null,null,null,null,null,null,null,null,null,null,null,null,null,null,null,null,null,"Yes/No\nquestion"]
["HCBS\nWaiver\nProgram",null,null,null,null,"Elderly and Disabled Home and Community Based Services (HCBS) Statewide Medicaid Waiver \nProgram"]
[null,null,null,null,null,"Yes/No",null,null,"-",null,null,"Did the facility participate in the Home and Community Based Services (HCBS) Medicaid Waiver Program during the reporting period?",null,null,null,null,null,null,null,null,null,null,null,null,null,null,null,null,null,null,null,null,null,null,null,null,{"$f":"IF(AN5=TRUE,\"Ok\",\"Error\")","v":"Error"},null,null,{"$f":"OR(NHD3_HCBSYN=\"Yes\",NHD3_HCBSYN=\"No\")","v":false},{"$f":"IF(NHD3_HCBSYN=\"Yes\", 14,0)","v":0},{"$f":"(AP19)","v":0},{"$f":"SUM(AO5:AP5)","v":0}]
[null,null,null,null,null,"If yes, which services were provided to patients during the reporting period as part of the HCBS waiver:",null,null,null,null,null,null,null,null,null,null,null,null,null,null,null,null,null,null,null,null,null,null,null,null,null,null,null,null,null,null,null,null,null,null,null,{"$f":"OR(AQ5=0,AQ5>=15)","v":true}]
[null,null,null,null,null,"Yes/No",null,null,"-",null,null,"Adult Day Care: A place where a patient can go for more than 3 hours but less \nthan 24 hours during the day to spend time with others ",null,null,null,null,null,null,null,null,null,null,null,null,null,null,null,null,null,null,null,null,null,null,null,null,{"$f":"IF(AND(NHD3_HCBSYN=\"No\",NHD3_AdultDayYN=\"Yes\"),\"Error\",IF(AND(NHD3_HCBSYN=\"Yes\",NHD3_AdultDayYN=\"-\"),\"Error\",IF(AND(NHD3_HCBSYN=\"-\",NHD3_AdultDayYN=\"-\"),\"Error\",\"Ok\")))","v":"Error"},null,null,"",{"$f":"IF(NHD3_AdultDayYN=\"Yes\",1,0)","v":0}]
[null,null,null,null,null,"Yes/No",null,null,"-",null,null,"Case Management: A Case Manager to visit a patient at least once a month to \nbe sure the patient gets needed care.",null,null,null,null,null,null,null,null,null,null,null,null,null,null,null,null,null,null,null,null,null,null,null,null,{"$f":"IF(AND(NHD3_HCBSYN=\"No\",NHD3_CaseMgmtYN=\"Yes\"),\"Error\",IF(AND(NHD3_HCBSYN=\"Yes\",NHD3_CaseMgmtYN=\"-\"),\"Error\",IF(AND(NHD3_HCBSYN=\"-\",NHD3_CaseMgmtYN=\"-\"),\"Error\",\"Ok\")))","v":"Error"},null,null,"",{"$f":"IF(NHD3_CaseMgmtYN=\"Yes\",1,0)","v":0}]
[null,null,null,null,null,"Yes/No",null,null,"-",null,null,"Homemaker: Someone to help a patient with household chores or errands like laundry, sweeping or grocery shopping",null,null,null,null,null,null,null,null,null,null,null,null,null,null,null,null,null,null,null,null,null,null,null,null,{"$f":"IF(AND(NHD3_HCBSYN=\"No\",NHD3_HMakeYN=\"Yes\"),\"Error\",IF(AND(NHD3_HCBSYN=\"Yes\",NHD3_HMakeYN=\"-\"),\"Error\",IF(AND(NHD3_HCBSYN=\"-\",NHD3_HMakeYN=\"-\"),\"Error\",\"Ok\")))","v":"Error"},null,null,"",{"$f":"IF(NHD3_HMakeYN=\"Yes\",1,0)","v":0}]
[null,null,null,null,null,"Yes/No",null,null,"-",null,null,"Personal Care Services: Someone to help a patient with activities of daily living \nlike bathing, toileting or transfers",null,null,null,null,null,null,null,null,null,null,null,null,null,null,null,null,null,null,null,null,null,null,null,null,{"$f":"IF(AND(NHD3_HCBSYN=\"No\",NHD3_PCSYN=\"Yes\"),\"Error\",IF(AND(NHD3_HCBSYN=\"Yes\",NHD3_PCSYN=\"-\"),\"Error\",IF(AND(NHD3_HCBSYN=\"-\",NHD3_PCSYN=\"-\"),\"Error\",\"Ok\")))","v":"Error"},null,null,"",{"$f":"IF(NHD3_PCSYN=\"Yes\",1,0)","v":0}]
[null,null,null,null,null,"Yes/No",null,null,"-",null,null,"Home Delivered Meals: Up to one healthy meal per day delivered to a patient’s home",null,null,null,null,null,null,null,null,null,null,null,null,null,null,null,null,null,null,null,null,null,null,null,null,{"$f":"IF(AND(NHD3_HCBSYN=\"No\",NHD3_HMealsYN=\"Yes\"),\"Error\",IF(AND(NHD3_HCBSYN=\"Yes\",NHD3_HMealsYN=\"-\"),\"Error\",IF(AND(NHD3_HCBSYN=\"-\",NHD3_HMealsYN=\"-\"),\"Error\",\"Ok\")))","v":"Error"},null,null,"",{"$f":"IF(NHD3_HMealsYN=\"Yes\",1,0)","v":0}]
[null,null,null,null,null,"Yes/No",null,null,"-",null,null,"Personal Emergency Response System (PERS): A call button so a patient can \ncall for help in an emergency when the patient’s caregiver is not around",null,null,null,null,null,null,null,null,null,null,null,null,null,null,null,null,null,null,null,null,null,null,null,null,{"$f":"IF(AND(NHD3_HCBSYN=\"No\",NHD3_PERSYN=\"Yes\"),\"Error\",IF(AND(NHD3_HCBSYN=\"Yes\",NHD3_PERSYN=\"-\"),\"Error\",IF(AND(NHD3_HCBSYN=\"-\",NHD3_PERSYN=\"-\"),\"Error\",\"Ok\")))","v":"Error"},null,null,"",{"$f":"IF(NHD3_PERSYN=\"Yes\",1,0)","v":0}]
[null,null,null,null,null,"Yes/No",null,null,"-",null,null,"Inpatient Respite: Short stay in a nursing home or assisted care living facility so \na patient’s caregiver can get some rest",null,null,null,null,null,null,null,null,null,null,null,null,null,null,null,null,null,null,null,null,null,null,null,null,{"$f":"IF(AND(NHD3_HCBSYN=\"No\",NHD3_InResYN=\"Yes\"),\"Error\",IF(AND(NHD3_HCBSYN=\"Yes\",NHD3_InResYN=\"-\"),\"Error\",IF(AND(NHD3_HCBSYN=\"-\",NHD3_InResYN=\"-\"),\"Error\",\"Ok\")))","v":"Error"},null,null,"",{"$f":"IF(NHD3_InResYN=\"Yes\",1,0)","v":0}]
[null,null,null,null,null,"Yes/No",null,null,"-",null,null,"In-home Respite: Someone to come and stay with a patient in the patient’s home \nfor a short time so the patient’s caregiver can get some rest",null,null,null,null,null,null,null,null,null,null,null,null,null,null,null,null,null,null,null,null,null,null,null,null,{"$f":"IF(AND(NHD3_HCBSYN=\"No\",NHD3_IHomeResYN=\"Yes\"),\"Error\",IF(AND(NHD3_HCBSYN=\"Yes\",NHD3_IHomeResYN=\"-\"),\"Error\",IF(AND(NHD3_HCBSYN=\"-\",NHD3_IHomeResYN=\"-\"),\"Error\",\"Ok\")))","v":"Error"},null,null,"",{"$f":"IF(NHD3_IHomeResYN=\"Yes\",1,0)","v":0}]
[null,null,null,null,null,"Yes/No",null,null,"-",null,null,"Assistive Technology: Certain devices that help a patient with activities of daily \nliving like grabbers or big handled eating utensils",null,null,null,null,null,null,null,null,null,null,null,null,null,null,null,null,null,null,null,null,null,null,null,null,{"$f":"IF(AND(NHD3_HCBSYN=\"No\",NHD3_AsTechYN=\"Yes\"),\"Error\",IF(AND(NHD3_HCBSYN=\"Yes\",NHD3_AsTechYN=\"-\"),\"Error\",IF(AND(NHD3_HCBSYN=\"-\",NHD3_AsTechYN=\"-\"),\"Error\",\"Ok\")))","v":"Error"},null,null,"",{"$f":"IF(NHD3_AsTechYN=\"Yes\",1,0)","v":0}]
[null,null,null,null,null,"Yes/No",null,null,"-",null,null,"Personal Care Assistance/Attendant: Someone to help a patient with activities of \ndaily living for longer periods of time or go with a patient to doctor visits or other \nappointments",null,null,null,null,null,null,null,null,null,null,null,null,null,null,null,null,null,null,null,null,null,null,null,null,{"$f":"IF(AND(NHD3_HCBSYN=\"No\",NHD3_PerCareYN=\"Yes\"),\"Error\",IF(AND(NHD3_HCBSYN=\"Yes\",NHD3_PerCareYN=\"-\"),\"Error\",IF(AND(NHD3_HCBSYN=\"-\",NHD3_PerCareYN=\"-\"),\"Error\",\"Ok\")))","v":"Error"},"HCBS\nchecked\nYes,\nbut all\nServices\nnot\nanswered\n",null,"",{"$f":"IF(NHD3_PerCareYN=\"Yes\",1,0)","v":0}]
[null,null,null,null,null,"Yes/No",null,null,"-",null,null,"Pest Control: Someone to come to a patient’s home a few times a year to spray \nfor bugs or get rid of mice and rats",null,null,null,null,null,null,null,null,null,null,null,null,null,null,null,null,null,null,null,null,null,null,null,null,{"$f":"IF(AND(NHD3_HCBSYN=\"No\",NHD3_PestCYN=\"Yes\"),\"Error\",IF(AND(NHD3_HCBSYN=\"Yes\",NHD3_PestCYN=\"-\"),\"Error\",IF(AND(NHD3_HCBSYN=\"-\",NHD3_PestCYN=\"-\"),\"Error\",\"Ok\")))","v":"Error"},null,null,"",{"$f":"IF(NHD3_PestCYN=\"Yes\",1,0)","v":0}]
[null,null,null,null,null,"Yes/No",null,null,"-",null,null,"Assisted Care Living Facility: A place where a patient can live that will help the \npatient with personal care needs, homemaker services, and being sure the \npatient takes needed medicines—Medicaid can not pay for room and board",null,null,null,null,null,null,null,null,null,null,null,null,null,null,null,null,null,null,null,null,null,null,null,null,{"$f":"IF(AND(NHD3_HCBSYN=\"No\",NHD3_ACLFYN=\"Yes\"),\"Error\",IF(AND(NHD3_HCBSYN=\"Yes\",NHD3_ACLFYN=\"-\"),\"Error\",IF(AND(NHD3_HCBSYN=\"-\",NHD3_ACLFYN=\"-\"),\"Error\",\"Ok\")))","v":"Error"},null,null,"",{"$f":"IF(NHD3_ACLFYN=\"Yes\",1,0)","v":0},""]
[null,null,null,null,null,"Yes/No",null,null,"-",null,null,"Minor Home Modifications: Certain devices or changes to a patient home to \nmake it easier and safer for the patient to be in the patient’s home like ramps \nor grab-bars",null,null,null,null,null,null,null,null,null,null,null,null,null,null,null,null,null,null,null,null,null,null,null,null,{"$f":"IF(AND(NHD3_HCBSYN=\"No\",NHD3_MinHomeYN=\"Yes\"),\"Error\",IF(AND(NHD3_HCBSYN=\"Yes\",NHD3_MinHomeYN=\"-\"),\"Error\",IF(AND(NHD3_HCBSYN=\"-\",NHD3_MinHomeYN=\"-\"),\"Error\",\"Ok\")))","v":"Error"},{"$f":"IF(AP6=TRUE,\"Ok\", \"Error\")","v":"Ok"},null,"",{"$f":"IF(NHD3_MinHomeYN=\"Yes\",1,0)","v":0},{"$f":"SUM(AO7:AO19)","v":0}]
["Go to Next Schedule",null,null,null,null,null,null,null,null,null,null,null,null,null,null,null,null,null,null,null,null,null,null,null,null,null,null,null,null,null,null,null,null,null,null,null,null,null,null,""]
["Return to Main Menu"]
["Go to Error Listing"]

{"sheet":"D-3-Data","index":15,"n_rows":4,"n_cols":22,"rows_kept":4,"cut":false,"hidden":true,"merged":[]}
["Facility ID Info",null,null,"Home and Community Based Services (HCBS)"]
[null,null,null,null,"HCBS Services"]
["State ID","NH Name","County","Participate\nin HCBS\nYes/No","Adult \nDay Care\nYes/No","Case \nMgmt\nYes/No","Homemaker\nYes/No","Personal\nCare Serv\nYes/No","Home Deliv\nMeals\nYes/No","PERS\nYes/No","InPatient \nRespite\nYes/No","In-home \nRespite\nYes/No","Assistive\nTechnology\nYes/No","Personal\nCare Assist\nYes/No","Pest Control\nYes/No","ACLF\nYes/No","Minor Home \nModification\nYes/No","","","","",""]
[{"$f":"NHA_StateID","v":0},{"$f":"NHA_Name","v":"-"},{"$f":"NHA_County","v":"-"},{"$f":"NHD3_HCBSYN","v":"-"},{"$f":"NHD3_AdultDayYN","v":"-"},{"$f":"NHD3_CaseMgmtYN","v":"-"},{"$f":"NHD3_HMakeYN","v":"-"},{"$f":"NHD3_PCSYN","v":"-"},{"$f":"NHD3_HMealsYN","v":"-"},{"$f":"NHD3_PERSYN","v":"-"},{"$f":"NHD3_InResYN","v":"-"},{"$f":"NHD3_IHomeResYN","v":"-"},{"$f":"NHD3_AsTechYN","v":"-"},{"$f":"NHD3_PerCareYN","v":"-"},{"$f":"NHD3_PestCYN","v":"-"},{"$f":"NHD3_ACLFYN","v":"-"},{"$f":"NHD3_MinHomeYN","v":"-"}]

{"sheet":"Sch E","index":16,"n_rows":67,"n_cols":43,"rows_kept":67,"cut":false,"hidden":false,"merged":[[4,29,4,35],[22,37,23,37],[26,8,26,10],[15,14,15,20],[15,29,15,35],[14,14,14,20],[32,29,32,35],[25,29,25,35],[28,8,28,28],[31,11,31,13],[30,14,30,28],[30,8,30,10],[31,8,31,10],[29,14,29,28],[25,8,25,28],[26,14,26,35],[30,11,30,13],[28,29,28,35],[14,29,14,35],[23,8,23,28],[30,29,30,35],[29,29,29,35],[26,11,26,13],[19,11,19,13],[18,8,18,28],[34,36,37,36],[34,14,34,20],[34,21,34,28],[34,29,34,35],[36,29,36,35],[37,21,37,28],[37,29,37,35],[35,29,35,35],[29,11,29,13],[29,8,29,10],[27,29,27,35],[27,8,27,28],[1,33,1,35],[1,15,1,32],[22,8,22,28],[16,8,16,35],[15,21,15,28],[24,8,24,10],[24,11,24,13],[23,29,23,35],[17,8,17,10],[11,21,11,28],[17,11,17,13],[21,8,21,28],[21,29,21,35],[19,14,19,35],[17,14,17,35],[22,29,22,35],[9,8,9,10],[10,14,10,35],[10,8,15,13],[18,29,18,35],[20,29,20,35],[24,14,24,35],[20,8,20,28],[19,8,19,10],[41,0,41,35],[36,21,36,28],[36,14,36,20],[34,8,38,13],[38,21,38,28],[38,29,38,35],[28,0,38,2],[28,3,38,7],[38,14,38,20],[32,8,32,28],[39,0,39,35],[40,0,40,35],[37,14,37,20],[33,11,33,13],[35,21,35,28],[31,14,31,28],[35,14,35,20],[33,14,33,35],[33,8,33,10],[31,29,31,35],[11,14,11,20],[13,29,13,35],[13,14,13,20],[9,14,9,35],[7,29,7,35],[6,29,6,35],[7,8,7,10],[6,14,6,28],[6,11,6,13],[8,29,8,35],[6,8,6,10],[7,14,7,28],[7,11,7,13],[8,8,8,28],[12,29,12,35],[12,14,12,20],[13,21,13,28],[0,36,0,38],[3,29,3,35],[0,0,0,35],[1,37,3,37],[14,21,14,28],[3,8,3,28],[5,11,5,13],[5,29,5,35],[2,0,2,35],[3,0,27,2],[1,0,1,3],[1,4,1,8],[1,9,1,14],[9,11,9,13],[3,3,15,7],[5,14,5,28],[4,8,4,10],[4,11,4,13],[4,14,4,28],[12,21,12,28],[16,3,27,7],[9,37,12,37],[5,8,5,10],[11,29,11,35]]}
["2018 - NURSING HOMES - PROVISIONAL",null,null,null,null,null,null,null,null,null,null,null,null,null,null,null,null,null,null,null,null,null,null,null,null,null,null,null,null,null,null,null,null,null,null,null,"'OK' = Likely no Error\n'Error\" = Maybe Error\nin data provided"]
["State ID:",null,null,null,{"$f":"NHA_StateID","v":0},null,null,null,null,"Facility Name:",null,null,null,null,null,{"$f":"NHA_Name","v":"-"},null,null,null,null,null,null,null,null,null,null,null,null,null,null,null,null,null,2018,null,null,null,"Type =\nYes,\nNumber\nof beds\ndata\nprovided"]
["Tennessee Joint Annual Report of Nursing Homes -Schedule E - Beds"]
["Beds",null,null,"Licensed\nBeds",null,null,null,null,"Type",null,null,null,null,null,null,null,null,null,null,null,null,null,null,null,null,null,null,null,null,"Number of Licensed Beds",null,null,null,null,null,null,"Yes/No\nquestion"]
[null,null,null,null,null,null,null,null,"Yes/No",null,null,"-",null,null,"Medicare Certified Only",null,null,null,null,null,null,null,null,null,null,null,null,null,null,null,null,null,null,null,null,null,{"$f":"IF(AN5=TRUE,\"Ok\",\"Error\")","v":"Error"},{"$f":"IF(AQ10=TRUE,\"Ok\", \"Error\")","v":"Ok"},null,{"$f":"OR(NHE_BedMCOYN=\"Yes\",NHE_BedMCOYN=\"No\")","v":false},{"$f":"IF(NHE_BedMCOYN=\"Yes\",1,0)","v":0},{"$f":"IF(NHE_BedMCO>=1,1,0)","v":0},{"$f":"SUM(AO5:AP5)","v":0}]
[null,null,null,null,null,null,null,null,"Yes/No",null,null,"-",null,null,"Medicaid/TennCare Certified Only",null,null,null,null,null,null,null,null,null,null,null,null,null,null,null,null,null,null,null,null,null,{"$f":"IF(AN6=TRUE,\"Ok\",\"Error\")","v":"Error"},{"$f":"IF(AQ11=TRUE,\"Ok\", \"Error\")","v":"Ok"},null,{"$f":"OR(NHE_BedMCaidTCYN=\"Yes\",NHE_BedMCaidTCYN=\"No\")","v":false},{"$f":"IF(NHE_BedMCaidTCYN=\"Yes\",1,0)","v":0},{"$f":"IF(NHE_BedMCaidTC>=1,1,0)","v":0},{"$f":"SUM(AO6:AP6)","v":0}]
[null,null,null,null,null,null,null,null,"Yes/No",null,null,"-",null,null,"Medicare and Medicaid/TennCare Certified",null,null,null,null,null,null,null,null,null,null,null,null,null,null,null,null,null,null,null,null,null,{"$f":"IF(AN7=TRUE,\"Ok\",\"Error\")","v":"Error"},{"$f":"IF(AQ12=TRUE,\"Ok\", \"Error\")","v":"Ok"},null,{"$f":"OR(NHE_BedMCareMTCYN=\"Yes\",NHE_BedMCareMTCYN=\"No\")","v":false},{"$f":"IF(NHE_BedMCareMTCYN=\"Yes\",1,0)","v":0},{"$f":"IF(NHE_BedMCareMTC>=1,1,0)","v":0},{"$f":"SUM(AO7:AP7)","v":0}]
[null,null,null,null,null,null,null,null,"Yes/No",null,null,"-",null,null,"Non-Certified (licensed only) Beds",null,null,null,null,null,null,null,null,null,null,null,null,null,null,null,null,null,null,null,null,null,{"$f":"IF(AN8=TRUE,\"Ok\",\"Error\")","v":"Error"},{"$f":"IF(AQ13=TRUE,\"OK\", \"Error\")","v":"OK"},null,{"$f":"OR(NHE_BedNonCertYN=\"Yes\",NHE_BedNonCertYN=\"No\")","v":false},{"$f":"IF(NHE_BedNonCertYN=\"Yes\",1,0)","v":0},{"$f":"IF(NHE_BedNonCert>=1,1,0)","v":0},{"$f":"SUM(AO8:AP8)","v":0}]
[null,null,null,null,null,null,null,null,"                                  Total Licensed Beds",null,null,null,null,null,null,null,null,null,null,null,null,null,null,null,null,null,null,null,null,{"$f":"SUM(AD5:AJ8)","v":0},null,null,null,null,null,null,null,""]
[null,null,null,null,null,null,null,null,"Yes/No",null,null,"-",null,null,"Were there changes in the number of licensed beds between the first \nand last day of the reporting period?  If yes, complete the 'Opened' \nand/or 'Discontinued' and 'Date' fields below.",null,null,null,null,null,null,null,null,null,null,null,null,null,null,null,null,null,null,null,null,null,{"$f":"IF(AN10=TRUE,\"Ok\",\"Error\")","v":"Error"},"Change\nin\nlicensed\nbed\ncount =\nYes,\ndata\nprovided",null,{"$f":"OR(NHE_BedNumChange=\"Yes\",NHE_BedNumChange=\"No\")","v":false},{"$f":"IF(NHE_BedNumChange=\"Yes\",2,0)","v":0},null,{"$f":"OR(AQ5=0,AQ5=2)","v":true}]
[null,null,null,null,null,null,null,null,"Licensed Beds\nOpened and\nDiscontinued",null,null,null,null,null,"Enter as many rows as needed to explain changes to licensed bed count.",null,null,null,null,null,null,null,null,null,null,null,null,null,null,null,null,null,null,null,null,null,null,null,null,null,{"$f":"IF(NHE_BedOpn1=\"\",0,1)","v":0},null,{"$f":"OR(AQ6=0,AQ6=2)","v":true}]
[null,null,null,null,null,null,null,null,null,null,null,null,null,null,"Licensed Beds\nOpened",null,null,null,null,null,null,"Licensed Beds\nDiscontinued",null,null,null,null,null,null,null,"Date",null,null,null,null,null,null,null,null,null,null,{"$f":"IF(NHE_BedDisc1=\"\",0,1)","v":0},null,{"$f":"OR(AQ7=0,AQ7=2)","v":true}]
[null,null,null,null,null,null,null,null,null,null,null,null,null,null,null,null,null,null,null,null,null,null,null,null,null,null,null,null,null,null,null,null,null,null,null,null,null,null,null,null,{"$f":"IF(NHE_BedDate1=\"\",0,1)","v":0},null,{"$f":"OR(AQ8=0,AQ8=2)","v":true}]
[null,null,null,null,null,null,null,null,null,null,null,null,null,null,null,null,null,null,null,null,null,null,null,null,null,null,null,null,null,null,null,null,null,null,null,null,null,{"$f":"IF(AO15=TRUE,\"Ok\", \"Error\")","v":"Ok"},null,null,{"$f":"SUM(AO10:AO13)","v":0}]
[null,null,null,null,null,null,null,null,null,null,null,null,null,null,null,null,null,null,null,null,null,null,null,null,null,null,null,null,null,null,null,null,null,null,null,null,null,null,null,null,{"$f":"OR(AO14=0,AO14=5)","v":true}]
[]
[null,null,null,null,null,null,null,null,"Levels of care (Level I and Level II):  The intensity of care provided to nursing home \npatients depends on their medical needs.  Most patients need a less intensive level \nof care that the Medicaid program calls Level I (formerly called intermediate care), \nwhile others need a more intensive level of care that Medicaid calls Level II. The \ncost of Level II is higher than that of Level I, both to private pay patients and to the \nMedicaid program.  The Medicare program is called skilled nursing care and  does not cover Level I and Level II services, but covers skilled care services delivered to Medicare patients only in certain circumstances and in Medicare Certified Facilities.",null,null,null,null,null,null,null,null,null,null,null,null,null,null,null,null,null,null,null,null,null,null,null,null,null,null,null,null,"Medicare"]
[null,null,null,null,null,null,null,null,"Yes/No",null,null,"-",null,null,"Did you enter the Medicare program during this reporting period?",null,null,null,null,null,null,null,null,null,null,null,null,null,null,null,null,null,null,null,null,null,{"$f":"IF(AQ18=TRUE, \"Ok\",\"Error\")","v":"Error"},"Enter Date",null,{"$f":"OR(MedicareWithdate=\"Yes\",MedicareWithdate=\"No\")","v":false},{"$f":"OR(AO21=0,AO21=2)","v":true},null,{"$f":"OR(MedicareAppdate=\"Yes\",MedicareAppdate=\"No\")","v":false}]
[null,null,null,null,null,null,null,null,"If Yes, Medicare approval date",null,null,null,null,null,null,null,null,null,null,null,null,null,null,null,null,null,null,null,null,null,null,null,null,null,null,null,null,{"$f":"IF(AQ22=TRUE,\"Ok\", \"Error\")","v":"Ok"},null,null,{"$f":"IF(MedicareWithdate=\"Yes\",1,0)","v":0},null,{"$f":"IF(MedicareAppdate=\"Yes\",1,0)","v":0}]
[null,null,null,null,null,null,null,null,"Yes/No",null,null,"-",null,null,"Did you withdraw from the Medicare program during this reporting period?",null,null,null,null,null,null,null,null,null,null,null,null,null,null,null,null,null,null,null,null,null,{"$f":"IF(AN18=TRUE,\"Ok\",\"Error\")","v":"Error"},null,null,null,{"$f":"IF(MedicareWithEnterdate=\"\",0,1)","v":0},null,{"$f":"IF(MedicareEnterdate=\"\",0,1)","v":0}]
[null,null,null,null,null,null,null,null,"If Yes, Medicare withdrawal date",null,null,null,null,null,null,null,null,null,null,null,null,null,null,null,null,null,null,null,null,null,null,null,null,null,null,null,null,{"$f":"IF(AO18=TRUE,\"Ok\", \"Error\")","v":"Ok"},"Provider Number",null,{"$f":"SUM(AO19:AO20)","v":0},null,{"$f":"SUM(AQ19:AQ20)","v":0}]
[null,null,null,null,null,null,null,null,"Medicare Provider Number",null,null,null,null,null,null,null,null,null,null,null,null,null,null,null,null,null,null,null,null,null,null,null,null,null,null,null,null,null,{"$f":"IF(NHE_MCarePNum=\"\",\"Error\", \"Ok\")","v":"Error"},null,null,null,{"$f":"OR(AQ21=0,AQ21=2)","v":true}]
[null,null,null,null,null,null,null,null,"Medicaid/TennCare Provider Number Level I",null,null,null,null,null,null,null,null,null,null,null,null,null,null,null,null,null,null,null,null,null,null,null,null,null,null,null,null,"Medicaid/\nTennCare",{"$f":"IF(NHE_MCaidTC1PNum=\"\",\"Error\", \"Ok\")","v":"Error"},null,{"$f":"IF(NHE_EnterMTCYN=\"Yes\",1,0)","v":0}]
[null,null,null,null,null,null,null,null,"Medicaid/TennCare Provider Number Level II",null,null,null,null,null,null,null,null,null,null,null,null,null,null,null,null,null,null,null,null,null,null,null,null,null,null,null,null,null,{"$f":"IF(NHE_MCaidTC2PNum=\"\",\"error\", \"Ok\")","v":"error"},null,{"$f":"IF(NHE_EnterMTCdate=\"\",0,1)","v":0}]
[null,null,null,null,null,null,null,null,"Yes/No",null,null,"-",null,null,"Did you enter the Medicaid/TennCare program during this reporting period?",null,null,null,null,null,null,null,null,null,null,null,null,null,null,null,null,null,null,null,null,null,{"$f":"IF(AN25=TRUE,\"Ok\",\"Error\")","v":"Error"},"Enter\nDate",null,{"$f":"OR(NHE_EnterMTCYN=\"Yes\",NHE_EnterMTCYN=\"No\")","v":false},{"$f":"SUM(AO23:AO24)","v":0}]
[null,null,null,null,null,null,null,null,"If Yes, Medicaid/TennCare approval date",null,null,null,null,null,null,null,null,null,null,null,null,null,null,null,null,null,null,null,null,null,null,null,null,null,null,null,null,{"$f":"IF(AO26=TRUE,\"Ok\", \"Error\")","v":"Ok"},null,null,{"$f":"OR(AO25=0,AO25=2)","v":true}]
[null,null,null,null,null,null,null,null,"Yes/No",null,null,"-",null,null,"Did you withdraw from the Medicaid/TennCare program during this reporting period?",null,null,null,null,null,null,null,null,null,null,null,null,null,null,null,null,null,null,null,null,null,{"$f":"IF(AN27=TRUE,\"Ok\",\"Error\")","v":"Error"},"Withdraw\nDate",null,{"$f":"OR(NHE_WdrawMTCYN=\"Yes\",NHE_WdrawMTCYN=\"No\")","v":false},{"$f":"IF(NHE_WdrawMTCdate=\"\",0,1)","v":0}]
[null,null,null,null,null,null,null,null,"If Yes, Medicaid/TennCare withdrawal date",null,null,null,null,null,null,null,null,null,null,null,null,null,null,null,null,null,null,null,null,null,null,null,null,null,null,null,null,{"$f":"IF(AO29=TRUE,\"Ok\", \"Error\")","v":"Ok"},null,null,{"$f":"SUM(AO26:AO27)","v":0}]
["Beds",null,null,"Beds Set\nUp and\nStaffed",null,null,null,null,"Type",null,null,null,null,null,null,null,null,null,null,null,null,null,null,null,null,null,null,null,null,"Number of Beds on the last day of the reporting period",null,null,null,null,null,null,null,"Beds\ndata\nprovided",null,null,{"$f":"OR(AO28=0,AO28=2)","v":true}]
[null,null,null,null,null,null,null,null,"Yes/No",null,null,"Yes",null,null,"Number of Beds in Private Rooms. A private room contains one bed.",null,null,null,null,null,null,null,null,null,null,null,null,null,null,null,null,null,null,null,null,null,{"$f":"IF(AN30=TRUE,\"Ok\",\"Error\")","v":"Ok"},{"$f":"IF(AO33=TRUE,\"Ok\", \"Error\")","v":"Error"},null,{"$f":"OR(NHE_PrivateYN=\"Yes\",NHE_PrivateYN=\"No\")","v":true},{"$f":"IF(NHE_PrivateYN=\"Yes\",1,10)","v":1},{"$f":"IF(NHE_SemiPYN=\"Yes\",1,10)","v":10}]
[null,null,null,null,null,null,null,null,"Yes/No",null,null,"-",null,null,"Number of Beds in Semi-Private Rooms. A semi-private room contains two beds.",null,null,null,null,null,null,null,null,null,null,null,null,null,null,null,null,null,null,null,null,null,{"$f":"IF(AN31=TRUE,\"Ok\",\"Error\")","v":"Error"},{"$f":"IF(AP33=TRUE,\"Ok\", \"Error\")","v":"Ok"},null,{"$f":"OR(NHE_SemiPYN=\"Yes\",NHE_SemiPYN=\"No\")","v":false},{"$f":"IF(NHE_Private=\"\",0,1)","v":0},{"$f":"IF(NHE_SemiP=\"\",0,1)","v":0}]
[null,null,null,null,null,null,null,null,"Yes/No",null,null,"-",null,null,"Number of Beds in Wards.  A ward is a room that contains three or more beds.",null,null,null,null,null,null,null,null,null,null,null,null,null,null,null,null,null,null,null,null,null,{"$f":"IF(AN32=TRUE,\"Ok\",\"Error\")","v":"Error"},{"$f":"IF(AP37=TRUE,\"Ok\", \"Error\")","v":"Ok"},null,{"$f":"OR(NHE_WardsYN=\"Yes\",NHE_WardsYN=\"No\")","v":false},{"$f":"SUM(AO30:AO31)","v":1},{"$f":"SUM(AP30:AP31)","v":10}]
[null,null,null,null,null,null,null,null,"                Total Beds Set up and Staffed",null,null,null,null,null,null,null,null,null,null,null,null,null,null,null,null,null,null,null,null,{"$f":"SUM(AD30:AJ32)","v":0},null,null,null,null,null,null,null,"",null,null,{"$f":"OR(AO32=10,AO32=2)","v":false},{"$f":"OR(AP32=10,AP32=2)","v":true}]
[null,null,null,null,null,null,null,null,"Yes/No",null,null,"-",null,null,"Were there changes in the number of beds set up and staffed \nbetween the first and last day of the reporting period? If yes, \nEnter as many rows as needed to explain changes.",null,null,null,null,null,null,null,null,null,null,null,null,null,null,null,null,null,null,null,null,null,{"$f":"IF(AN34=TRUE,\"Ok\",\"Error\")","v":"Error"},null,null,{"$f":"OR(NHE_BedChangeYN=\"Yes\",NHE_BedChangeYN=\"No\")","v":false},"",{"$f":"IF(NHE_WardsYN=\"Yes\",1,10)","v":10}]
[null,null,null,null,null,null,null,null,"Staffed Beds\nOpened and\nDiscontinued",null,null,null,null,null,"Staffed Beds\nOpened",null,null,null,null,null,null,"Staffed Beds\nDiscontinued",null,null,null,null,null,null,null,"Date",null,null,null,null,null,null,"Beds\nSet up &\nStaffed\nChanged\ndata\nprovided","",null,{"$f":"IF(NHE_BedChangeYN=\"Yes\",2,0)","v":0},{"$f":"IF(NHE_SBedDisc1=\"\",0,1)","v":0},{"$f":"IF(NHE_Wards=\"\",0,1)","v":0}]
[null,null,null,null,null,null,null,null,null,null,null,null,null,null,null,null,null,null,null,null,null,null,null,null,null,null,null,null,null,null,null,null,null,null,null,null,null,null,null,{"$f":"IF(NHE_SBedOpn1=\"\",0,1)","v":0},{"$f":"IF(NHE_SBedDate1=\"\",0,2)","v":0},{"$f":"SUM(AP34:AP35)","v":10}]
[null,null,null,null,null,null,null,null,null,null,null,null,null,null,null,null,null,null,null,null,null,null,null,null,null,null,null,null,null,null,null,null,null,null,null,null,null,null,null,{"$f":"SUM(AN35:AO36)","v":0},{"$f":"OR(AN37=0,AN37=5)","v":true},{"$f":"OR(AP36=10,AP36=2)","v":true}]
[]
[null,null,null,null,null,null,null,null,null,null,null,null,null,null,null,null,null,null,null,null,null,null,null,null,null,null,null,null,null,null,null,null,null,null,null,null,{"$f":"IF(AO37=TRUE,\"Ok\",\"Error\")","v":"Ok"}]
["Go to Next Schedule"]
["Return to Main Menu"]
["Go to Error Listing",null,null,null,null,null,null,null,null,null,null,null,null,null,null,null,null,null,null,null,null,null,null,null,null,null,null,null,null,null,null,null,null,null,null,null,null,null,null,{"$f":"(NHE_TotBeds*365)","v":0},{"$f":"(NHF2_RDCTotTot*0.5)","v":0}]
["",null,null,null,null,null,null,null,null,null,null,null,null,null,null,null,null,null,null,null,null,null,null,null,null,null,null,null,null,null,null,null,null,null,null,null,null,null,null,null,{"$f":"(NHF2_RDCTotTot*1.05)","v":0}]
[""]
[""]
[""]
[""]
[""]
[""]
[""]
[""]
[""]
[""]
[""]
[""]
[""]
[""]
[""]
[""]
[""]
[""]
[""]
[""]
[""]
[""]
[""]
["","","","","","","","","","","","","","","","","","","","","","","","","","","","","","","","","","","",""]

{"sheet":"E-Data","index":17,"n_rows":4,"n_cols":55,"rows_kept":4,"cut":false,"hidden":true,"merged":[]}
["Facility ID Info",null,null,"Beds"]
[null,null,null,"Licensed Beds",null,null,null,null,null,null,null,null,null,null,null,null,null,null,null,null,null,null,null,null,null,null,null,null,null,null,null,null,null,null,null,null,"Beds Set Up and Staffed"]
["State ID","NH Name","County","Medicare\nCertified\nYes/No","Medicare\nCertified\nBed Num","Medicaid/TC\nCertified\nYes/No","Medicaid/TC\nCertified\nBed Num","Medicare &\nMedicaid/TC\nYes/No","Medicare &\nMedicaid/TC\nBed Num","Non-Cert\nLicensed\nYes/No","Non-Cert\nLicensed\nBed Num","Total\nLicensed\nBeds","Bed Num\nChanged\nYes/No","Licensed\nBed Open\n1","Licensed\nBed Disc\n1","Licensed\nBed Date\n1","Licensed\nBed Open\n2","Licensed\nBed Disc\n2","Licensed\nBed Date\n2","Licensed\nBed Open\n3","Licensed\nBed Disc\n3","Licensed\nBed Date\n3","Licensed\nBed Open\n4","Licensed\nBed Disc\n4","Licensed\nBed Date\n4","Medicare\nEnter Prog\nYes/No","Medicare\napproval\ndate","Medicare\nwithdraw\nYes/No","Medicare\nwithdraw\ndate","Medicare\nProvider\nNumber","Medicaid/TC\nNumber\nLevel II","Medicaid/TC\nNumber\nLevel 1","Medicaid/TC\nEnter Prog\nYes/No","Medicaid/TC\napproval\ndate","Medicaid/TC\nwithdraw\nYes/No","Medicaid/TC\nwithdraw\ndate","Private\nRoom\nYes/No","Number\nof Private \nBeds","Semi-Private\nRooms\nYes/No","Number of\nSemi-Private\nBeds","Wards\nYes/No","Number of\nWard\nBeds","Total Beds\nSet up &\nStaffed","Staffed\nBed Open\n1","Staffed\nBed Disc\n1","Staffed \nBed Date\n1","Staffed\nBed Open\n2","Staffed\nBed Disc\n2","Staffed \nBed Date\n2","Staffed\nBed Open\n3","Staffed\nBed Disc\n3","Staffed \nBed Date\n3","Staffed\nBed Open\n4","Staffed\nBed Disc\n4","Staffed \nBed Date\n4"]
[{"$f":"NHA_StateID","v":0},{"$f":"NHA_Name","v":"-"},{"$f":"NHA_County","v":"-"},{"$f":"NHE_BedMCOYN","v":"-"},{"$f":"NHE_BedMCO","v":0},{"$f":"NHE_BedMCaidTCYN","v":"-"},{"$f":"NHE_BedMCaidTC","v":0},{"$f":"NHE_BedMCareMTCYN","v":"-"},{"$f":"NHE_BedMCareMTC","v":0},{"$f":"NHE_BedNonCertYN","v":"-"},{"$f":"NHE_BedNonCert","v":0},{"$f":"NHE_BedTot","v":0},{"$f":"NHE_BedNumChange","v":"-"},{"$f":"NHE_BedOpn1","v":0},{"$f":"NHE_BedDisc1","v":0},{"$f":"IF(NHE_BedDate1>=1/1/1900,NHE_BedDate1,\"\")","v":""},{"$f":"NHE_BedOpn2","v":0},{"$f":"NHE_BedDisc2","v":0},{"$f":"IF(NHE_BedDate2>=1/1/1900,NHE_BedDate2,\"\")","v":""},{"$f":"NHE_BedOpn3","v":0},{"$f":"NHE_BedDisc3","v":0},{"$f":"IF(NHE_BedDate3>=1/1/1900,NHE_BedDate3,\"\")","v":""},{"$f":"NHE_BedOpn4","v":0},{"$f":"NHE_BedDisc4","v":0},{"$f":"IF(NHE_BedDate4>=1/1/1900,NHE_BedDate4,\"\")","v":""},{"$f":"MedicareAppdate","v":"-"},{"$f":"IF(MedicareEnterdate>=1/1/1900,MedicareEnterdate,\"\")","v":""},{"$f":"MedicareWithdate","v":"-"},{"$f":"IF(MedicareWithEnterdate>=1/1/1900,MedicareWithEnterdate,\"\")","v":""},{"$f":"NHE_MCarePNum","v":0},{"$f":"NHE_MCaidTC2PNum","v":0},{"$f":"NHE_MCaidTC1PNum","v":0},{"$f":"NHE_EnterMTCYN","v":"-"},{"$f":"IF(NHE_EnterMTCdate>=1/1/1900,NHE_EnterMTCdate,\"\")","v":""},{"$f":"NHE_WdrawMTCYN","v":"-"},{"$f":"IF(NHE_WdrawMTCdate>=1/1/1900,NHE_WdrawMTCdate,\"\")","v":""},{"$f":"NHE_PrivateYN","v":"Yes"},{"$f":"NHE_Private","v":0},{"$f":"NHE_SemiPYN","v":"-"},{"$f":"NHE_SemiP","v":0},{"$f":"NHE_WardsYN","v":"-"},{"$f":"NHE_Wards","v":0},{"$f":"NHE_TotBeds","v":0},{"$f":"NHE_SBedOpn1","v":0},{"$f":"NHE_SBedDisc1","v":0},{"$f":"IF(NHE_SBedDate1>=1/1/1900,NHE_SBedDate1,\"\")","v":""},{"$f":"NHE_SBedOpn2","v":0},{"$f":"NHE_SBedDisc2","v":0},{"$f":"IF(NHE_SBedDate2>=1/1/2009,NHE_SBedDate2,\"\")","v":""},{"$f":"NHE_SBedOpn3","v":0},{"$f":"NHE_SBedDisc3","v":0},{"$f":"IF(NHE_SBedDAte3>=1/1/2009,NHE_SBedDAte3,\"\")","v":""},{"$f":"NHE_SBedOpn4","v":0},{"$f":"NHE_SBedDisc4","v":0},{"$f":"IF(NHE_SBedDate4>=1/1/2009,NHE_SBedDate4,\"\")","v":""}]

{"sheet":"Sch F-1","index":18,"n_rows":50,"n_cols":41,"rows_kept":50,"cut":false,"hidden":false,"merged":[[7,18,7,21],[1,15,1,32],[1,9,1,14],[2,0,2,35],[3,0,3,35],[7,32,7,35],[14,5,14,31],[8,5,8,13],[8,18,8,21],[5,5,5,7],[5,8,5,13],[4,22,4,25],[5,32,5,35],[1,33,1,35],[1,4,1,8],[5,18,5,21],[33,32,33,35],[23,32,23,35],[7,5,7,7],[7,8,7,13],[12,5,12,35],[1,0,1,3],[5,14,5,17],[4,14,4,17],[6,22,6,25],[6,18,6,21],[5,22,5,25],[5,26,5,31],[6,8,6,13],[6,32,6,35],[6,26,6,31],[4,32,4,35],[4,26,4,31],[4,18,4,21],[6,5,6,7],[4,8,4,13],[6,14,6,17],[4,5,4,7],[4,0,8,4],[8,14,8,17],[46,5,46,31],[42,9,42,31],[44,9,44,31],[38,5,38,31],[45,5,45,13],[7,14,7,17],[41,9,41,31],[39,9,39,31],[35,5,35,31],[36,5,36,31],[17,5,17,31],[24,9,24,31],[27,5,27,31],[28,5,28,35],[45,32,45,35],[40,9,40,31],[13,5,13,31],[30,32,30,35],[8,22,8,25],[7,22,7,25],[7,26,7,31],[8,26,8,31],[8,32,8,35],[34,32,34,35],[49,0,49,35],[12,0,18,4],[19,0,27,4],[15,32,15,35],[22,9,22,31],[28,0,46,4],[46,32,46,35],[26,32,26,35],[45,14,45,31],[44,32,44,35],[40,32,40,35],[42,32,42,35],[41,32,41,35],[48,0,48,35],[33,5,33,31],[29,5,29,31],[34,5,34,31],[30,5,30,31],[47,0,47,35],[29,32,29,35],[43,9,43,31],[31,5,31,31],[39,5,44,8],[19,5,19,31],[19,37,26,37],[10,32,10,34],[25,32,25,35],[16,32,16,35],[23,9,23,31],[18,5,18,31],[18,32,18,35],[21,36,25,36],[24,32,24,35],[25,9,25,31],[21,9,21,31],[10,5,10,31],[13,32,13,35],[17,32,17,35],[20,5,25,8],[16,5,16,31],[40,36,44,36],[15,5,15,31],[14,32,14,35],[0,36,0,38],[32,32,32,35],[34,37,45,37],[35,32,35,35],[43,32,43,35],[37,32,37,35],[31,32,31,35],[0,0,0,35],[26,5,26,13],[36,32,36,35],[39,32,39,35],[20,32,20,35],[21,32,21,35],[32,5,32,31],[26,14,26,31],[20,9,20,31],[37,5,37,31],[19,32,19,35],[22,32,22,35],[27,32,27,35],[38,32,38,35]]}
["2018 - NURSING HOMES - PROVISIONAL",null,null,null,null,null,null,null,null,null,null,null,null,null,null,null,null,null,null,null,null,null,null,null,null,null,null,null,null,null,null,null,null,null,null,null,"'OK' = Likely no Error\n'Error\" = Maybe Error\nin data provided"]
["State ID:",null,null,null,{"$f":"NHA_StateID","v":0},null,null,null,null,"Facility Name:",null,null,null,null,null,{"$f":"NHA_Name","v":"-"},null,null,null,null,null,null,null,null,null,null,null,null,null,null,null,null,null,2018]
["Tennessee Joint Annual Report of Nursing Homes - Schedule F - Utilization - Part 1"]
["Admissions are the number of all residents admitted to the facility during the reporting period.  Discharges include\nall residents discharged from the facility during the reporting period, including those who died during their stay.  \nTransferring a resident from one level of care to another level of care within the facility is counted as a discharge \nand admission.  Discharge resident days are the total number of resident days of care rendered to residents who \nwere discharged or died during the reporting period. (e.g. admitted 1/11 and discharged in the same year, on \n6/30 = 171 days, the number of days that resident had been at the facility at the time of discharge; another resident \nadmitted one year earlier on 1/11 and discharged on 6/30 the next year would be counted as 536 days).  Do not \ninclude the day of discharge in the calculation unless the resident was discharged the same day as admitted.  To \nmake the calculations of the number of days a resident has stayed, you may wish to use the website, \nhttp://www.timeanddate.com/date/timeduration.html "]
["Level of\nCare in\nthe\nFacility",null,null,null,null,"Yes/No",null,null,"Level\n(See definition in Licensed\nBeds section above.)",null,null,null,null,null,"Admissions",null,null,null,"Discharges\n(including\ndeaths)",null,null,null,"Deaths",null,null,null,"Discharge\nResident Days\n(including deaths)",null,null,null,null,null,"\nAverage\nLength of\nStay",null,null,null,"Average \nLength \nof Stay\nis \nLess Than\n1 Day","Average\nLength\nof Stay \nis Greater\nThan\n4 Years","Level of Care In the Facility Yes or No"]
[null,null,null,null,null,"-",null,null,"Medicare - Skilled Care    ",null,null,null,null,null,null,null,null,null,null,null,null,null,null,null,null,null,null,null,null,null,null,null,{"$f":"IF(ISERROR(NHF1_Lev2Medicare_Res_Day/NHF1_Lev2Medicare_Disch),0,NHF1_Lev2Medicare_Res_Day/NHF1_Lev2Medicare_Disch)","v":0},null,null,null,{"$f":"IF(AND(NHF1_Lev2MedicareYN=\"Yes\",NHF1_Lev2Medicare_Stay<1),\"Error\",\"Ok\")","v":"Ok"},{"$f":"IF(NHF1_Lev2Medicare_Stay>1460,\"Error\",\"Ok\")","v":"Ok"},{"$f":"IF(OR(NHF1_Lev2MedicareYN=\"Yes\",NHF1_Lev2MedicareYN=\"No\"),\"Ok\",\"Error\")","v":"Error"}]
[null,null,null,null,null,"-",null,null,"Level II\nSkilled Care   (Non-Medicare)",null,null,null,null,null,null,null,null,null,null,null,null,null,null,null,null,null,null,null,null,null,null,null,{"$f":"IF(ISERROR(NHF1_Lev2ResDay/NHF1_Lev2Disch),0,NHF1_Lev2ResDay/NHF1_Lev2Disch)","v":0},null,null,null,{"$f":"IF(AND(NHF1_Lev2YN=\"Yes\",NHF1_Lev2Stay<1),\"Error\",\"Ok\")","v":"Ok"},{"$f":"IF(NHF1_Lev2Stay>1460,\"Error\",\"Ok\")","v":"Ok"},{"$f":"IF(OR(NHF1_Lev2YN=\"Yes\",NHF1_Lev2YN=\"No\"),\"Ok\",\"Error\")","v":"Error"}]
[null,null,null,null,null,"-",null,null,"Level I\nIntermediate Care",null,null,null,null,null,null,null,null,null,null,null,null,null,null,null,null,null,null,null,null,null,null,null,{"$f":"IF(ISERROR(NHF1_Lev1ResDay/NHF1_Lev1Disch),0,NHF1_Lev1ResDay/NHF1_Lev1Disch)","v":0},null,null,null,{"$f":"IF(AND(NHF1_Lev1YN=\"Yes\",NHF1_Lev1Stay<1),\"Error\", \"Ok\")","v":"Ok"},{"$f":"IF(NHF1_Lev1Stay>1460,\"Error\",\"Ok\")","v":"Ok"},{"$f":"IF(OR(NHF1_Lev1YN=\"Yes\",NHF1_Lev1YN=\"No\"),\"Ok\",\"Error\")","v":"Error"}]
[null,null,null,null,null," Total",null,null,null,null,null,null,null,null,{"$f":"SUM(O6:O8)","v":0},null,null,null,{"$f":"SUM(S6:V8)","v":0},null,null,null,{"$f":"SUM(W6:Z8)","v":0},null,null,null,{"$f":"SUM(NHF1_Lev2Medicare_Res_Day:NHF1_Lev1ResDay)","v":0},null,null,null,null,null,{"$f":"IF(ISERROR(NHF1_TotResDay/NHF1_TotDisch=\"0\"),\"0\",(NHF1_TotResDay/NHF1_TotDisch))","v":"0"}]
[]
[null,null,null,null,null,"Total Resident Days / Total Beds x 365 days = Licensed Occupancy ",null,null,null,null,null,null,null,null,null,null,null,null,null,null,null,null,null,null,null,null,null,null,null,null,null,null,{"$f":"AN48/AN49","v":{"$error":"#DIV/0!"}}]
[]
["Source of\nAdmissions",null,null,null,null,"Number of admissions from sources (Where did your admissions come to you from?)"]
[null,null,null,null,null,"Home (private residence): Any house, condominium, or apartment in the community \nwhether owned by the resident or another person. Also included in this category \nare retirement communities, and independent housing for the elderly."]
[null,null,null,null,null,"Private  Home  with  Home  Health Services:  Includes skilled nursing, therapy  (e.g., \nphysical, occupational, speech), nutritional, medical, psychiatric and home health aide \nservices delivered in the home. Does not include the following services unless \nprovided in conjunction with the services previously named: homemaker/personal care \nservices, home delivered meals, telephone reassurance, transportation, respite \nservices or adult day care."]
[null,null,null,null,null,"Home and Community Based Services (HCBS) Waiver Program: statewide Medicaid \nprogram, available through application."]
[null,null,null,null,null,"Home for the Aged"]
[null,null,null,null,null,"Assisted  Care  Living  Facility:  A non-institutional community residential setting that \nincludes services of the following types: home health services, homemaker/personal \ncare services, or meal services."]
[null,null,null,null,null,"Other  Nursing  Home:  An  institution  (or  a  distinct  part  of  an  institution)  that  is \nprimarily engaged in providing skilled nursing care and related services for residents \nwho require medical or nursing care, or rehabilitation services for injured, disabled \nor sick persons."]
["Source of\nAdmissions\n(Continued)",null,null,null,null,"Hospital:  Includes  acute  care  hospitals,  psychiatric  hospitals,  MR/DD  facilities,  \nand rehabilitation hospitals. An acute care hospital is an institution that is engaged in \nproviding, by or under the supervision of physicians for inpatients, diagnostic services, \ntherapeutic services for medical diagnosis, and the treatment and care of injured, \ndisabled or sick persons. A psychiatric hospital is an institution that is engaged in \nproviding, by or under the supervision of a physician, psychiatric services for the \ndiagnosis and treatment of mentally ill patients. An MR/DD facility is an institution that \nis engaged in providing, under the supervision of a physician, any health and \nrehabilitative services for individuals who are mentally retarded or who have \ndevelopmental disabilities. An Inpatient Rehabilitations Hospital (IRF) is engaged in \nproviding, under the supervision of physicians, rehabilitation services for the\nrehabilitation of injured, disabled or sick persons.",null,null,null,null,null,null,null,null,null,null,null,null,null,null,null,null,null,null,null,null,null,null,null,null,null,null,null,null,null,null,null,"Cross\nCheck\n\nBoth the  ”Level of Care in the Facility \nAdmissions Total (Line 9)” and “The Source of Admissions Total (Line 28)” should both equal the same exact amount.\n"]
[null,null,null,null,null,"Transfers\nWithin\nFacility",null,null,null,"To Medicaid/TennCare Level I from Medicaid/TennCare Level II"]
[null,null,null,null,null,null,null,null,null,"To Medicaid/TennCare Level I from Medicare SNF",null,null,null,null,null,null,null,null,null,null,null,null,null,null,null,null,null,null,null,null,null,null,null,null,null,null,"Source\nof Admiss\nOther\nspecify,\ndata\nnot\nprovided"]
[null,null,null,null,null,null,null,null,null,"To Medicaid/TennCare Level II from TennCare Level I"]
[null,null,null,null,null,null,null,null,null,"To Medicaid/TennCare Level II from Medicare SNF"]
[null,null,null,null,null,null,null,null,null,"To Medicare SNF from Medicaid/TennCare Level I"]
[null,null,null,null,null,null,null,null,null,"To Medicare SNF from Medicaid/TennCare Level II"]
[null,null,null,null,null," Other (please specify)",null,null,null,null,null,null,null,null,null,null,null,null,null,null,null,null,null,null,null,null,null,null,null,null,null,null,null,null,null,null,{"$f":"IF(AO28=TRUE,\"Ok\", \"Error\")","v":"Ok"},null,null,{"$f":"IF(NHF1_TransOtherSpec=\"\",0,1)","v":0},{"$f":"IF(NHF1_TransOther>=1,1,0)","v":0}]
[null,null,null,null,null," (Must match Level of Care in the Facility Admissions Total)  Source of Admissions Total",null,null,null,null,null,null,null,null,null,null,null,null,null,null,null,null,null,null,null,null,null,null,null,null,null,null,{"$f":"(NHF1_Home+NHF1_PriHome+NHF1_HCBS+NHF1_HomeAged +NHF1_ACLF+NHF1_OtherNH+NHF1_Hospital+NHF1_Lev1frmLev2+NHF1_Lev1frmSNF+NHF1_Lev2FrmLev1+NHF1_Lev2frmSNF+NHF1_SNFfrmLev1+NHF1_SNFfrmLev2+NHF1_TransOther)","v":0},null,null,null,null,{"$f":"IF(NHF1_TotAdmin=NHF1_TotTrans,\"Ok\", \"Error\")","v":"Ok"},null,{"$f":"SUM(AN27:AO27)","v":0},{"$f":"OR(AN28=0,AN28=2)","v":true}]
["Discharge\nDestination\n(Do not\ninclude\nDeaths)",null,null,null,null,"        Discharge Destination (Where were the patients discharged to?)                                                                                                                                                                                                                                                                                      ",null,null,null,null,null,null,null,null,null,null,null,null,null,null,null,null,null,null,null,null,null,null,null,null,null,null,null,null,null,null,null," "]
[null,null,null,null,null,"Home (private residence)"]
[null,null,null,null,null,"Private Home with Home Health Services from Other Source"]
[null,null,null,null,null,"Private Home with Home Health Services from this Facility"]
[null,null,null,null,null,"Home and Community Based Services (HCBS) Waiver Program"]
[null,null,null,null,null,"Home for the Aged"]
[null,null,null,null,null,"Assisted Care Living Facility",null,null,null,null,null,null,null,null,null,null,null,null,null,null,null,null,null,null,null,null,null,null,null,null,null,null,null,null,null,null,null,"Cross\nCheck\n\nLevel of\nCare (Line 9)\nDischarges\n(including\ndeaths) \nminus Deaths\nMust Equal\nDischarge\nDestination\nTotal (Line 44)\n(not \nincluding\ndeaths)"]
[null,null,null,null,null,"Other Nursing Home"]
[null,null,null,null,null,"Hospital (bed held for return)"]
[null,null,null,null,null,"Hospital (did not return)"]
[null,null,null,null,null,"Residential Hospice"]
[null,null,null,null,null,"Transfers\nWithin\nFacility",null,null,null,"To Medicaid/TennCare Level I from Medicaid/TennCare Level II"]
[null,null,null,null,null,null,null,null,null,"To Medicaid/TennCare Level I from Medicare SNF",null,null,null,null,null,null,null,null,null,null,null,null,null,null,null,null,null,null,null,null,null,null,null,null,null,null,"Disch\nDest\nother\nspecify,\ndata not\nprovided"]
[null,null,null,null,null,null,null,null,null,"To Medicaid/TennCare Level II from TennCare Level I"]
[null,null,null,null,null,null,null,null,null,"To Medicaid/TennCare Level II from Medicare SNF"]
[null,null,null,null,null,null,null,null,null,"To Medicare SNF from Medicaid/TennCare Level I"]
[null,null,null,null,null,null,null,null,null,"To Medicare SNF from Medicaid/TennCare Level II",null,null,null,null,null,null,null,null,null,null,null,null,null,null,null,null,null,null,null,null,null,null,null,null,null,null,null,null,null,{"$f":"IF(NHF1_TWFOtherSpec=\"\",0,1)","v":0},{"$f":"IF(NHF1_TWFOther>=1,1,0)","v":0}]
[null,null,null,null,null,"Other (please specify)",null,null,null,null,null,null,null,null,null,null,null,null,null,null,null,null,null,null,null,null,null,null,null,null,null,null,null,null,null,null,{"$f":"IF(AO46=TRUE,\"Ok\", \"Error\")","v":"Ok"},null,null,{"$f":"SUM(AN45:AO45)","v":0},{"$f":"OR(AN46=0,AN46=2)","v":true}]
[null,null,null,null,null,"            Discharge Destination Total (do not include deaths) ",null,null,null,null,null,null,null,null,null,null,null,null,null,null,null,null,null,null,null,null,null,null,null,null,null,null,{"$f":"SUM(AG30:AJ46)","v":0},null,null,null,null,{"$f":"IF(AN47=NHF1_TWFTot,\"Ok\",\"Error\")","v":"Ok"},null,{"$f":"(NHF1_TotDisch-NHF1_TotDeath)","v":0}]
["Go to Next Schedule",null,null,null,null,null,null,null,null,null,null,null,null,null,null,null,null,null,null,null,null,null,null,null,null,null,null,null,null,null,null,null,null,null,null,null,null,null,null,{"$f":"NHF2_RDCTotTot*100%","v":0}]
["Return to Main Menu",null,null,null,null,null,null,null,null,null,null,null,null,null,null,null,null,null,null,null,null,null,null,null,null,null,null,null,null,null,null,null,null,null,null,null,null,null,null,{"$f":"NHE_BedTot*365","v":0}]
["Go to Error Listing"]

{"sheet":"F-1-Data","index":19,"n_rows":4,"n_cols":62,"rows_kept":4,"cut":false,"hidden":true,"merged":[[1,15,1,20],[1,9,1,14],[1,3,1,8],[0,26,2,26]]}
["Facility ID Info",null,null,"Level of Care in the Facility",null,null,null,null,null,null,null,null,null,null,null,null,null,null,null,null,null,null,null,null,null,null,"Licensed Occupancy","Source of Admissions",null,null,null,null,null,null,null,null,null,null,null,null,null,null,null,"Discharge Destination (Do not include deaths)"]
[null,null,null,"Medicare - Skilled Care",null,null,null,null,null,"Level II/Skilled Care",null,null,null,null,null,"Level I/intermediate Care",null,null,null,null,null,"Skilled Care, Level II & Level I Totals",null,null,null,null,null,"Number of admissions from sources",null,null,null,null,null,null,"Transfers Within Facility",null,null,null,null,null,null,null,null,null,null,null,null,null,null,null,null,null,null,"Transfers Within Facility"]
["State ID","NH Name","County","Yes/No","Admissions","Discharges\n(including\ndeaths)","Deaths","Discharge\nRes Days\n(inc deaths)","Average\nLength of\nStay","Yes/No","Admissions","Discharges\n(including\ndeaths)","Deaths","Discharge\nRes Days\n(inc deaths)","Average\nLength of\nStay","Yes/No","Admissions","Discharges\n(including\ndeaths)","Deaths","Discharge\nRes Days\n(inc deaths)","Average\nLength of\nStay","Admissions","Discharges\n(including\ndeaths)","Deaths","Discharge\nRes Days\n(inc deaths)","Average\nLength of\nStay",null,"Home\n(private\nresidence)","Private \nHome with\nservices","HCBS","Home for\nthe Aged","ACLF","Other \nNursing\nHome","Hospital","To Med/TC\nLevel I\nFrom Med/TC\nLevel II","To Med/TC\nLevel I\nFrom \nMed SNF","To Med/TC\nLevel II\nFrom TC\nLevel I","To Med/TC\nLevel II\nFrom\nMed SNF","To Med SNF\nFrom Med/TC\nLevel I","To Med SNF\nFrom Med/TC\nLevel II","Other\n(please\nspecify)","Other","Source of\nAdmissions\nTotal","Home\n(private \nresidence)","Priv home\nwith serv\nother\nsource","Priv home\nwith serv\nthis\nfacility","HCBS","Home\nfor the\nAged","ACLF","Other\nNursing \nHome","Hospital\nbed held\nfor return","Hospital\ndid not\nreturn","Residential\nHospice","To Med/TC\nLevel I\nFrom Med/TC\nLevel II","To Med/TC\nLevel I\nFrom \nMed SNF","To Med/TC\nLevel II\nFrom TC\nLevel I","To Med/TC\nLevel II\nFrom\nMed SNF","To Med SNF\nFrom Med/TC\nLevel I","To Med SNF\nFrom Med/TC\nLevel II","Other\n(please\nspecify)","Other","Discharge\nDestination\nTotal (not\ndeaths)"]
[{"$f":"NHA_StateID","v":0},{"$f":"NHA_Name","v":"-"},{"$f":"NHA_County","v":"-"},{"$f":"NHF1_Lev2MedicareYN","v":"-"},{"$f":"NHF1_Lev2Medicare_Admin","v":0},{"$f":"NHF1_Lev2Medicare_Disch","v":0},{"$f":"NHF1_Lev2Medicare_Death","v":0},{"$f":"NHF1_Lev2Medicare_Res_Day","v":0},{"$f":"NHF1_Lev2Medicare_Stay","v":0},{"$f":"NHF1_Lev2YN","v":"-"},{"$f":"NHF1_Lev2Admin","v":0},{"$f":"NHF1_Lev2Disch","v":0},{"$f":"NHF1_Lev2Death","v":0},{"$f":"NHF1_Lev2ResDay","v":0},{"$f":"NHF1_Lev2Stay","v":0},{"$f":"NHF1_Lev1YN","v":"-"},{"$f":"NHF1_Lev1Admin","v":0},{"$f":"NHF1_Lev1Disch","v":0},{"$f":"NHF1_Lev1Death","v":0},{"$f":"NHF1_Lev1ResDay","v":0},{"$f":"NHF1_Lev1Stay","v":0},{"$f":"NHF1_TotAdmin","v":0},{"$f":"NHF1_TotDisch","v":0},{"$f":"NHF1_TotDeath","v":0},{"$f":"NHF1_TotResDay","v":0},{"$f":"NHF1_TotStay","v":"0"},{"$f":"NHF1_LicOccpy","v":{"$error":"#DIV/0!"}},{"$f":"NHF1_Home","v":0},{"$f":"NHF1_PriHome","v":0},{"$f":"NHF1_HCBS","v":0},{"$f":"NHF1_HomeAged","v":0},{"$f":"NHF1_ACLF","v":0},{"$f":"NHF1_OtherNH","v":0},{"$f":"NHF1_Hospital","v":0},{"$f":"NHF1_Lev1frmLev2","v":0},{"$f":"NHF1_Lev1frmSNF","v":0},{"$f":"NHF1_Lev2FrmLev1","v":0},{"$f":"NHF1_Lev2frmSNF","v":0},{"$f":"NHF1_SNFfrmLev1","v":0},{"$f":"NHF1_SNFfrmLev2","v":0},{"$f":"NHF1_TransOtherSpec","v":0},{"$f":"NHF1_TransOther","v":0},{"$f":"NHF1_TotTrans","v":0},{"$f":"NHF1_Dhome","v":0},{"$f":"NHF1_DPriHome","v":0},{"$f":"NHF1_DHomeHHS","v":0},{"$f":"NHF1_DHCBS","v":0},{"$f":"NHF1_DHomeAge","v":0},{"$f":"NHF1_DACLF","v":0},{"$f":"NHF1_DOtherNH","v":0},{"$f":"NHF1_DHospitalRet","v":0},{"$f":"NHF1_DHospitalNo","v":0},{"$f":"NHF1_DResHospice","v":0},{"$f":"NHF1_TWFLev1frmLev2","v":0},{"$f":"NHF1_TWFLev1frmSNF","v":0},{"$f":"NHF1_TWFLev2frmLev1","v":0},{"$f":"NHF1_TWFLev2frmSNF","v":0},{"$f":"NHF1_TWFSNFfrmLev1","v":0},{"$f":"NHF1_TWFSNFfrmLev2","v":0},{"$f":"NHF1_TWFOtherSpec","v":0},{"$f":"NHF1_TWFOther","v":0},{"$f":"NHF1_TWFTot","v":0}]

{"sheet":"Sch F-2","index":20,"n_rows":87,"n_cols":66,"rows_kept":87,"cut":false,"hidden":false,"merged":[[63,37,78,37],[32,37,32,38],[33,37,34,38],[35,37,35,38],[36,37,37,38],[38,37,40,38],[41,37,41,38],[24,32,24,35],[26,32,26,35],[28,37,28,38],[52,32,52,35],[48,32,48,35],[26,22,26,24],[27,11,27,14],[27,22,27,24],[24,29,24,31],[20,22,20,24],[21,32,21,35],[25,32,25,35],[20,18,20,21],[22,22,22,24],[20,29,20,31],[20,32,20,35],[25,15,25,17],[22,29,22,31],[22,32,22,35],[21,29,21,31],[21,25,21,28],[24,15,24,17],[22,25,22,28],[22,15,22,17],[25,29,25,31],[23,18,23,21],[23,22,23,24],[27,18,27,21],[26,11,26,14],[10,28,10,35],[12,12,12,19],[12,20,12,27],[13,20,13,27],[16,28,16,35],[21,18,21,21],[16,12,16,19],[13,12,13,19],[21,22,21,24],[18,22,18,28],[18,15,18,21],[12,28,12,35],[19,32,19,35],[19,25,19,28],[21,15,21,17],[14,12,14,19],[17,4,17,35],[18,29,18,35],[18,8,18,14],[14,4,14,11],[13,28,13,35],[15,28,15,35],[16,20,16,27],[14,20,14,27],[5,37,5,38],[12,37,14,38],[6,37,9,38],[10,37,10,38],[15,37,15,38],[23,37,27,38],[21,37,21,38],[6,4,6,19],[7,4,7,19],[9,4,9,11],[8,20,8,27],[6,20,6,27],[5,20,5,27],[7,28,7,35],[16,4,16,11],[14,28,14,35],[11,4,11,11],[7,20,7,27],[8,4,8,11],[10,20,10,27],[11,20,11,27],[10,4,10,11],[11,12,11,19],[25,22,25,24],[1,33,1,35],[1,15,1,32],[5,12,5,19],[9,28,9,35],[8,28,8,35],[3,0,3,35],[47,26,47,31],[34,0,34,31],[35,0,43,3],[47,6,47,11],[12,4,12,11],[9,20,9,27],[9,12,9,19],[24,8,24,10],[24,18,24,21],[22,18,22,21],[25,4,25,7],[20,25,20,28],[4,0,16,3],[5,4,5,11],[4,4,4,35],[5,28,5,35],[10,12,10,19],[8,12,8,19],[28,25,28,28],[43,32,43,35],[41,32,41,35],[39,32,39,35],[37,32,37,35],[38,32,38,35],[36,32,36,35],[42,32,42,35],[49,32,49,35],[48,22,48,25],[48,26,48,31],[30,32,30,35],[31,32,31,35],[49,22,49,25],[29,22,29,24],[35,32,35,35],[26,18,26,21],[26,25,26,28],[25,18,25,21],[29,25,29,28],[51,32,51,35],[51,26,51,31],[49,26,49,31],[30,11,30,14],[50,12,50,15],[48,16,48,21],[37,4,37,31],[48,12,48,15],[30,8,30,10],[50,22,50,25],[31,18,31,21],[30,18,30,21],[46,22,46,25],[51,16,51,21],[51,22,51,25],[49,12,49,15],[25,8,25,10],[32,32,32,35],[33,32,33,35],[34,32,34,35],[0,0,0,35],[1,0,1,3],[1,4,1,8],[1,9,1,14],[27,25,27,28],[27,29,27,31],[26,4,26,7],[45,16,45,21],[28,18,28,21],[26,15,26,17],[19,8,19,10],[19,15,19,17],[20,11,20,14],[21,8,21,10],[15,20,15,27],[15,12,15,19],[19,11,19,14],[21,11,21,14],[19,18,19,21],[19,22,19,24],[6,28,6,35],[42,4,42,31],[40,4,40,31],[38,4,38,31],[47,16,47,21],[47,22,47,25],[53,12,53,15],[48,6,48,11],[41,4,41,31],[46,12,46,15],[39,4,39,31],[50,6,50,11],[51,6,51,11],[49,6,49,11],[46,6,46,11],[50,26,50,31],[52,26,52,31],[47,12,47,15],[23,11,23,14],[22,11,22,14],[57,12,57,15],[31,11,31,14],[28,11,28,14],[31,15,31,17],[28,15,28,17],[29,4,29,7],[29,8,29,10],[29,15,29,17],[23,8,23,10],[54,16,54,21],[27,15,27,17],[56,6,56,11],[52,12,52,15],[51,12,51,15],[55,16,55,21],[31,4,31,7],[32,4,32,31],[33,0,33,31],[36,4,36,31],[43,4,43,31],[45,12,45,15],[54,12,54,15],[73,12,73,15],[72,6,72,11],[71,12,71,15],[71,6,71,11],[28,8,28,10],[69,16,69,21],[49,16,49,21],[64,6,64,11],[57,6,57,11],[65,6,65,11],[58,6,58,11],[63,12,63,15],[57,16,57,21],[68,12,68,15],[54,6,54,11],[53,16,53,21],[35,4,35,31],[31,8,31,10],[65,22,65,25],[60,16,60,21],[65,16,65,21],[63,16,63,21],[59,16,59,21],[59,22,59,25],[83,32,83,35],[81,26,81,31],[80,32,80,35],[66,26,66,31],[65,26,65,31],[68,32,68,35],[66,32,66,35],[71,32,71,35],[53,32,53,35],[62,32,62,35],[58,32,58,35],[82,32,82,35],[81,32,81,35],[79,32,79,35],[65,32,65,35],[63,32,63,35],[57,32,57,35],[54,32,54,35],[55,26,55,31],[57,26,57,31],[83,0,83,31],[81,6,81,11],[82,6,82,31],[81,16,81,21],[64,12,64,15],[66,22,66,25],[67,16,67,21],[66,12,66,15],[59,12,59,15],[65,12,65,15],[66,16,66,21],[67,22,67,25],[63,22,63,25],[60,12,60,15],[84,0,84,35],[44,0,78,5],[60,6,60,11],[74,16,74,21],[62,16,62,21],[64,16,64,21],[53,6,53,11],[52,6,52,11],[74,12,74,15],[76,16,76,21],[67,12,67,15],[64,22,64,25],[75,6,75,11],[73,16,73,21],[75,16,75,21],[74,22,74,25],[72,16,72,21],[72,26,72,31],[55,32,55,35],[64,32,64,35],[60,32,60,35],[59,32,59,35],[61,32,61,35],[56,32,56,35],[85,0,85,35],[69,22,69,25],[68,22,68,25],[69,26,69,31],[79,12,79,15],[79,0,82,5],[78,32,78,35],[77,32,77,35],[76,32,76,35],[79,6,79,11],[70,6,70,11],[72,12,72,15],[68,16,68,21],[73,26,73,31],[72,22,72,25],[70,12,70,15],[73,6,73,11],[71,16,71,21],[70,16,70,21],[70,26,70,31],[71,22,71,25],[74,26,74,31],[73,22,73,25],[74,6,74,11],[86,0,86,35],[66,6,66,11],[67,6,67,11],[68,6,68,11],[69,6,69,11],[71,26,71,31],[20,4,20,7],[20,15,20,17],[20,8,20,10],[21,4,21,7],[30,15,30,17],[29,11,29,14],[28,4,28,7],[23,15,23,17],[30,4,30,7],[27,8,27,10],[70,32,70,35],[70,22,70,25],[69,32,69,35],[64,26,64,31],[63,26,63,31],[67,26,67,31],[68,26,68,31],[67,32,67,35],[78,6,78,31],[77,22,77,25],[76,12,76,15],[36,36,41,36],[46,32,46,35],[40,32,40,35],[44,6,44,35],[45,6,45,11],[46,16,46,21],[46,26,46,31],[45,26,45,31],[45,32,45,35],[62,6,62,11],[55,6,55,11],[69,12,69,15],[56,12,56,15],[55,12,55,15],[62,12,62,15],[50,16,50,21],[62,26,62,31],[58,26,58,31],[45,22,45,25],[59,6,59,11],[63,6,63,11],[80,16,80,21],[23,25,23,28],[23,4,23,7],[18,4,19,7],[24,4,24,7],[24,22,24,24],[24,25,24,28],[24,11,24,14],[28,32,28,35],[28,22,28,24],[26,8,26,10],[26,29,26,31],[29,32,29,35],[27,32,27,35],[30,22,30,24],[60,26,60,31],[53,22,53,25],[61,22,61,25],[56,26,56,31],[50,32,50,35],[47,32,47,35],[25,25,25,28],[56,22,56,25],[59,26,59,31],[61,6,61,11],[61,16,61,21],[54,26,54,31],[61,26,61,31],[62,22,62,25],[52,22,52,25],[60,22,60,25],[61,12,61,15],[52,16,52,21],[58,22,58,25],[56,16,56,21],[57,22,57,25],[58,16,58,21],[58,12,58,15],[53,26,53,31],[54,22,54,25],[55,22,55,25],[81,22,81,25],[79,16,79,21],[79,26,79,31],[80,26,80,31],[80,6,80,11],[81,12,81,15],[71,36,76,36],[73,32,73,35],[72,32,72,35],[75,32,75,35],[74,32,74,35],[77,26,77,31],[75,12,75,15],[76,22,76,25],[76,26,76,31],[75,26,75,31],[75,22,75,25],[80,12,80,15],[77,6,77,11],[77,12,77,15],[76,6,76,11],[77,16,77,21],[79,22,79,25],[80,22,80,25],[0,36,0,38],[23,29,23,31],[23,32,23,35],[19,29,19,31],[11,28,11,35],[2,0,2,35],[9,36,14,36],[17,37,20,38],[17,0,32,3],[29,18,29,21],[28,29,28,31],[13,4,13,11],[15,4,15,11],[29,29,29,31],[30,29,30,31],[31,25,31,28],[30,25,30,28],[31,22,31,24],[31,29,31,31],[25,36,30,36],[22,4,22,7],[27,4,27,7],[22,8,22,10],[25,11,25,14]]}
["2018 - NURSING HOMES - PROVISIONAL",null,null,null,null,null,null,null,null,null,null,null,null,null,null,null,null,null,null,null,null,null,null,null,null,null,null,null,null,null,null,null,null,null,null,null,"'OK' = Likely no Error\n'Error\" = Maybe Error\nin data provided"]
["State ID:",null,null,null,{"$f":"NHA_StateID","v":0},null,null,null,null,"Facility Name:",null,null,null,null,null,{"$f":"NHA_Name","v":"-"},null,null,null,null,null,null,null,null,null,null,null,null,null,null,null,null,null,2018]
["Tennessee Joint Annual Report of Nursing Homes - Schedule F - Utilization - Part 2"]
["Do not enter zero.  Blank fields will represent zero residents."]
["Resident\nDays of \nCare  for the Entire Reporting Period",null,null,null,"A resident day of care, also commonly referred to as an inpatient day, patient day, census day, or an \noccupied bed day, is a period of service between the census-taking hours on two successive calendar \ndays, the day of discharge being counted only when the resident was admitted the same day. Report \nresident days of care for the reporting period and according to the primary payment source. Include \nMedicare/TennCare dually entitled residents in Medicare SNF. (Rule 1240-3-1-.02) July, 1997 \n(Revised) 2 (f) Level I care is health care in a nursing facility, which is more than room and board, but is \nless than skilled nursing care (Level I care was formerly called I.C.F. - Intermediate Care Facility). \n(m) Level II care is health care in a nursing facility which is a higher level of care than Level I, but less \nthan inpatient hospitalization. (Level II care was formerly called Skilled Nursing Care.)",null,null,null,null,null,null,null,null,null,null,null,null,null,null,null,null,null,null,null,null,null,null,null,null,null,null,null,null,null,null,null,null,null,null,null,null,null,null,null,null,null,null,null,null,null,null,null,null,null,null,null,null,null,null,null,null,null,null,null,null,"  "]
[null,null,null,null,"Payer Source",null,null,null,null,null,null,null,"Level I Care/\nIntermediate Care",null,null,null,null,null,null,null,"Level II Care/\nSkilled Nursing Care",null,null,null,null,null,null,null,"Total",null,null,null,null,null,null,null,null,"CROSS CHECKS"]
[null,null,null,null,"Medicare Advantage",null,null,null,null,null,null,null,null,null,null,null,null,null,null,null,null,null,null,null,null,null,null,null,{"$f":"NHF2_RDCMALev2","v":0},null,null,null,null,null,null,null,null,"Total resident days (Resident days of care) < 50% of total beds (Total Licensed beds from Sch E) * 365 days"]
[null,null,null,null,"All Other Medicare",null,null,null,null,null,null,null,null,null,null,null,null,null,null,null,null,null,null,null,null,null,null,null,{"$f":"NHF2_RDCOMlev2","v":0}]
[null,null,null,null,"TennCare MCO",null,null,null,null,null,null,null,null,null,null,null,null,null,null,null,null,null,null,null,null,null,null,null,{"$f":"SUM(M9:AB9)","v":0}]
[null,null,null,null,"All Other Medicaid/\nTennCare",null,null,null,null,null,null,null,null,null,null,null,null,null,null,null,null,null,null,null,null,null,null,null,0,null,null,null,null,null,null,null,"Resident\nDays\nof Care\n= 0"]
[null,null,null,null,"VA Contract",null,null,null,null,null,null,null,null,null,null,null,null,null,null,null,null,null,null,null,null,null,null,null,0,null,null,null,null,null,null,null,null,{"$f":"IF(NHF2_RDCTotTot>AO13,\"Ok\",\"Error\")","v":"Error"}]
[null,null,null,null,"Other Government",null,null,null,null,null,null,null,null,null,null,null,null,null,null,null,null,null,null,null,null,null,null,null,0]
[null,null,null,null,"Access TN",null,null,null,null,null,null,null,null,null,null,null,null,null,null,null,null,null,null,null,null,null,null,null,0,null,null,null,null,null,null,null,null,"Total resident days (Resident days of care)\n> 105% of total beds (Total Licensed beds from Sch E) * 365 days",null,{"$f":"(NHE_TotBeds*365)","v":0},{"$f":"(AN13*0.5)","v":0}]
[null,null,null,null,"Private (Self Pay)",null,null,null,null,null,null,null,null,null,null,null,null,null,null,null,null,null,null,null,null,null,null,null,0,null,null,null,null,null,null,null,null,null,null,"",{"$f":"(AN13*1.05)","v":0}]
[null,null,null,null,"Long-Term Care \nInsurance",null,null,null,null,null,null,null,null,null,null,null,null,null,null,null,null,null,null,null,null,null,null,null,0]
[null,null,null,null,"Other non-government",null,null,null,null,null,null,null,null,null,null,null,null,null,null,null,null,null,null,null,null,null,null,null,0,null,null,null,null,null,null,null,{"$f":"IF(NHF2_RDCTotTot>0,\"Ok\",\"Error\")","v":"Error"},{"$f":"IF(NHF2_RDCTotTot<AO14,\"Ok\",\"Error\")","v":"Error"}]
[null,null,null,null,"Total",null,null,null,null,null,null,null,{"$f":"SUM(M9:T16)","v":0},null,null,null,null,null,null,null,{"$f":"SUM(U7:AB16)","v":0},null,null,null,null,null,null,null,{"$f":"SUM(AC7:AJ16)","v":0}]
["Age,\nRace and\nGender\nduring the\nEntire\nreporting\nperiod",null,null,null,"Number of residents served during the entire reporting period by age, race, and gender",null,null,null,null,null,null,null,null,null,null,null,null,null,null,null,null,null,null,null,null,null,null,null,null,null,null,null,null,null,null,null,null,"Total resident days (Resident days of care) < 50% of (Total beds set up and staffed from Sch E) * 365 days"]
[null,null,null,null,"Age",null,null,null,"White",null,null,null,null,null,null,"Black",null,null,null,null,null,null,"Other",null,null,null,null,null,null,"Total"]
[null,null,null,null,null,null,null,null,"Male",null,null,"Female",null,null,null,"Male",null,null,"Female",null,null,null,"Male",null,null,"Female",null,null,null,"Male",null,null,"Female"]
[null,null,null,null,"Under 21",null,null,null,null,null,null,null,null,null,null,null,null,null,null,null,null,null,null,null,null,null,null,null,null,{"$f":"(NHF2_U21WM+NHF2_U21BM+NHF2_U21OM)","v":0},null,null,{"$f":"(NHF2_U21WF+NHF2_U21BF+NHF2_U21OF)","v":0}]
[null,null,null,null,"21-59",null,null,null,null,null,null,null,null,null,null,null,null,null,null,null,null,null,null,null,null,null,null,null,null,{"$f":"(NHF2_2159WM+NHF2_2159BM+NHF2_2159OM)","v":0},null,null,{"$f":"(NHF2_2159WF+NHF2_2159BF+NHF2_2159OF)","v":0},null,null,null,null,{"$f":"IF(NHF2_RDCTotTot>AO31,\"Ok\",\"Error\")","v":"Error"}]
[null,null,null,null,"60-64",null,null,null,null,null,null,null,null,null,null,null,null,null,null,null,null,null,null,null,null,null,null,null,null,{"$f":"(NHF2_6064WM+NHF2_6064BM+NHF2_6064OM)","v":0},null,null,{"$f":"(NHF2_6064WF+NHF2_6064BF+NHF2_6064OF)","v":0}]
[null,null,null,null,"65-69",null,null,null,null,null,null,null,null,null,null,null,null,null,null,null,null,null,null,null,null,null,null,null,null,{"$f":"(NHF2_6569WM+NHF2_6569BM+NHF2_6569OM)","v":0},null,null,{"$f":"(NHF2_6569WF+NHF2_6569BF+NHF2_6569OF)","v":0},null,null,null,null,"Total resident days (Resident days of care) > 100% of (Total beds set up and staffed from Sch E) * 365 days"]
[null,null,null,null,"70-74",null,null,null,null,null,null,null,null,null,null,null,null,null,null,null,null,null,null,null,null,null,null,null,null,{"$f":"(NHF2_7074WM+NHF2_7074BM+NHF2_7074OM)","v":0},null,null,{"$f":"(NHF2_7074WF+NHF2_7074BF+NHF2_7074OF)","v":0}]
[null,null,null,null,"75-79",null,null,null,null,null,null,null,null,null,null,null,null,null,null,null,null,null,null,null,null,null,null,null,null,{"$f":"(NHF2_7579WM+NHF2_7579BM+NHF2_7579OM)","v":0},null,null,{"$f":"(NHF2_7579WF+NHF2_7579BF+NHF2_7579OF)","v":0},null,null,null,"\nMale\n+\nFemale\nresidents\n= 0"]
[null,null,null,null,"80-84",null,null,null,null,null,null,null,null,null,null,null,null,null,null,null,null,null,null,null,null,null,null,null,null,{"$f":"(NHF2_8084WM+NHF2_8084BM+NHF2_8084OM)","v":0},null,null,{"$f":"(NHF2_8084WF+NHF2_8084BF+NHF2_8084OF)","v":0}]
[null,null,null,null,"85-89",null,null,null,null,null,null,null,null,null,null,null,null,null,null,null,null,null,null,null,null,null,null,null,null,{"$f":"(NHF2_8589WM+NHF2_8589BM+NHF2_8589OM)","v":0},null,null,{"$f":"(NHF2_8589WF+NHF2_8589BF+NHF2_8589OF)","v":0}]
[null,null,null,null,"90-94",null,null,null,null,null,null,null,null,null,null,null,null,null,null,null,null,null,null,null,null,null,null,null,null,{"$f":"(NHF2_9094WM+NHF2_9094BM+NHF2_9094OM)","v":0},null,null,{"$f":"(NHF2_9094WF+NHF2_9094BF+NHF2_9094OF)","v":0},null,null,null,null,{"$f":"IF(NHF2_RDCTotTot>AN31,\"Error\", \"Ok\")","v":"Ok"}]
[null,null,null,null,"95-99",null,null,null,null,null,null,null,null,null,null,null,null,null,null,null,null,null,null,null,null,null,null,null,null,{"$f":"(NHF2_9599WM+NHF2_9599BM+NHF2_9599OM)","v":0},null,null,{"$f":"(NHF2_9599WF+NHF2_9599BF+NHF2_9599OF)","v":0}]
[null,null,null,null,"100 & Over",null,null,null,null,null,null,null,null,null,null,null,null,null,null,null,null,null,null,null,null,null,null,null,null,{"$f":"(NHF2_100WM+NHF2_100BM+NHF2_100OM)","v":0},null,null,{"$f":"(NHF2_100WF+NHF2_100BF+NHF2_100OF)","v":0},null,null,null,null,null,null,{"$f":"(NHE_TotBeds*365)","v":0},{"$f":"(AN31*0.5)","v":0}]
[null,null,null,null,"\nTotal",null,null,null,{"$f":"SUM(I21:K31)","v":0},null,null,{"$f":"SUM(L21:O31)","v":0},null,null,null,{"$f":"SUM(P21:R31)","v":0},null,null,{"$f":"SUM(S21:V31)","v":0},null,null,null,{"$f":"SUM(W21:Y31)","v":0},null,null,{"$f":"SUM(Z21:AC31)","v":0},null,null,null,{"$f":"SUM(AD21:AF31)","v":0},null,null,{"$f":"SUM(AG21:AJ31)","v":0},null,null,null,{"$f":"IF(NHF2_TotMF>0,\"Ok\",\"Error\")","v":"Error"}]
[null,null,null,null,"                                                          Total Male and Female  ",null,null,null,null,null,null,null,null,null,null,null,null,null,null,null,null,null,null,null,null,null,null,null,null,null,null,null,{"$f":"SUM(AD32:AJ32)","v":0},null,null,null,null,"NOTE"]
["Number of residents during the entire reporting period with a diagnosis of mental illness",null,null,null,null,null,null,null,null,null,null,null,null,null,null,null,null,null,null,null,null,null,null,null,null,null,null,null,null,null,null,null,null,null,null,null,null,"All Three (3) Totals should equal the same amount!"]
["Number of residents during the entire reporting period with a diagnosis of mental retardation"]
["Length of\nStay for the     Entire Reporting Period",null,null,null,"Enter the number of residents for the entire reporting period whose length of stay correspond to the following categories. This Total should match Total Male & Female Gender Line 33, also the Total Residents Length of Stay Line44, the Total Residents Patient Origin Line 84.",null,null,null,null,null,null,null,null,null,null,null,null,null,null,null,null,null,null,null,null,null,null,null,null,null,null,null,"Number of Residents",null,null,null,null,"1. Total Male and      Female (Line 33)."]
[null,null,null,null,"Less Than 100 Days",null,null,null,null,null,null,null,null,null,null,null,null,null,null,null,null,null,null,null,null,null,null,null,null,null,null,null,null,null,null,null,"Length\nof\nStay\nResponse\nNeeded","2. Total Length of Stay Residents (Line 44)"]
[null,null,null,null,"100 Days to 180 Days"]
[null,null,null,null,"181 Days to 364 Days",null,null,null,null,null,null,null,null,null,null,null,null,null,null,null,null,null,null,null,null,null,null,null,null,null,null,null,null,null,null,null,null,"3. Patient Origin           Total Residents            (Line 84)."]
[null,null,null,null,"1 Year to Less Than 2 Years"]
[null,null,null,null,"2 Years to Less Than 3 Years"]
[null,null,null,null,"3 Years to Less Than 4 Years",null,null,null,null,null,null,null,null,null,null,null,null,null,null,null,null,null,null,null,null,null,null,null,null,null,null,null,null,null,null,null,null,{"$f":"IF(OR(AND(NHF2_TotTNOthST<>NHF2_TotMF),AND(NHF2_TotTNOthST<>NHF2_LSTot)),\"Error\",\"Ok\")","v":"Ok"}]
[null,null,null,null,"4 or More Years",null,null,null,null,null,null,null,null,null,null,null,null,null,null,null,null,null,null,null,null,null,null,null,null,null,null,null,null,null,null,null,{"$f":"IF(NHF2_LSTot>0,\"Ok\",\"Error\")","v":"Error"}]
[null,null,null,null,"                                                                                        Total",null,null,null,null,null,null,null,null,null,null,null,null,null,null,null,null,null,null,null,null,null,null,null,null,null,null,null,{"$f":"SUM(AG37:AJ43)","v":0}]
["Patient Origin for the Entire  Reporting Period\n\nTennessee\nCounties",null,null,null,null,null,"Please enter the number of residents from each county who received services during the Entire reporting period"]
[null,null,null,null,null,null,"County",null,null,null,null,null,"Number of\nResidents",null,null,null,"County",null,null,null,null,null,"Number of\nResidents",null,null,null,"County",null,null,null,null,null,"Number of\nResidents"]
[null,null,null,null,null,null," 01 Anderson",null,null,null,null,null,null,null,null,null," 33 Hamilton",null,null,null,null,null,null,null,null,null," 65 Morgan"]
[null,null,null,null,null,null," 02 Bedford",null,null,null,null,null,null,null,null,null," 34 Hancock",null,null,null,null,null,null,null,null,null," 66 Obion"]
[null,null,null,null,null,null," 03 Benton",null,null,null,null,null,null,null,null,null," 35 Hardeman",null,null,null,null,null,null,null,null,null," 67 Overton"]
[null,null,null,null,null,null," 04 Bledsoe",null,null,null,null,null,null,null,null,null," 36 Hardin",null,null,null,null,null,null,null,null,null," 68 Perry"]
[null,null,null,null,null,null," 05 Blount",null,null,null,null,null,null,null,null,null," 37 Hawkins",null,null,null,null,null,null,null,null,null," 69 Pickett"]
[null,null,null,null,null,null," 06 Bradley",null,null,null,null,null,null,null,null,null," 38 Haywood",null,null,null,null,null,null,null,null,null," 70 Polk"]
[null,null,null,null,null,null," 07 Campbell",null,null,null,null,null,null,null,null,null," 39 Henderson",null,null,null,null,null,null,null,null,null," 71 Putnam"]
[null,null,null,null,null,null," 08 Cannon",null,null,null,null,null,null,null,null,null," 40 Henry",null,null,null,null,null,null,null,null,null," 72 Rhea"]
[null,null,null,null,null,null," 09 Carroll",null,null,null,null,null,null,null,null,null," 41 Hickman",null,null,null,null,null,null,null,null,null," 73 Roane"]
[null,null,null,null,null,null," 10 Carter",null,null,null,null,null,null,null,null,null," 42 Houston",null,null,null,null,null,null,null,null,null," 74 Robertson"]
[null,null,null,null,null,null," 11 Cheatham",null,null,null,null,null,null,null,null,null," 43 Humphreys",null,null,null,null,null,null,null,null,null," 75 Rutherford"]
[null,null,null,null,null,null," 12 Chester",null,null,null,null,null,null,null,null,null," 44 Jackson",null,null,null,null,null,null,null,null,null," 76 Scott"]
[null,null,null,null,null,null," 13 Claiborne",null,null,null,null,null,null,null,null,null," 45 Jefferson",null,null,null,null,null,null,null,null,null," 77 Sequatchie"]
[null,null,null,null,null,null," 14 Clay",null,null,null,null,null,null,null,null,null," 46 Johnson",null,null,null,null,null,null,null,null,null," 78 Sevier"]
[null,null,null,null,null,null," 15 Cocke",null,null,null,null,null,null,null,null,null," 47 Knox",null,null,null,null,null,null,null,null,null," 79 Shelby"]
[null,null,null,null,null,null," 16 Coffee",null,null,null,null,null,null,null,null,null," 48 Lake",null,null,null,null,null,null,null,null,null," 80 Smith"]
[null,null,null,null,null,null," 17 Crockett",null,null,null,null,null,null,null,null,null," 49 Lauderdale",null,null,null,null,null,null,null,null,null," 81 Stewart"]
[null,null,null,null,null,null," 18 Cumberland",null,null,null,null,null,null,null,null,null," 50 Lawrence",null,null,null,null,null,null,null,null,null," 82 Sullivan",null,null,null,null,null,null,null,null,null,null,"Total Male &\nFemale \nSchedule\nF2\n\nTotal Length of Stay\nSchedule         F2                                                                         \n                                                                               Total\nResidents\nSchedule\nF2                                                                                                                                                                                                                                                                                                           All Equal Same Amount"]
[null,null,null,null,null,null," 19 Davidson",null,null,null,null,null,null,null,null,null," 51 Lewis",null,null,null,null,null,null,null,null,null," 83 Sumner"]
[null,null,null,null,null,null," 20 Decatur",null,null,null,null,null,null,null,null,null," 52 Lincoln",null,null,null,null,null,null,null,null,null," 84 Tipton"]
[null,null,null,null,null,null," 21 DeKalb",null,null,null,null,null,null,null,null,null," 53 Loudon",null,null,null,null,null,null,null,null,null," 85 Trousdale"]
[null,null,null,null,null,null," 22 Dickson",null,null,null,null,null,null,null,null,null," 54 McMinn",null,null,null,null,null,null,null,null,null," 86 Unicoi"]
[null,null,null,null,null,null," 23 Dyer",null,null,null,null,null,null,null,null,null," 55 McNairy",null,null,null,null,null,null,null,null,null," 87 Union"]
[null,null,null,null,null,null," 24 Fayette",null,null,null,null,null,null,null,null,null," 56 Macon",null,null,null,null,null,null,null,null,null," 88 Van Buren"]
[null,null,null,null,null,null," 25 Fentress",null,null,null,null,null,null,null,null,null," 57 Madison",null,null,null,null,null,null,null,null,null," 89 Warren"]
[null,null,null,null,null,null," 26 Franklin",null,null,null,null,null,null,null,null,null," 58 Marion",null,null,null,null,null,null,null,null,null," 90 Washington",null,null,null,null,null,null,null,null,null,"Patient\nOrigin\nTN\nCounties\nResponse \nNeeded"]
[null,null,null,null,null,null," 27 Gibson",null,null,null,null,null,null,null,null,null," 59 Marshall",null,null,null,null,null,null,null,null,null," 91 Wayne"]
[null,null,null,null,null,null," 28 Giles",null,null,null,null,null,null,null,null,null," 60 Maury",null,null,null,null,null,null,null,null,null," 92 Weakley"]
[null,null,null,null,null,null," 29 Grainger",null,null,null,null,null,null,null,null,null," 61 Meigs",null,null,null,null,null,null,null,null,null," 93 White"]
[null,null,null,null,null,null," 30 Greene",null,null,null,null,null,null,null,null,null," 62 Monroe",null,null,null,null,null,null,null,null,null," 94 Williamson"]
[null,null,null,null,null,null," 31 Grundy",null,null,null,null,null,null,null,null,null," 63 Montgomery",null,null,null,null,null,null,null,null,null," 95 Wilson"]
[null,null,null,null,null,null," 32 Hamblen",null,null,null,null,null,null,null,null,null," 64 Moore",null,null,null,null,null,null,null,null,null," 96 Unknown",null,null,null,null,null,null,null,null,null,{"$f":"IF(NHF2_TNTot>0,\"Ok\",\"Error\")","v":"Error"}]
[null,null,null,null,null,null,"                                            Total Tennessee Residents",null,null,null,null,null,null,null,null,null,null,null,null,null,null,null,null,null,null,null,null,null,null,null,null,null,{"$f":"((SUM(NHF2_TN01:NHF2_TN32))+(SUM(NHF2_TN33:NHF2_TN64))+(SUM(NHF2_TN65:NHF2_TN96)))","v":0}]
["Patient Origin      for the Entire Reporting Period\n\nOut of State",null,null,null,null,null," 01 Alabama",null,null,null,null,null,null,null,null,null," 18 Kentucky",null,null,null,null,null,null,null,null,null," 34 North Carolina",null,null,null,null,null,null,null,null,null,null,{"$f":"IF(OR(AND(NHF2_TotTNOthST<>NHF2_TotMF),AND(NHF2_TotTNOthST<>NHF2_LSTot)),\"Error\", \"Ok\")","v":"Ok"}]
[null,null,null,null,null,null," 04 Arkansas",null,null,null,null,null,null,null,null,null," 25 Mississippi",null,null,null,null,null,null,null,null,null," 47 Virginia"]
[null,null,null,null,null,null," 11 Georgia",null,null,null,null,null,null,null,null,null," 26 Missouri",null,null,null,null,null,null,null,null,null,"55 Other States/\nCountries"]
[null,null,null,null,null,null,"                                         Total Non-Tennessee Residents ",null,null,null,null,null,null,null,null,null,null,null,null,null,null,null,null,null,null,null,null,null,null,null,null,null,{"$f":"((SUM(M80:P82))+(SUM(W80:Z82))+(SUM(AG80:AJ82)))","v":0}]
["                                                                                    Total Residents ",null,null,null,null,null,null,null,null,null,null,null,null,null,null,null,null,null,null,null,null,null,null,null,null,null,null,null,null,null,null,null,{"$f":"(NHF2_TNTot+NHF2_OthSTTot)","v":0}]
["Go to Next Schedule"]
["Return to Main Menu"]
["Got to Error Listing"]

{"sheet":"F-2-Data","index":21,"n_rows":4,"n_cols":249,"rows_kept":4,"cut":false,"hidden":true,"merged":[[0,131,1,132],[0,133,1,140]]}
["Facility ID Info",null,null,"Resident Days of Care",null,null,null,null,null,null,null,null,null,null,null,null,null,null,null,null,null,null,null,null,null,null,null,null,null,null,null,null,null,null,"Age, Race and Gender on the last day of the reporting period",null,null,null,null,null,null,null,null,null,null,null,null,null,null,null,null,null,null,null,null,null,null,null,null,null,null,null,null,null,null,null,null,null,null,null,null,null,null,null,null,null,null,null,null,null,null,null,null,null,null,null,null,null,null,null,null,null,null,null,null,null,null,null,null,null,null,null,null,null,null,null,null,null,null,null,null,null,null,null,null,null,null,null,null,null,null,null,null,null,null,null,null,null,null,null,null,"Number of residents on\nlast day",null,"Length of Stay",null,null,null,null,null,null,null,"Patient Origin"]
[null,null,null,"Medicare Advantage",null,"All Other Medicare",null,"TennCare MCO",null,null,"All Other Medicaid/TennCare",null,null,"VA Contract",null,null,"Other Government",null,null,"Access TN",null,null,"Private (Self Pay)",null,null,"Long-Term Care Insurance",null,null,"Other non-government",null,null,"Total (System Calculation)",null,null,"Age Under 21",null,null,null,null,null,null,null,"Age 21-59",null,null,null,null,null,null,null,"Age 60-64",null,null,null,null,null,null,null,"Age 65-69",null,null,null,null,null,null,null,"Age 70-74",null,null,null,null,null,null,null,"Age 75-79",null,null,null,null,null,null,null,"Age 80-84",null,null,null,null,null,null,null,"Age 85-89",null,null,null,null,null,null,null,"Age 90-94",null,null,null,null,null,null,null,"Age 95-99",null,null,null,null,null,null,null,"Age 100 & Over",null,null,null,null,null,null,null,"Total (System Calculation)",null,null,null,null,null,null,null,null,null,null,null,null,null,null,null,null,null,null,"Tennessee Counties",null,null,null,null,null,null,null,null,null,null,null,null,null,null,null,null,null,null,null,null,null,null,null,null,null,null,null,null,null,null,null,null,null,null,null,null,null,null,null,null,null,null,null,null,null,null,null,null,null,null,null,null,null,null,null,null,null,null,null,null,null,null,null,null,null,null,null,null,null,null,null,null,null,null,null,null,null,null,null,null,null,null,null,null,null,null,null,null,null,null,null,null,null,null,null,null,"Out of State",null,null,null,null,null,null,null,null,null,"Total  "]
["State ID","NH Name","County","Level II Care\nSkilled\nNursing","Total\nSystem\nCalculation","Level II Care\nSkilled\nNursing","Total\nSystem\nCalculation","Level I Care\nIntermediate\nCare","Level II Care\nSkilled\nNursing","Total\nSystem\nCalculation","Level I Care\nIntermediate\nCare","Level II Care\nSkilled\nNursing","Total\nSystem\nCalculation","Level I Care\nIntermediate\nCare","Level II Care\nSkilled\nNursing","Total\nSystem\nCalculation","Level I Care\nIntermediate\nCare","Level II Care\nSkilled\nNursing","Total\nSystem\nCalculation","Level I Care\nIntermediate\nCare","Level II Care\nSkilled\nNursing","Total\nSystem\nCalculation","Level I Care\nIntermediate\nCare","Level II Care\nSkilled\nNursing","Total\nSystem\nCalculation","Level I Care\nIntermediate\nCare","Level II Care\nSkilled\nNursing","Total\nSystem\nCalculation","Level I Care\nIntermediate\nCare","Level II Care\nSkilled\nNursing","Total\nSystem\nCalculation","Level I Care\nIntermediate\nCare","Level II Care\nSkilled\nNursing","Total\nSystem\nCalculation","White\nMale","White\nFemale","Black\nMale","Black\nFemale","Other\nMale","Other\nFemale","Total\nMale","Total\nFemale","White\nMale","White\nFemale","Black\nMale","Black\nFemale","Other\nMale","Other\nFemale","Total\nMale","Total\nFemale","White\nMale","White\nFemale","Black\nMale","Black\nFemale","Other\nMale","Other\nFemale","Total\nMale","Total\nFemale","White\nMale","White\nFemale","Black\nMale","Black\nFemale","Other\nMale","Other\nFemale","Total\nMale","Total\nFemale","White\nMale","White\nFemale","Black\nMale","Black\nFemale","Other\nMale","Other\nFemale","Total\nMale","Total\nFemale","White\nMale","White\nFemale","Black\nMale","Black\nFemale","Other\nMale","Other\nFemale","Total\nMale","Total\nFemale","White\nMale","White\nFemale","Black\nMale","Black\nFemale","Other\nMale","Other\nFemale","Total\nMale","Total\nFemale","White\nMale","White\nFemale","Black\nMale","Black\nFemale","Other\nMale","Other\nFemale","Total\nMale","Total\nFemale","White\nMale","White\nFemale","Black\nMale","Black\nFemale","Other\nMale","Other\nFemale","Total\nMale","Total\nFemale","White\nMale","White\nFemale","Black\nMale","Black\nFemale","Other\nMale","Other\nFemale","Total\nMale","Total\nFemale","White\nMale","White\nFemale","Black\nMale","Black\nFemale","Other\nMale","Other\nFemale","Total\nMale","Total\nFemale","Total\nWhite\nMale","Total\nWhite\nFemale","Total\nBlack\nMale","Total\nBlack\nFemale","Total\nOther\nMale","Total\nOther\nFemale","Total\nMale","Total\nFemale","Total\nMale and\nFemale","Mental\nIllness","Mental\nRetardation","Less than\n100 days","100 to 180\ndays","181 to 364\ndays","1 year to\nless than\n2 years","2 years to\nless than\n3 years","3 years to\nless than\n4 years","4 or more\nyears","Total\n(System\nCalculation)","Anderson","Bedford","Benton","Bledsoe","Blount","Bradley","Campbell","Cannon","Carroll","Carter","Cheatham","Chester","Claiborne","Clay","Cocke","Coffee","Crockett","Cumberland","Davidson","Decatur","DeKalb","Dickson","Dyer","Fayette","Fentress","Franklin","Gibson","Giles","Grainger","Greene","Grundy","Hamblen","Hamilton","Hancock","Hardeman","Hardin","Hawkins","Haywood","Henderson","Henry","Hickman","Houston","Humphreys","Jackson","Jefferson","Johnson","Knox","Lake","Lauderdale","Lawrence","Lewis","Lincoln","Loudon","McMinn","McNairy","Macon","Madison","Marion","Marshall","Maury","Meigs","Monroe","Montgomery","Moore","Morgan","Obion","Overton","Perry","Pickett","Polk","Putnam","Rhea","Roane","Robertson","Rutherford","Scott","Sequatchie","Sevier","Shelby","Smith","Stewart","Sullivan","Sumner","Tipton","Trousdale","Unicoi","Union","VanBuren","Warren","Washington","Wayne","Weakley","White","Williamson","Wilson","Unknown\nCounty","Total\nTN\nResidents","Alabama","Arkansas","Georgia","Kentucky","Mississippi","Missouri","North\nCarolina","Virginia","OtherStates","Non TN\nResidents","Total\nResidents"]
[{"$f":"NHA_StateID","v":0},{"$f":"NHA_Name","v":"-"},{"$f":"NHA_County","v":"-"},{"$f":"IF(NHF2_RDCMALev2>0,NHF2_RDCMALev2,\"\")","v":""},{"$f":"IF(NHF2_RDCMATot>0,NHF2_RDCMATot,\"\")","v":""},{"$f":"IF(NHF2_RDCOMlev2>0,NHF2_RDCOMlev2,\"\")","v":""},{"$f":"IF(NHF2_RDCOMTot>0,NHF2_RDCOMTot,\"\")","v":""},{"$f":"IF(NHF2_RDCTCLev1>0,NHF2_RDCTCLev1,\"\")","v":""},{"$f":"IF(NHF2_RDCTCLev2>0,NHF2_RDCTCLev2,\"\")","v":""},{"$f":"IF(NHF2_RDCTCTot>0,NHF2_RDCTCTot,\"\")","v":""},{"$f":"IF(NHF2_RDCOTCLev1>0,NHF2_RDCOTCLev1,\"\")","v":""},{"$f":"IF(NHF2_RDCOTCLev2>0,NHF2_RDCOTCLev2,\"\")","v":""},{"$f":"IF(NHF2_RDCOTCTot>0,NHF2_RDCOTCTot,\"\")","v":""},{"$f":"IF(NHF2_RDCVALev1>0,NHF2_RDCVALev1,\"\")","v":""},{"$f":"IF(NHF2_RDCVALev2>0,NHF2_RDCVALev2,\"\")","v":""},{"$f":"IF(NHF2_RDCVATot>0,NHF2_RDCVATot,\"\")","v":""},{"$f":"IF(NHF2_RDCOthGovLev1>0,NHF2_RDCOthGovLev1,\"\")","v":""},{"$f":"IF(NHF2_RDCOthGovLev2>0,NHF2_RDCOthGovLev2,\"\")","v":""},{"$f":"IF(NHF2_RDCOthGovTot>0,NHF2_RDCOthGovTot,\"\")","v":""},{"$f":"IF(NHF2_RDCACTNLev1>0,NHF2_RDCACTNLev1,\"\")","v":""},{"$f":"IF(NHF2_RDCACTNLev2>0,NHF2_RDCACTNLev2,\"\")","v":""},{"$f":"IF(NHF2_RDCACTNTot>0,NHF2_RDCACTNTot,\"\")","v":""},{"$f":"IF(NHF2_RDCPriLEv1>0,NHF2_RDCPriLEv1,\"\")","v":""},{"$f":"IF(NHF2_RDCPriLev2>0,NHF2_RDCPriLev2,\"\")","v":""},{"$f":"IF(NHF2_RDCPriTot>0,NHF2_RDCPriTot,\"\")","v":""},{"$f":"IF(NHF2_RDCLTCLev1>0,NHF2_RDCLTCLev1,\"\")","v":""},{"$f":"IF(NHF2_RDCLTCLev2>0,NHF2_RDCLTCLev2,\"\")","v":""},{"$f":"IF(NHF2_RDCLTCTot>0,NHF2_RDCLTCTot,\"\")","v":""},{"$f":"IF(NHF2_RDCOthLev1>0,NHF2_RDCOthLev1,\"\")","v":""},{"$f":"IF(NHF2_RDCOthLev2>0,NHF2_RDCOthLev2,\"\")","v":""},{"$f":"IF(NHF2_RDCOthTot>0,NHF2_RDCOthTot,\"\")","v":""},{"$f":"IF(NHF2_RDCTotLev1>0,NHF2_RDCTotLev1,\"\")","v":""},{"$f":"IF(NHF2_RDCTotLEv2>0,NHF2_RDCTotLEv2,\"\")","v":""},{"$f":"IF(NHF2_RDCTotTot>0,NHF2_RDCTotTot,\"\")","v":""},{"$f":"IF(NHF2_U21WM>0,NHF2_U21WM,\"\")","v":""},{"$f":"IF(NHF2_U21WF>0,NHF2_U21WF,\"\")","v":""},{"$f":"IF(NHF2_U21BM>0,NHF2_U21BM,\"\")","v":""},{"$f":"IF(NHF2_U21BF>0,NHF2_U21BF,\"\")","v":""},{"$f":"IF(NHF2_U21OM>0,NHF2_U21OM,\"\")","v":""},{"$f":"IF(NHF2_U21OF>0,NHF2_U21OF,\"\")","v":""},{"$f":"IF(NHF2_U21MTot>0,NHF2_U21MTot,\"\")","v":""},{"$f":"IF(NHF2_U21FTot>0,NHF2_U21FTot,\"\")","v":""},{"$f":"IF(NHF2_2159WM>0,NHF2_2159WM,\"\")","v":""},{"$f":"IF(NHF2_2159WF>0,NHF2_2159WF,\"\")","v":""},{"$f":"IF(NHF2_2159BM>0,NHF2_2159BM,\"\")","v":""},{"$f":"IF(NHF2_2159BF>0,NHF2_2159BF,\"\")","v":""},{"$f":"IF(NHF2_2159OM>0,NHF2_2159OM,\"\")","v":""},{"$f":"IF(NHF2_2159OF>0,NHF2_2159OF,\"\")","v":""},{"$f":"IF(NHF2_2159MTot>0,NHF2_2159MTot,\"\")","v":""},{"$f":"IF(NHF2_2159FTot>0,NHF2_2159FTot,\"\")","v":""},{"$f":"IF(NHF2_6064WM>0,NHF2_6064WM,\"\")","v":""},{"$f":"IF(NHF2_6064WF>0,NHF2_6064WF,\"\")","v":""},{"$f":"IF(NHF2_6064BM>0,NHF2_6064BM,\"\")","v":""},{"$f":"IF(NHF2_6064BF>0,NHF2_6064BF,\"\")","v":""},{"$f":"IF(NHF2_6064OM>0,NHF2_6064OM,\"\")","v":""},{"$f":"IF(NHF2_6064OF>0,NHF2_6064OF,\"\")","v":""},{"$f":"IF(NHF2_6064MTot>0,NHF2_6064MTot,\"\")","v":""},{"$f":"IF(NHF2_6064FTot>0,NHF2_6064FTot,\"\")","v":""},{"$f":"IF(NHF2_6569WM>0,NHF2_6569WM,\"\")","v":""},{"$f":"IF(NHF2_6569WF>0,NHF2_6569WF,\"\")","v":""},{"$f":"IF(NHF2_6569BM>0,NHF2_6569BM,\"\")","v":""},{"$f":"IF(NHF2_6569BF>0,NHF2_6569BF,\"\")","v":""},{"$f":"IF(NHF2_6569OM>0,NHF2_6569OM,\"\")","v":""},{"$f":"IF(NHF2_6569OF>0,NHF2_6569OF,\"\")","v":""},{"$f":"IF(NHF2_6569MTot>0,NHF2_6569MTot,\"\")","v":""},{"$f":"IF(NHF2_6569FTot>0,NHF2_6569FTot,\"\")","v":""},{"$f":"IF(NHF2_7074WM>0,NHF2_7074WM,\"\")","v":""},{"$f":"IF(NHF2_7074WF>0,NHF2_7074WF,\"\")","v":""},{"$f":"IF(NHF2_7074BM>0,NHF2_7074BM,\"\")","v":""},{"$f":"IF(NHF2_7074BF>0,NHF2_7074BF,\"\")","v":""},{"$f":"IF(NHF2_7074OM>0,NHF2_7074OM,\"\")","v":""},{"$f":"IF(NHF2_7074OF>0,NHF2_7074OF,\"\")","v":""},{"$f":"IF(NHF2_7074MTot>0,NHF2_7074MTot,\"\")","v":""},{"$f":"IF(NHF2_7074FTot>0,NHF2_7074FTot,\"\")","v":""},{"$f":"IF(NHF2_7579WM>0,NHF2_7579WM,\"\")","v":""},{"$f":"IF(NHF2_7579WF>0,NHF2_7579WF,\"\")","v":""},{"$f":"IF(NHF2_7579BM>0,NHF2_7579BM,\"\")","v":""},{"$f":"IF(NHF2_7579BF>0,NHF2_7579BF,\"\")","v":""},{"$f":"IF(NHF2_7579OM>0,NHF2_7579OM,\"\")","v":""},{"$f":"IF(NHF2_7579OF>0,NHF2_7579OF,\"\")","v":""},{"$f":"IF(NHF2_7579MTot>0,NHF2_7579MTot,\"\")","v":""},{"$f":"IF(NHF2_7579FTot>0,NHF2_7579FTot,\"\")","v":""},{"$f":"IF(NHF2_8084WM>0,NHF2_8084WM,\"\")","v":""},{"$f":"IF(NHF2_8084WF>0,NHF2_8084WF,\"\")","v":""},{"$f":"IF(NHF2_8084BM>0,NHF2_8084BM,\"\")","v":""},{"$f":"IF(NHF2_8084BF>0,NHF2_8084BF,\"\")","v":""},{"$f":"IF(NHF2_8084OM>0,NHF2_8084OM,\"\")","v":""},{"$f":"IF(NHF2_8084OF>0,NHF2_8084OF,\"\")","v":""},{"$f":"IF(NHF2_8084MTot>0,NHF2_8084MTot,\"\")","v":""},{"$f":"IF(NHF2_8084FTot>0,NHF2_8084FTot,\"\")","v":""},{"$f":"IF(NHF2_8589WM>0,NHF2_8589WM,\"\")","v":""},{"$f":"IF(NHF2_8589WF>0,NHF2_8589WF,\"\")","v":""},{"$f":"IF(NHF2_8589BM>0,NHF2_8589BM,\"\")","v":""},{"$f":"IF(NHF2_8589BF>0,NHF2_8589BF,\"\")","v":""},{"$f":"IF(NHF2_8589OM>0,NHF2_8589OM,\"\")","v":""},{"$f":"IF(NHF2_8589OF>0,NHF2_8589OF,\"\")","v":""},{"$f":"IF(NHF2_8589MTot>0,NHF2_8589MTot,\"\")","v":""},{"$f":"IF(NHF2_8589FTot>0,NHF2_8589FTot,\"\")","v":""},{"$f":"IF(NHF2_9094WM>0,NHF2_9094WM,\"\")","v":""},{"$f":"IF(NHF2_9094WF>0,NHF2_9094WF,\"\")","v":""},{"$f":"IF(NHF2_9094BM>0,NHF2_9094BM,\"\")","v":""},{"$f":"IF(NHF2_9094BF>0,NHF2_9094BF,\"\")","v":""},{"$f":"IF(NHF2_9094OM>0,NHF2_9094OM,\"\")","v":""},{"$f":"IF(NHF2_9094OF>0,NHF2_9094OF,\"\")","v":""},{"$f":"IF(NHF2_9094MTot>0,NHF2_9094MTot,\"\")","v":""},{"$f":"IF(NHF2_9094FTot>0,NHF2_9094FTot,\"\")","v":""},{"$f":"IF(NHF2_9599WM>0,NHF2_9599WM,\"\")","v":""},{"$f":"IF(NHF2_9599WF>0,NHF2_9599WF,\"\")","v":""},{"$f":"IF(NHF2_9599BM>0,NHF2_9599BM,\"\")","v":""},{"$f":"IF(NHF2_9599BF>0,NHF2_9599BF,\"\")","v":""},{"$f":"IF(NHF2_9599OM>0,NHF2_9599OM,\"\")","v":""},{"$f":"IF(NHF2_9599OF>0,NHF2_9599OF,\"\")","v":""},{"$f":"IF(NHF2_9599MTot>0,NHF2_9599MTot,\"\")","v":""},{"$f":"IF(NHF2_9599FTot>0,NHF2_9599FTot,\"\")","v":""},{"$f":"IF(NHF2_100WM>0,NHF2_100WM,\"\")","v":""},{"$f":"IF(NHF2_100WF>0,NHF2_100WF,\"\")","v":""},{"$f":"IF(NHF2_100BM>0,NHF2_100BM,\"\")","v":""},{"$f":"IF(NHF2_100BF>0,NHF2_100BF,\"\")","v":""},{"$f":"IF(NHF2_100OM>0,NHF2_100OM,\"\")","v":""},{"$f":"IF(NHF2_100OF>0,NHF2_100OF,\"\")","v":""},{"$f":"IF(NHF2_100MTot>0,NHF2_100MTot,\"\")","v":""},{"$f":"IF(NHF2_100FTot>0,NHF2_100FTot,\"\")","v":""},{"$f":"IF(NHF2_TotWM>0,NHF2_TotWM,\"\")","v":""},{"$f":"IF(NHF2_TotWF>0,NHF2_TotWF,\"\")","v":""},{"$f":"IF(NHF2_TotBM>0,NHF2_TotBM,\"\")","v":""},{"$f":"IF(NHF2_TotBF>0,NHF2_TotBF,\"\")","v":""},{"$f":"IF(NHF2_TotOM>0,NHF2_TotOM,\"\")","v":""},{"$f":"IF(NHF2_TotOF>0,NHF2_TotOF,\"\")","v":""},{"$f":"IF(NHF2_MTot>0,NHF2_MTot,\"\")","v":""},{"$f":"IF(NHF2_FTot>0,NHF2_FTot,\"\")","v":""},{"$f":"IF(NHF2_TotMF>0,NHF2_TotMF,\"\")","v":""},{"$f":"IF(NHF2_MentIll>0,NHF2_MentIll,\"\")","v":""},{"$f":"IF(NHF2_MentRet>0,NHF2_MentRet,\"\")","v":""},{"$f":"IF(NHF2_LSL100>0,NHF2_LSL100,\"\")","v":""},{"$f":"IF(NHF2_LS100180>0,NHF2_LS100180,\"\")","v":""},{"$f":"IF(NHF2_LS181364>0,NHF2_LS181364,\"\")","v":""},{"$f":"IF(NHF2_LS1YR>0,NHF2_LS1YR,\"\")","v":""},{"$f":"IF(NHF2_LS2YR>0,NHF2_LS2YR,\"\")","v":""},{"$f":"IF(NHF2_LS3YR>0,NHF2_LS3YR,\"\")","v":""},{"$f":"IF(NHF2_LS4YR>0,NHF2_LS4YR,\"\")","v":""},{"$f":"IF(NHF2_LSTot>0,NHF2_LSTot,\"\")","v":""},{"$f":"IF(NHF2_TN01>0,NHF2_TN01,\"\")","v":""},{"$f":"IF(NHF2_TN02>0,NHF2_TN02,\"\")","v":""},{"$f":"IF(NHF2_TN03>0,NHF2_TN03,\"\")","v":""},{"$f":"IF(NHF2_TN04>0,NHF2_TN04,\"\")","v":""},{"$f":"IF(NHF2_TN05>0,NHF2_TN05,\"\")","v":""},{"$f":"IF(NHF2_TN06>0,NHF2_TN06,\"\")","v":""},{"$f":"IF(NHF2_TN07>0,NHF2_TN07,\"\")","v":""},{"$f":"IF(NHF2_TN08>0,NHF2_TN08,\"\")","v":""},{"$f":"IF(NHF2_TN09>0,NHF2_TN09,\"\")","v":""},{"$f":"IF(NHF2_TN10>0,NHF2_TN10,\"\")","v":""},{"$f":"IF(NHF2_TN11>0,NHF2_TN11,\"\")","v":""},{"$f":"IF(NHF2_TN12>0,NHF2_TN12,\"\")","v":""},{"$f":"IF(NHF2_TN13>0,NHF2_TN13,\"\")","v":""},{"$f":"IF(NHF2_TN14>0,NHF2_TN14,\"\")","v":""},{"$f":"IF(NHF2_TN15>0,NHF2_TN15,\"\")","v":""},{"$f":"IF(NHF2_TN16>0,NHF2_TN16,\"\")","v":""},{"$f":"IF(NHF2_TN17>0,NHF2_TN17,\"\")","v":""},{"$f":"IF(NHF2_TN18>0,NHF2_TN18,\"\")","v":""},{"$f":"IF(NHF2_TN19>0,NHF2_TN19,\"\")","v":""},{"$f":"IF(NHF2_TN20>0,NHF2_TN20,\"\")","v":""},{"$f":"IF(NHF2_TN21>0,NHF2_TN21,\"\")","v":""},{"$f":"IF(NHF2_TN22>0,NHF2_TN22,\"\")","v":""},{"$f":"IF(NHF2_TN23>0,NHF2_TN23,\"\")","v":""},{"$f":"IF(NHF2_TN24>0,NHF2_TN24,\"\")","v":""},{"$f":"IF(NHF2_TN25>0,NHF2_TN25,\"\")","v":""},{"$f":"IF(NHF2_TN26>0,NHF2_TN26,\"\")","v":""},{"$f":"IF(NHF2_TN27>0,NHF2_TN27,\"\")","v":""},{"$f":"IF(NHF2_TN28>0,NHF2_TN28,\"\")","v":""},{"$f":"IF(NHF2_TN29>0,NHF2_TN29,\"\")","v":""},{"$f":"IF(NHF2_TN30>0,NHF2_TN30,\"\")","v":""},{"$f":"IF(NHF2_TN31>0,NHF2_TN31,\"\")","v":""},{"$f":"IF(NHF2_TN32>0,NHF2_TN32,\"\")","v":""},{"$f":"IF(NHF2_TN33>0,NHF2_TN33,\"\")","v":""},{"$f":"IF(NHF2_TN34>0,NHF2_TN34,\"\")","v":""},{"$f":"IF(NHF2_TN35>0,NHF2_TN35,\"\")","v":""},{"$f":"IF(NHF2_TN36>0,NHF2_TN36,\"\")","v":""},{"$f":"IF(NHF2_TN37>0,NHF2_TN37,\"\")","v":""},{"$f":"IF(NHF2_TN38>0,NHF2_TN38,\"\")","v":""},{"$f":"IF(NHF2_TN39>0,NHF2_TN39,\"\")","v":""},{"$f":"IF(NHF2_TN40>0,NHF2_TN40,\"\")","v":""},{"$f":"IF(NHF2_TN41>0,NHF2_TN41,\"\")","v":""},{"$f":"IF(NHF2_TN42>0,NHF2_TN42,\"\")","v":""},{"$f":"IF(NHF2_TN43>0,NHF2_TN43,\"\")","v":""},{"$f":"IF(NHF2_TN44>0,NHF2_TN44,\"\")","v":""},{"$f":"IF(NHF2_TN45>0,NHF2_TN45,\"\")","v":""},{"$f":"IF(NHF2_TN46>0,NHF2_TN46,\"\")","v":""},{"$f":"IF(NHF2_TN47>0,NHF2_TN47,\"\")","v":""},{"$f":"IF(NHF2_TN48>0,NHF2_TN48,\"\")","v":""},{"$f":"IF(NHF2_TN49>0,NHF2_TN49,\"\")","v":""},{"$f":"IF(NHF2_TN50>0,NHF2_TN50,\"\")","v":""},{"$f":"IF(NHF2_TN51>0,NHF2_TN51,\"\")","v":""},{"$f":"IF(NHF2_TN52>0,NHF2_TN52,\"\")","v":""},{"$f":"IF(NHF2_TN53>0,NHF2_TN53,\"\")","v":""},{"$f":"IF(NHF2_TN54>0,NHF2_TN54,\"\")","v":""},{"$f":"IF(NHF2_TN55>0,NHF2_TN55,\"\")","v":""},{"$f":"IF(NHF2_TN56>0,NHF2_TN56,\"\")","v":""},{"$f":"IF(NHF2_TN57>0,NHF2_TN57,\"\")","v":""},{"$f":"IF(NHF2_TN58>0,NHF2_TN58,\"\")","v":""},{"$f":"IF(NHF2_TN59>0,NHF2_TN59,\"\")","v":""},{"$f":"IF(NHF2_TN60>0,NHF2_TN60,\"\")","v":""},{"$f":"IF(NHF2_TN61>0,NHF2_TN61,\"\")","v":""},{"$f":"IF(NHF2_TN62>0,NHF2_TN62,\"\")","v":""},{"$f":"IF(NHF2_TN63>0,NHF2_TN63,\"\")","v":""},{"$f":"IF(NHF2_TN64>0,NHF2_TN64,\"\")","v":""},{"$f":"IF(NHF2_TN65>0,NHF2_TN65,\"\")","v":""},{"$f":"IF(NHF2_TN66>0,NHF2_TN66,\"\")","v":""},{"$f":"IF(NHF2_TN67>0,NHF2_TN67,\"\")","v":""},{"$f":"IF(NHF2_TN68>0,NHF2_TN68,\"\")","v":""},{"$f":"IF(NHF2_TN69>0,NHF2_TN69,\"\")","v":""},{"$f":"IF(NHF2_TN70>0,NHF2_TN70,\"\")","v":""},{"$f":"IF(NHF2_TN71>0,NHF2_TN71,\"\")","v":""},{"$f":"IF(NHF2_TN72>0,NHF2_TN72,\"\")","v":""},{"$f":"IF(NHF2_TN73>0,NHF2_TN73,\"\")","v":""},{"$f":"IF(NHF2_TN74>0,NHF2_TN74,\"\")","v":""},{"$f":"IF(NHF2_TN75>0,NHF2_TN75,\"\")","v":""},{"$f":"IF(NHF2_TN76>0,NHF2_TN76,\"\")","v":""},{"$f":"IF(NHF2_TN77>0,NHF2_TN77,\"\")","v":""},{"$f":"IF(NHF2_TN78>0,NHF2_TN78,\"\")","v":""},{"$f":"IF(NHF2_TN79>0,NHF2_TN79,\"\")","v":""},{"$f":"IF(NHF2_TN80>0,NHF2_TN80,\"\")","v":""},{"$f":"IF(NHF2_TN81>0,NHF2_TN81,\"\")","v":""},{"$f":"IF(NHF2_TN82>0,NHF2_TN82,\"\")","v":""},{"$f":"IF(NHF2_TN83>0,NHF2_TN83,\"\")","v":""},{"$f":"IF(NHF2_TN84>0,NHF2_TN84,\"\")","v":""},{"$f":"IF(NHF2_TN85>0,NHF2_TN85,\"\")","v":""},{"$f":"IF(NHF2_TN86>0,NHF2_TN86,\"\")","v":""},{"$f":"IF(NHF2_TN87>0,NHF2_TN87,\"\")","v":""},{"$f":"IF(NHF2_TN88>0,NHF2_TN88,\"\")","v":""},{"$f":"IF(NHF2_Tn89>0,NHF2_Tn89,\"\")","v":""},{"$f":"IF(NHF2_TN90>0,NHF2_TN90,\"\")","v":""},{"$f":"IF(NHF2_TN91>0,NHF2_TN91,\"\")","v":""},{"$f":"IF(NHF2_TN92>0,NHF2_TN92,\"\")","v":""},{"$f":"IF(NHF2_Tn93>0,NHF2_Tn93,\"\")","v":""},{"$f":"IF(NHF2_TN94>0,NHF2_TN94,\"\")","v":""},{"$f":"IF(NHF2_TN95>0,NHF2_TN95,\"\")","v":""},{"$f":"IF(NHF2_TN96>0,NHF2_TN96,\"\")","v":""},{"$f":"IF(NHF2_TNTot>0,NHF2_TNTot,\"\")","v":""},{"$f":"IF(NHF2_OthAL>0,NHF2_OthAL,\"\")","v":""},{"$f":"IF(NHF2_OthAR>0,NHF2_OthAR,\"\")","v":""},{"$f":"IF(NHF2_OthGA>0,NHF2_OthGA,\"\")","v":""},{"$f":"IF(NHF2_OthKY>0,NHF2_OthKY,\"\")","v":""},{"$f":"IF(NHF2_OthMS>0,NHF2_OthMS,\"\")","v":""},{"$f":"IF(NHF2_OthMO>0,NHF2_OthMO,\"\")","v":""},{"$f":"IF(NHF2_OthNC>0,NHF2_OthNC,\"\")","v":""},{"$f":"IF(NHF2_OthVA>0,NHF2_OthVA,\"\")","v":""},{"$f":"IF(NHF2_OthState>0,NHF2_OthState,\"\")","v":""},{"$f":"IF(NHF2_OthSTTot>0,NHF2_OthSTTot,\"\")","v":""},{"$f":"IF(NHF2_TotTNOthST>0,NHF2_TotTNOthST,\"\")","v":""}]

{"sheet":"Sch G","index":22,"n_rows":67,"n_cols":44,"rows_kept":67,"cut":false,"hidden":false,"merged":[[0,0,0,35],[9,20,9,23],[9,32,9,35],[8,32,8,35],[3,5,3,35],[12,28,12,31],[1,33,1,35],[6,20,6,23],[9,24,9,27],[12,24,12,27],[10,24,10,27],[10,32,10,35],[11,28,11,31],[12,32,12,35],[1,15,1,32],[6,28,6,31],[6,32,6,35],[4,5,4,35],[7,5,7,19],[8,5,8,19],[7,32,7,35],[5,5,6,19],[5,20,5,27],[5,28,5,35],[16,5,16,19],[7,20,7,23],[8,20,8,23],[19,24,19,27],[13,20,13,23],[10,28,10,31],[14,32,14,35],[13,28,13,31],[13,24,13,27],[14,20,14,23],[10,20,10,23],[7,28,7,31],[9,28,9,31],[11,24,11,27],[11,32,11,35],[8,28,8,31],[8,24,8,27],[15,32,15,35],[15,24,15,27],[15,28,15,31],[13,32,13,35],[14,24,14,27],[7,24,7,27],[9,5,9,19],[6,24,6,27],[16,24,16,27],[23,20,23,23],[16,20,16,23],[21,20,21,23],[18,20,18,23],[17,20,17,23],[21,5,21,19],[10,5,10,19],[12,5,12,19],[13,5,13,19],[11,20,11,23],[19,20,19,23],[22,20,22,23],[23,5,23,19],[11,5,11,19],[14,5,14,19],[19,5,19,19],[17,5,17,19],[22,5,22,19],[18,5,18,19],[20,5,20,19],[20,20,20,23],[15,5,15,19],[15,20,15,23],[20,24,20,27],[23,32,23,35],[22,28,22,31],[17,32,17,35],[25,20,25,23],[24,20,24,23],[24,32,24,35],[19,28,19,31],[21,28,21,31],[20,32,20,35],[20,28,20,31],[18,32,18,35],[25,24,25,27],[22,24,22,27],[17,24,17,27],[18,24,18,27],[28,32,28,35],[28,28,28,31],[29,20,29,23],[31,20,31,23],[31,28,31,31],[33,28,33,31],[26,20,26,23],[21,24,21,27],[28,20,28,23],[28,24,28,27],[27,20,27,23],[27,28,27,31],[24,28,24,31],[24,24,24,27],[27,32,27,35],[23,24,23,27],[25,32,25,35],[22,32,22,35],[25,28,25,31],[31,32,31,35],[29,32,29,35],[31,24,31,27],[29,24,29,27],[30,24,30,27],[36,28,36,31],[34,24,34,27],[36,24,36,27],[35,24,35,27],[30,32,30,35],[32,28,32,35],[33,32,33,35],[30,28,30,31],[34,28,34,31],[41,32,41,35],[41,28,41,31],[39,28,39,31],[37,32,37,35],[55,16,55,20],[59,16,59,20],[43,16,43,19],[43,20,43,23],[40,24,40,27],[64,0,64,35],[32,4,33,7],[38,24,38,27],[39,24,39,27],[35,16,35,19],[36,16,36,19],[38,28,38,31],[37,24,37,27],[39,32,39,35],[37,16,37,19],[37,8,37,11],[39,12,39,15],[44,4,44,11],[45,4,45,11],[43,8,43,11],[40,4,43,7],[42,8,42,11],[41,12,41,15],[40,8,40,11],[46,0,47,3],[46,4,46,11],[47,4,47,11],[63,5,63,15],[60,5,60,15],[65,0,65,35],[32,8,33,11],[42,20,42,23],[42,24,42,27],[42,28,42,31],[42,32,42,35],[32,24,33,27],[32,20,33,23],[38,16,38,19],[35,12,35,15],[32,16,33,19],[51,28,51,35],[57,31,57,35],[57,26,57,30],[58,26,58,30],[56,31,56,35],[56,26,56,30],[32,0,45,3],[44,12,44,15],[45,12,45,15],[46,12,46,15],[38,12,38,15],[49,4,49,11],[47,12,47,15],[66,0,66,35],[35,8,35,11],[34,20,34,23],[34,16,34,19],[34,8,34,11],[38,20,38,23],[51,4,51,11],[38,32,38,35],[37,20,37,23],[40,12,40,15],[34,12,34,15],[36,20,36,23],[36,12,36,15],[39,16,39,19],[58,5,58,15],[54,5,54,15],[55,5,55,15],[58,21,58,25],[50,20,50,23],[54,0,58,4],[56,5,56,15],[57,21,57,25],[58,31,58,35],[55,26,55,30],[50,4,50,11],[52,20,52,23],[52,12,52,15],[56,16,56,20],[56,21,56,25],[61,16,61,20],[52,16,52,19],[51,20,51,23],[54,21,54,25],[57,16,57,20],[51,12,51,15],[50,16,50,19],[54,16,54,20],[51,16,51,19],[61,5,61,15],[59,0,63,4],[52,4,52,11],[63,16,63,20],[49,12,49,15],[50,12,50,15],[48,0,52,3],[59,26,63,30],[59,31,59,35],[63,21,63,25],[60,21,60,25],[62,31,62,35],[62,21,62,25],[61,31,61,35],[61,21,61,25],[59,21,59,25],[63,31,63,35],[60,31,60,35],[51,24,51,27],[55,31,55,35],[55,21,55,25],[52,28,52,35],[62,16,62,20],[58,16,58,20],[57,5,57,15],[62,5,62,15],[59,5,59,15],[60,16,60,20],[34,4,39,7],[41,8,41,11],[48,4,48,6],[48,10,48,35],[45,24,45,27],[40,16,40,19],[41,16,41,19],[36,8,36,11],[43,12,43,15],[37,12,37,15],[38,8,38,11],[39,8,39,11],[42,12,42,15],[41,20,41,23],[39,20,39,23],[41,24,41,27],[40,20,40,23],[42,16,42,19],[34,32,34,35],[40,32,40,35],[40,28,40,31],[35,28,35,31],[37,28,37,31],[35,20,35,23],[48,37,49,37],[45,20,45,23],[45,28,45,31],[46,32,46,35],[47,32,47,35],[46,28,46,31],[49,24,49,27],[47,28,47,31],[44,36,44,37],[44,24,44,27],[44,28,44,31],[45,36,46,36],[49,28,49,35],[47,24,47,27],[45,37,46,37],[44,32,44,35],[44,20,44,23],[45,32,45,35],[47,20,47,23],[49,20,49,23],[46,20,46,23],[46,24,46,27],[54,36,56,36],[14,28,14,31],[19,32,19,35],[54,26,54,30],[52,24,52,27],[53,0,53,35],[54,31,54,35],[24,5,24,19],[25,5,25,19],[26,5,26,19],[28,5,28,19],[27,5,27,19],[27,24,27,27],[47,16,47,19],[49,16,49,19],[50,28,50,35],[48,7,48,9],[43,32,43,35],[43,28,43,31],[43,24,43,27],[50,24,50,27],[45,16,45,19],[46,16,46,19],[44,16,44,19],[0,36,0,38],[23,28,23,31],[36,32,36,35],[35,32,35,35],[26,24,26,27],[21,32,21,35],[26,28,26,31],[29,28,29,31],[2,0,2,35],[26,32,26,35],[1,0,1,3],[1,4,1,8],[1,9,1,14],[32,12,33,15],[16,32,16,35],[18,28,18,31],[17,28,17,31],[16,28,16,31],[12,20,12,23],[3,0,31,4],[31,5,31,19],[29,5,29,19],[30,5,30,19],[30,20,30,23]]}
["2018 - NURSING HOME - PROVISIONAL",null,null,null,null,null,null,null,null,null,null,null,null,null,null,null,null,null,null,null,null,null,null,null,null,null,null,null,null,null,null,null,null,null,null,null,"'OK' = Likely no Error\n'Error\" = Maybe Error\nin data provided"]
["State ID:",null,null,null,{"$f":"NHA_StateID","v":0},null,null,null,null,"Facility Name:",null,null,null,null,null,{"$f":"NHA_Name","v":"-"},null,null,null,null,null,null,null,null,null,null,null,null,null,null,null,null,null,2018]
["Tennessee Joint Annual Report of Nursing Homes -Schedule G - Personnel"]
["Type of\nEmployee\nby Service",null,null,null,null,"Please indicate the number of personnel as of September 30. Do not include a type of employee for \nwhich you do not provide that type of service. For example, do not include Physical Therapists \nunless you provide Physical Therapy services. If you have additional types of employees that are \nnot listed in the following table, please include them in either the 'Other Health' or 'Other Non-Health' \ncategories as applicable. For example, you may list Non-Certified Nurse Aides in the 'Other Health' \ncategory. Leave the item blank if the value is unknown or not applicable. Full-Time - employees \nwhose regularly scheduled work week is 40 hours or more. Full Time Equivalent (FTE) = Number \nof Hours worked by part-time employees per week /40 hours per week. For example, three \nRegistered nurses, each working 20 hours a week, the FTE would be (3 x 20) / 40 = 1.5."]
[null,null,null,null,null,"Do not enter zero.  Blank fields will represent zero employees."]
[null,null,null,null,null," ",null,null,null,null,null,null,null,null,null,null,null,null,null,null,"Employee",null,null,null,null,null,null,null,"Employee Pool/\nConsultant/Contract"]
[null,null,null,null,null,null,null,null,null,null,null,null,null,null,null,null,null,null,null,null,"Full-Time",null,null,null,"Part-Time\nIn FTE",null,null,null,"Full-Time",null,null,null,"Part-Time\nIn FTE"]
[null,null,null,null,null," Administrator"]
[null,null,null,null,null," Assistant Administrator"]
[null,null,null,null,null," Physicians (M.D. or D.O.)"]
[null,null,null,null,null," Registered Nurses"]
[null,null,null,null,null," Licensed Practical Nurses"]
[null,null,null,null,null," Certified Nurses Aides"]
[null,null,null,null,null," Licensed Pharmacists"]
[null,null,null,null,null," Dietary Managers"]
[null,null,null,null,null," Registered Dieticians"]
[null,null,null,null,null," Dietetic Technicians"]
[null,null,null,null,null," Medical Social Workers"]
[null,null,null,null,null," Social Workers"]
[null,null,null,null,null," Registered Respiratory Therapists"]
[null,null,null,null,null," Licensed Physical Therapists"]
[null,null,null,null,null," Physical Therapists Assistants and Aides"]
[null,null,null,null,null," Registered Occupational Therapists"]
[null,null,null,null,null," Other Occupational Therapists Assistants"]
[null,null,null,null,null," Recreational Therapists"]
[null,null,null,null,null," Activity Coordinators"]
[null,null,null,null,null," Medical Records Technicians"]
[null,null,null,null,null," Maintenance"]
[null,null,null,null,null," Housekeeping"]
[null,null,null,null,null," Other Health"]
[null,null,null,null,null," Other Non-Health"]
[null,null,null,null,null,"                       Total ",null,null,null,null,null,null,null,null,null,null,null,null,null,null,{"$f":"SUM(NHG_AdmEFT:NHG_NHealEFT)","v":0},null,null,null,{"$f":"SUM(Y8:AB31)","v":0},null,null,null,{"$f":"SUM(AC8:AF31)","v":0},null,null,null,{"$f":"SUM(AG8:AJ31)","v":0}]
["Nurses",null,null,null,"Nurse\nType",null,null,null,"Highest\nEducation\nLevel",null,null,null,"Number\nCurrently\nEmployed",null,null,null,"Number of\nBudgeted\nVacancies",null,null,null,"Average\n# Weeks\nRequired\nto Recruit\nStaff",null,null,null,"Number\nAdded in\nthe Past\n12 Months",null,null,null,"Number Eliminated in\nthe Past 12 Months"]
[null,null,null,null,null,null,null,null,null,null,null,null,null,null,null,null,null,null,null,null,null,null,null,null,null,null,null,null,"Clinical",null,null,null,"Admin."]
[null,null,null,null,"Registered",null,null,null," Associate"]
[null,null,null,null,null,null,null,null," Diploma"]
[null,null,null,null,null,null,null,null," Bachelors"]
[null,null,null,null,null,null,null,null," Masters"]
[null,null,null,null,null,null,null,null," Doctorate"]
[null,null,null,null,null,null,null,null,"Total ",null,null,null,{"$f":"SUM(M35:P39)","v":0},null,null,null,{"$f":"SUM(Q35:T39)","v":0},null,null,null,null,null,null,null,{"$f":"SUM(Y35:AB39)","v":0},null,null,null,{"$f":"SUM(AC35:AF39)","v":0},null,null,null,{"$f":"SUM(AG35:AJ39)","v":0}]
[null,null,null,null,"Advanced\nPractice",null,null,null," Nurse\n Practitioner"]
[null,null,null,null,null,null,null,null," Clinical\n Nurse"]
[null,null,null,null,null,null,null,null," Certified\n Registered\n Nurse\n Anesthetist",null,null,null,null,null,null,null,null,null,null,null,null,null,null,null,null,null,null,null,null,null,null,null,null,null,null,null,null,null,null,{"$f":"IF(NHG_OthN1Specify=\"\",0,1)","v":0},{"$f":"IF(NHG_OthN2Specify=\"\",0,1)","v":0}]
[null,null,null,null,null,null,null,null,"Total ",null,null,null,{"$f":"SUM(M41:P43)","v":0},null,null,null,{"$f":"SUM(Q41:T43)","v":0},null,null,null,null,null,null,null,{"$f":"SUM(Y41:AB43)","v":0},null,null,null,{"$f":"SUM(AC41:AF43)","v":0},null,null,null,{"$f":"SUM(AG41:AJ43)","v":0},null,null,null,null,null,null,{"$f":"IF(NHG_OthN1Emp=\"\",0,1)","v":0},{"$f":"IF(NHG_OthN2Emp=\"\",0,1)","v":0}]
[null,null,null,null,"Licensed Practical \nNurses",null,null,null,null,null,null,null,null,null,null,null,null,null,null,null,null,null,null,null,null,null,null,null,null,null,null,null,null,null,null,null,"Other Nurses\n(Specify)",null,null,{"$f":"IF(NHG_OthN1Bud=\"\",0,1)","v":0},{"$f":"IF(NHG_OthN2Bud=\"\",0,1)","v":0}]
[null,null,null,null,"Certified Nurse Aides",null,null,null,null,null,null,null,null,null,null,null,null,null,null,null,null,null,null,null,null,null,null,null,null,null,null,null,null,null,null,null,"Other\nNurse\nLine 1","Other\nNurse\nLine 2",null,{"$f":"SUM(AN44:AN45)","v":0},{"$f":"SUM(AO44:AO45)","v":0}]
["Other Nurses\n(specify)",null,null,null,null,null,null,null,null,null,null,null,null,null,null,null,null,null,null,null,null,null,null,null,null,null,null,null,null,null,null,null,null,null,null,null,null,null,null,{"$f":"IF(AN46>=1,1,0)","v":0},{"$f":"IF(AO46>=1,1,0)","v":0}]
[null,null,null,null,null,null,null,null,null,null,null,null,null,null,null,null,null,null,null,null,null,null,null,null,null,null,null,null,null,null,null,null,null,null,null,null,{"$f":"IF(AN49=TRUE,\"Ok\", \"Error\")","v":"Ok"},{"$f":"IF(AO49=TRUE,\"Ok\", \"Error\")","v":"Ok"},null,{"$f":"(AN43+AN47)","v":0},{"$f":"(AO43+AO47)","v":0}]
["Contract\nNursing\nPersonnel",null,null,null,"Yes/No",null,null,"-",null,null,"Does your organization use contract nursing personnel?  If yes, indicate the number \nof contract personnel in the following categories.",null,null,null,null,null,null,null,null,null,null,null,null,null,null,null,null,null,null,null,null,null,null,null,null,null,"Yes/No\nquestion","Contract\nNursing =\nYes;\nprovide data",null,{"$f":"OR(AN48=0,AN48=2)","v":true},{"$f":"OR(AO48=0,AO48=2)","v":true}]
[null,null,null,null,"Type",null,null,null,null,null,null,null,"Number\nCurrently\nContracted",null,null,null,"Number of\nBudgeted\nVacancies",null,null,null,"Average\n# Weeks\nRequired\nto Recruit\nStaff",null,null,null,"Number\nAdded in\nthe Past\n12 Months",null,null,null,"Number Eliminated in\nthe Past 12 Months",null,null,null,null,null,null,null,{"$f":"IF(AN53=TRUE,\"Ok\",\"Error\")","v":"Error"},null,null,{"$f":"IF(NHG_ConRNEmp>=1,1,0)","v":0},{"$f":"IF(NHG_ConRNBud>=1,1,0)","v":0},{"$f":"IF(NHG_ConRNRec=\"\",0,1)","v":0},{"$f":"IF(NHG_ConRNAdd=\"\",0,1)","v":0},{"$f":"IF(NHG_ConRNElim=\"\",0,1)","v":0}]
[null,null,null,null,"Registered Nurses",null,null,null,null,null,null,null,null,null,null,null,null,null,null,null,null,null,null,null,null,null,null,null,null,null,null,null,null,null,null,null,null,{"$f":"IF(AO54=TRUE,\"Ok\", \"Error\")","v":"Ok"},null,{"$f":"IF(NHG_ConLPNEmp>=1,1,0)","v":0},{"$f":"IF(NHG_ConLPNBud>=1,1,0)","v":0},{"$f":"IF(NHG_ConLPNRec=\"\",0,1)","v":0},{"$f":"IF(NHG_ConLPNAdd=\"\",0,1)","v":0},{"$f":"IF(NHG_ConLPNElim=\"\",0,1)","v":0}]
[null,null,null,null,"Licensed Practical\nNurses",null,null,null,null,null,null,null,null,null,null,null,null,null,null,null,null,null,null,null,null,null,null,null,null,null,null,null,null,null,null,null,null,null,null,{"$f":"IF(NHG_ConCNAEmp>=1,1,0)","v":0},{"$f":"IF(NHG_ConCNABud>=1,1,0)","v":0},{"$f":"IF(NHG_ConCNARec=\"\",0,1)","v":0},{"$f":"IF(NHG_ConCNAAdd=\"\",0,1)","v":0},{"$f":"IF(NHG_ConCNAElim=\"\",0,1)","v":0}]
[null,null,null,null,"Certified Nurse Aides",null,null,null,null,null,null,null,null,null,null,null,null,null,null,null,null,null,null,null,null,null,null,null,null,null,null,null,null,null,null,null,null,null,null,{"$f":"OR(NHG_ConNYN=\"Yes\",NHG_ConNYN=\"No\")","v":false},{"$f":"SUM(AN50:AR52)","v":0},{"$f":"IF(NHG_ConNYN=\"Yes\",1,0)","v":0},{"$f":"IF(AO53>=1,1,0)","v":0},{"$f":"SUM(AP53:AQ53)","v":0}]
["Please indicate the number of nursing personnel on duty, on the premises and routinely serving the patients on \nSeptember 30 for each shift. DO NOT include personnel who are on call.  Use the section for the three-shift \npattern or for the two shift pattern depending on your facility, or both if your facility uses a mix of 8 and 12 hour \nshifts.",null,null,null,null,null,null,null,null,null,null,null,null,null,null,null,null,null,null,null,null,null,null,null,null,null,null,null,null,null,null,null,null,null,null,null,null,null,null,null,{"$f":"OR(AR53=0,AR53=2)","v":true}]
["Nursing\nThree Shifts\nper Day\nPatterns",null,null,null,null,"Three Shifts",null,null,null,null,null,null,null,null,null,null,"Shift # 1\n(day)",null,null,null,null,"Shift # 2\n(evening)",null,null,null,null,"Shift # 3\n(night)",null,null,null,null,"Total",null,null,null,null,"Nursing\nShifts;\nprovide data"]
[null,null,null,null,null," Registered Nurses",null,null,null,null,null,null,null,null,null,null,null,null,null,null,null,null,null,null,null,null,null,null,null,null,null,{"$f":"SUM(Q56:AE56)","v":0},null,null,null,null,null,null,null,null,{"$f":"IF(NHG_3SRNDay>0,1,0)","v":0},{"$f":"IF(NHG_3SRNEve>0,1,0)","v":0},{"$f":"IF(NHG_3SRNNig>0,1,0)","v":0}]
[null,null,null,null,null," Licensed Practical Nurses",null,null,null,null,null,null,null,null,null,null,null,null,null,null,null,null,null,null,null,null,null,null,null,null,null,{"$f":"SUM(Q57:AE57)","v":0},null,null,null,null,null,null,null,null,{"$f":"IF(NHG_3SLPNDay>0,1,0)","v":0},{"$f":"IF(NHG_3SLPNEve>0,1,0)","v":0},{"$f":"IF(NHG_3SLPNNig>0,1,0)","v":0}]
[null,null,null,null,null," Aides",null,null,null,null,null,null,null,null,null,null,null,null,null,null,null,null,null,null,null,null,null,null,null,null,null,{"$f":"SUM(Q58:AE58)","v":0},null,null,null,null,{"$f":"IF(AN61>=1,\"Ok\",\"Error\")","v":"Error"},null,null,null,{"$f":"IF(NHG_3SAidDay>0,1,0)","v":0},{"$f":"IF(NHG_3SAidEve>0,1,0)","v":0},{"$f":"IF(NHG_3SAidNig>0,1,0)","v":0}]
[null,null,null,null,null,"        Total ",null,null,null,null,null,null,null,null,null,null,{"$f":"SUM(Q56:U58)","v":0},null,null,null,null,{"$f":"SUM(V56:Z58)","v":0},null,null,null,null,{"$f":"SUM(AA56:AE58)","v":0},null,null,null,null,{"$f":"SUM(Q59:AE59)","v":0},null,null,null,null,null,null,null,null,{"$f":"SUM(AO56:AQ58)","v":0},{"$f":"IF(AO59>=1,1,0)","v":0}]
["Nursing\nTwo Shifts\nper Day\nPatterns",null,null,null,null,"Two Shifts",null,null,null,null,null,null,null,null,null,null,"Shift # 1\n(day)",null,null,null,null,"Shift # 2\n(evening)",null,null,null,null,"",null,null,null,null,"\nTotal"]
[null,null,null,null,null," Registered Nurses",null,null,null,null,null,null,null,null,null,null,null,null,null,null,null,null,null,null,null,null,null,null,null,null,null,{"$f":"SUM(Q61:Z61)","v":0},null,null,null,null,null,null,null,{"$f":"(AP59+AP64)","v":0},{"$f":"IF(NHG_2SRNDay>0,1,0)","v":0},{"$f":"IF(NHG_2SRNEve>0,1,0)","v":0}]
[null,null,null,null,null," Licensed Practical Nurses",null,null,null,null,null,null,null,null,null,null,null,null,null,null,null,null,null,null,null,null,null,null,null,null,null,{"$f":"SUM(Q62:Z62)","v":0},null,null,null,null,null,null,null,null,{"$f":"IF(NHG_2SLPNDay>0,1,0)","v":0},{"$f":"IF(NHG_2SLPNEve>0,1,0)","v":0}]
[null,null,null,null,null," Aides",null,null,null,null,null,null,null,null,null,null,null,null,null,null,null,null,null,null,null,null,null,null,null,null,null,{"$f":"SUM(NHG_2SAidDay:NHG_2SAidEve)","v":0},null,null,null,null,null,null,null,null,{"$f":"IF(NHG_2SAidDay>0,1,0)","v":0},{"$f":"IF(NHG_2SAidEve>0,1,0)","v":0}]
[null,null,null,null,null,"     Total ",null,null,null,null,null,null,null,null,null,null,{"$f":"SUM(NHG_2SRNDay:NHG_2SAidDay)","v":0},null,null,null,null,{"$f":"SUM(NHG_2SRNEve:NHG_2SAidEve)","v":0},null,null,null,null,null,null,null,null,null,{"$f":"SUM(NHG_2SRNTot:NHG_2SAidTot)","v":0},null,null,null,null,null,null,null,null,{"$f":"SUM(AO61:AP63)","v":0},{"$f":"IF(AO64>=1,1,0)","v":0}]
["Go to Next Schedule"]
["Return to Main Menu"]
["Go to Error Listing"]

{"sheet":"G-Data","index":23,"n_rows":6,"n_cols":231,"rows_kept":6,"cut":false,"hidden":true,"merged":[]}
["Facility ID Info",null,null,"Type of Employee by Service",null,null,null,null,null,null,null,null,null,null,null,null,null,null,null,null,null,null,null,null,null,null,null,null,null,null,null,null,null,null,null,null,null,null,null,null,null,null,null,null,null,null,null,null,null,null,null,null,null,null,null,null,null,null,null,null,null,null,null,null,null,null,null,null,null,null,null,null,null,null,null,null,null,null,null,null,null,null,null,null,null,null,null,null,null,null,null,null,null,null,null,null,null,null,null,null,null,null,null,"Nurses",null,null,null,null,null,null,null,null,null,null,null,null,null,null,null,null,null,null,null,null,null,null,null,null,null,null,null,null,null,null,null,null,null,null,null,null,null,null,null,null,null,null,null,null,null,null,null,null,null,null,null,null,null,null,null,null,null,null,null,null,null,null,null,null,null,null,null,null,null,null,null,null,null,null,null,null,null,null,null,null,null,null,null,"Contract Nursing Personnel",null,null,null,null,null,null,null,null,null,null,null,null,null,null,null,"Nursing Three Shifts per Day patterns",null,null,null,null,null,null,null,null,null,null,null,null,null,null,null,"Nursing Two Shifts per Day Patterns"]
[null,null,null,"Administrator",null,null,null,"Assistant Administrator",null,null,null,"Physicians (M.D. or D.O.)",null,null,null,"Registered Nurses",null,null,null,"Licensed Practical Nurses",null,null,null,"Certified Nurses Aides",null,null,null,"Licensed Pharmacists",null,null,null,"Dietary managers",null,null,null,"Registered Dieticians",null,null,null,"Dietetic Technicians",null,null,null,"Medical Social Workers",null,null,null,"Social Workers",null,null,null,"Registered Respiratory Therapists",null,null,null,"Licensed Physical Therapists",null,null,null,"Physical therapists Assistants and Aides",null,null,null,"Registered Occupational therapists",null,null,null,"Other Occupational Therapists Assistants",null,null,null,"Recreational Therapists",null,null,null,"Activity Coordinators",null,null,null,"Medical Records Technicians",null,null,null,"Maintenance",null,null,null,"Housekeeping",null,null,null,"Other Health",null,null,null,"Other Non-Health",null,null,null,"Total (System Calculation)",null,null,null,"Registered Associate",null,null,null,null,null,"Registered Diploma",null,null,null,null,null,"Registered Bachelors",null,null,null,null,null,"Registered Masters",null,null,null,null,null,"Registered Doctorate",null,null,null,null,null,"Registered Total (System Calculations)",null,null,null,null,"Advance Practice Nurse Practitioner",null,null,null,null,null,"Advance Practice Clinical Nurse",null,null,null,null,null,"Advance Practice Certified Registered Nurse Anesthetist",null,null,null,null,null,"Advanced Practice Total (System Calculations)",null,null,null,null,"Licensed Practical Nurses",null,null,null,null,null,"Certified Nurse Aides",null,null,null,null,null,"Other Nurses 1 (specify)",null,null,null,null,null,null,"Other Nurses 2 (specify)",null,null,null,null,null,null,"Yes/No","Registered Nurses",null,null,null,null,"Licensed Practical Nurses",null,null,null,null,"Certified Nurse Aides",null,null,null,null,"Registered Nurses",null,null,null,"Licensed Practical Nurses",null,null,null,"Aides",null,null,null,"Total (System Calculation)",null,null,null,"Registered Nurses",null,null,"Licensed  Practical Nurses",null,null,"Aides",null,null,"Total (System Calculations)"]
["State ID","NH Name","County","Employee\nFull-Time","Employee\nPart-Time\nin FTE","Consultant\nFull-Time","Consultant\nPart-Time\nin FTE","Employee\nFull-Time","Employee\nPart-Time\nin FTE","Consultant\nFull-Time","Consultant\nPart-Time\nin FTE","Employee\nFull-Time","Employee\nPart-Time\nin FTE","Consultant\nFull-Time","Consultant\nPart-Time\nin FTE","Employee\nFull-Time","Employee\nPart-Time\nin FTE","Consultant\nFull-Time","Consultant\nPart-Time\nin FTE","Employee\nFull-Time","Employee\nPart-Time\nin FTE","Consultant\nFull-Time","Consultant\nPart-Time\nin FTE","Employee\nFull-Time","Employee\nPart-Time\nin FTE","Consultant\nFull-Time","Consultant\nPart-Time\nin FTE","Employee\nFull-Time","Employee\nPart-Time\nin FTE","Consultant\nFull-Time","Consultant\nPart-Time\nin FTE","Employee\nFull-Time","Employee\nPart-Time\nin FTE","Consultant\nFull-Time","Consultant\nPart-Time\nin FTE","Employee\nFull-Time","Employee\nPart-Time\nin FTE","Consultant\nFull-Time","Consultant\nPart-Time\nin FTE","Employee\nFull-Time","Employee\nPart-Time\nin FTE","Consultant\nFull-Time","Consultant\nPart-Time\nin FTE","Employee\nFull-Time","Employee\nPart-Time\nin FTE","Consultant\nFull-Time","Consultant\nPart-Time\nin FTE","Employee\nFull-Time","Employee\nPart-Time\nin FTE","Consultant\nFull-Time","Consultant\nPart-Time\nin FTE","Employee\nFull-Time","Employee\nPart-Time\nin FTE","Consultant\nFull-Time","Consultant\nPart-Time\nin FTE","Employee\nFull-Time","Employee\nPart-Time\nin FTE","Consultant\nFull-Time","Consultant\nPart-Time\nin FTE","Employee\nFull-Time","Employee\nPart-Time\nin FTE","Consultant\nFull-Time","Consultant\nPart-Time\nin FTE","Employee\nFull-Time","Employee\nPart-Time\nin FTE","Consultant\nFull-Time","Consultant\nPart-Time\nin FTE","Employee\nFull-Time","Employee\nPart-Time\nin FTE","Consultant\nFull-Time","Consultant\nPart-Time\nin FTE","Employee\nFull-Time","Employee\nPart-Time\nin FTE","Consultant\nFull-Time","Consultant\nPart-Time\nin FTE","Employee\nFull-Time","Employee\nPart-Time\nin FTE","Consultant\nFull-Time","Consultant\nPart-Time\nin FTE","Employee\nFull-Time","Employee\nPart-Time\nin FTE","Consultant\nFull-Time","Consultant\nPart-Time\nin FTE","Employee\nFull-Time","Employee\nPart-Time\nin FTE","Consultant\nFull-Time","Consultant\nPart-Time\nin FTE","Employee\nFull-Time","Employee\nPart-Time\nin FTE","Consultant\nFull-Time","Consultant\nPart-Time\nin FTE","Employee\nFull-Time","Employee\nPart-Time\nin FTE","Consultant\nFull-Time","Consultant\nPart-Time\nin FTE","Employee\nFull-Time","Employee\nPart-Time\nin FTE","Consultant\nFull-Time","Consultant\nPart-Time\nin FTE","Employee\nFull-Time","Employee\nPart-Time\nin FTE","Consultant\nFull-Time","Consultant\nPart-Time\nin FTE","Number\nCurrently\nEmployed","Number of\nBudgeted\nVacancies","Avg Weeks\nto Recruit\nStaff","Num Added\nin Past\n12 Months","Clinical\nElim in Past\n12 Months","Admin\nElim in Past\n12 Months","Number\nCurrently\nEmployed","Number of\nBudgeted\nVacancies","Avg Weeks\nto Recruit\nStaff","Num Added\nin Past\n12 Months","Clinical\nElim in Past\n12 Months","Admin\nElim in Past\n12 Months","Number\nCurrently\nEmployed","Number of\nBudgeted\nVacancies","Avg Weeks\nto Recruit\nStaff","Num Added\nin Past\n12 Months","Clinical\nElim in Past\n12 Months","Admin\nElim in Past\n12 Months","Number\nCurrently\nEmployed","Number of\nBudgeted\nVacancies","Avg Weeks\nto Recruit\nStaff","Num Added\nin Past\n12 Months","Clinical\nElim in Past\n12 Months","Admin\nElim in Past\n12 Months","Number\nCurrently\nEmployed","Number of\nBudgeted\nVacancies","Avg Weeks\nto Recruit\nStaff","Num Added\nin Past\n12 Months","Clinical\nElim in Past\n12 Months","Admin\nElim in Past\n12 Months","Number\nCurrently\nEmployed","Number of\nBudgeted\nVacancies","Num Added\nin Past\n12 Months","Clinical\nElim in Past\n12 Months","Admin\nElim in Past\n12 Months","Number\nCurrently\nEmployed","Number of\nBudgeted\nVacancies","Avg Weeks\nto Recruit\nStaff","Num Added\nin Past\n12 Months","Clinical\nElim in Past\n12 Months","Admin\nElim in Past\n12 Months","Number\nCurrently\nEmployed","Number of\nBudgeted\nVacancies","Avg Weeks\nto Recruit\nStaff","Num Added\nin Past\n12 Months","Clinical\nElim in Past\n12 Months","Admin\nElim in Past\n12 Months","Number\nCurrently\nEmployed","Number of\nBudgeted\nVacancies","Avg Weeks\nto Recruit\nStaff","Num Added\nin Past\n12 Months","Clinical\nElim in Past\n12 Months","Admin\nElim in Past\n12 Months","Number\nCurrently\nEmployed","Number of\nBudgeted\nVacancies","Num Added\nin Past\n12 Months","Clinical\nElim in Past\n12 Months","Admin\nElim in Past\n12 Months","Number\nCurrently\nEmployed","Number of\nBudgeted\nVacancies","Avg Weeks\nto Recruit\nStaff","Num Added\nin Past\n12 Months","Clinical\nElim in Past\n12 Months","Admin\nElim in Past\n12 Months","Number\nCurrently\nEmployed","Number of\nBudgeted\nVacancies","Avg Weeks\nto Recruit\nStaff","Num Added\nin Past\n12 Months","Clinical\nElim in Past\n12 Months","Admin\nElim in Past\n12 Months","Other\nNurses \nspecify 1","Number\nCurrently\nEmployed","Number of\nBudgeted\nVacancies","Avg Weeks\nto Recruit\nStaff","Num Added\nin Past\n12 Months","Clinical\nElim in Past\n12 Months","Admin\nElim in Past\n12 Months","Other\nNurses\nspecify 2","Number\nCurrently\nEmployed","Number of\nBudgeted\nVacancies","Avg Weeks\nto Recruit\nStaff","Num Added\nin Past\n12 Months","Clinical\nElim in Past\n12 Months","Admin\nElim in Past\n12 Months","Use\nContract\nNursing","Number\nCurrently\nEmployed","Number of\nBudgeted\nVacancies","Avg Weeks\nto Recruit\nStaff","Num Added\nin Past\n12 Months","Number\nElim in Past\n12 Months","Number\nCurrently\nEmployed","Number of\nBudgeted\nVacancies","Avg Weeks\nto Recruit\nStaff","Num Added\nin Past\n12 Months","Number\nElim in Past\n12 Months","Number\nCurrently\nEmployed","Number of\nBudgeted\nVacancies","Avg Weeks\nto Recruit\nStaff","Num Added\nin Past\n12 Months","Number\nElim in Past\n12 Months","Shift # 1\nDay","Shift # 2\nEvening","Shift # 3\nNight","Total\n(System\nCalculation)","Shift # 1\nDay","Shift # 2\nEvening","Shift # 3\nNight","Total\n(System\nCalculation)","Shift # 1\nDay","Shift # 2\nEvening","Shift # 3\nNight","Total\n(System\nCalculation)","Shift # 1\nDay","Shift # 2\nEvening","Shift # 3\nNight","Total\n(System\nCalculation)","Shift # 1\nDay","Shift # 2\nEvening","Total\n(System\nCalculation)","Shift # 1\nDay","Shift # 2\nEvening","Total\n(System\nCalculation)","Shift # 1\nDay","Shift # 2\nEvening","Total\n(System\nCalculation)","Shift # 1\nDay","Shift # 2\nEvening","Total\n(System\nCalculation)"]
[{"$f":"NHA_StateID","v":0},{"$f":"NHA_Name","v":"-"},{"$f":"NHA_County","v":"-"},{"$f":"IF(NHG_AdmEFT>0,NHG_AdmEFT,\"\")","v":""},{"$f":"IF(NHG_AdmEPT>0,NHG_AdmEPT,\"\")","v":""},{"$f":"IF(NHG_AdmCFT>0,NHG_AdmCFT,\"\")","v":""},{"$f":"IF(NHG_AdmCPT>0,NHG_AdmCPT,\"\")","v":""},{"$f":"IF(NHG_AAdmEFT>0,NHG_AAdmEFT,\"\")","v":""},{"$f":"IF(NHG_AAdmEPT>0,NHG_AAdmEPT,\"\")","v":""},{"$f":"IF(NHG_AAdmCFT>0,NHG_AAdmCFT,\"\")","v":""},{"$f":"IF(NHG_AAdmCPT>0,NHG_AAdmCPT,\"\")","v":""},{"$f":"IF(NHG_PhyEFT>0,NHG_PhyEFT,\"\")","v":""},{"$f":"IF(NHG_PhyEPT>0,NHG_PhyEPT,\"\")","v":""},{"$f":"IF(NHG_PhyCFT>0,NHG_PhyCFT,\"\")","v":""},{"$f":"IF(NHG_PhyCPT>0,NHG_PhyCPT,\"\")","v":""},{"$f":"IF(NHG_RNEFT>0,NHG_RNEFT,\"\")","v":""},{"$f":"IF(NHG_RNEPT>0,NHG_RNEPT,\"\")","v":""},{"$f":"IF(NHG_RNCFT>0,NHG_RNCFT,\"\")","v":""},{"$f":"IF(NHG_RNCPT>0,NHG_RNCPT,\"\")","v":""},{"$f":"IF(NHG_LPNEFT>0,NHG_LPNEFT,\"\")","v":""},{"$f":"IF(NHG_LPNEPT>0,NHG_LPNEPT,\"\")","v":""},{"$f":"IF(NHG_LPNCFT>0,NHG_LPNCFT,\"\")","v":""},{"$f":"IF(NHG_LPNCPT>0,NHG_LPNCPT,\"\")","v":""},{"$f":"IF(NHG_CNAEFT>0,NHG_CNAEFT,\"\")","v":""},{"$f":"IF(NHG_CNAEPT>0,NHG_CNAEPT,\"\")","v":""},{"$f":"IF(NHG_CNACFT>0,NHG_CNACFT,\"\")","v":""},{"$f":"IF(NHG_CNACPT>0,NHG_CNACPT,\"\")","v":""},{"$f":"IF(NHG_PhrmEFT>0,NHG_PhrmEFT,\"\")","v":""},{"$f":"IF(NHG_PhrmEPT>0,NHG_PhrmEPT,\"\")","v":""},{"$f":"IF(NHG_PhrmCFT>0,NHG_PhrmCFT,\"\")","v":""},{"$f":"IF(NHG_PhrmCPT>0,NHG_PhrmCPT,\"\")","v":""},{"$f":"IF(NHG_DieMEFT>0,NHG_DieMEFT,\"\")","v":""},{"$f":"IF(NHG_DieMEPT>0,NHG_DieMEPT,\"\")","v":""},{"$f":"IF(NHG_DieMCFT>0,NHG_DieMCFT,\"\")","v":""},{"$f":"IF(NHG_DieMCPT>0,NHG_DieMCPT,\"\")","v":""},{"$f":"IF(NHG_RDieEFT>0,NHG_RDieEFT,\"\")","v":""},{"$f":"IF(NHG_RDieEPT>0,NHG_RDieEPT,\"\")","v":""},{"$f":"IF(NHG_RDIECFT>0,NHG_RDIECFT,\"\")","v":""},{"$f":"IF(NHG_RDieCPT>0,NHG_RDieCPT,\"\")","v":""},{"$f":"IF(NHG_DieTEFT>0,NHG_DieTEFT,\"\")","v":""},{"$f":"IF(NHG_DieTEPT>0,NHG_DieTEPT,\"\")","v":""},{"$f":"IF(NHG_DieCFT>0,NHG_DieCFT,\"\")","v":""},{"$f":"IF(NHG_DieTCPT>0,NHG_DieTCPT,\"\")","v":""},{"$f":"IF(NHG_MSWEFT>0,NHG_MSWEFT,\"\")","v":""},{"$f":"IF(NHG_MSWEPT>0,NHG_MSWEPT,\"\")","v":""},{"$f":"IF(NHG_MSWCFT>0,NHG_MSWCFT,\"\")","v":""},{"$f":"IF(NHG_MSWCPT>0,NHG_MSWCPT,\"\")","v":""},{"$f":"IF(NHG_SWEFT>0,NHG_SWEFT,\"\")","v":""},{"$f":"IF(NHG_SWEPT>0,NHG_SWEPT,\"\")","v":""},{"$f":"IF(NHG_SWCFT>0,NHG_SWCFT,\"\")","v":""},{"$f":"IF(NHG_SWCPT>0,NHG_SWCPT,\"\")","v":""},{"$f":"IF(NHG_RRTEFT>0,NHG_RRTEFT,\"\")","v":""},{"$f":"IF(NHG_RRTEPT>0,NHG_RRTEPT,\"\")","v":""},{"$f":"IF(NHG_RRTCFT>0,NHG_RRTCFT,\"\")","v":""},{"$f":"IF(NHG_RRTCPT>0,NHG_RRTCPT,\"\")","v":""},{"$f":"IF(NHG_LPTEFT>0,NHG_LPTEFT,\"\")","v":""},{"$f":"IF(NHG_LPTEPT>0,NHG_LPTEPT,\"\")","v":""},{"$f":"IF(NHG_LPTCFT>0,NHG_LPTCFT,\"\")","v":""},{"$f":"IF(NHG_LPTCPT>0,NHG_LPTCPT,\"\")","v":""},{"$f":"IF(NHG_PTAEFT>0,NHG_PTAEFT,\"\")","v":""},{"$f":"IF(NHG_PTaEPT>0,NHG_PTaEPT,\"\")","v":""},{"$f":"IF(NHG_PTACFT>0,NHG_PTACFT,\"\")","v":""},{"$f":"IF(NHG_PTACPT>0,NHG_PTACPT,\"\")","v":""},{"$f":"IF(NHG_ROTEFT>0,NHG_ROTEFT,\"\")","v":""},{"$f":"IF(NHG_ROTEPT>0,NHG_ROTEPT,\"\")","v":""},{"$f":"IF(NHG_ROTCFT>0,NHG_ROTCFT,\"\")","v":""},{"$f":"IF(NHG_ROTCPT>0,NHG_ROTCPT,\"\")","v":""},{"$f":"IF(NHG_ROTAEFT>0,NHG_ROTAEFT,\"\")","v":""},{"$f":"IF(NHG_ROTAEPT>0,NHG_ROTAEPT,\"\")","v":""},{"$f":"IF(NHG_ROTACFT>0,NHG_ROTACFT,\"\")","v":""},{"$f":"IF(NHG_ROTACPT>0,NHG_ROTACPT,\"\")","v":""},{"$f":"IF(NHG_RTEFT>0,NHG_RTEFT,\"\")","v":""},{"$f":"IF(NHG_RTEPT>0,NHG_RTEPT,\"\")","v":""},{"$f":"IF(NHG_RTCFT>0,NHG_RTCFT,\"\")","v":""},{"$f":"IF(NHG_RTCPT>0,NHG_RTCPT,\"\")","v":""},{"$f":"IF(NHG_ACEFT>0,NHG_ACEFT,\"\")","v":""},{"$f":"IF(NHG_ACEPT>0,NHG_ACEPT,\"\")","v":""},{"$f":"IF(NHG_ACCFT>0,NHG_ACCFT,\"\")","v":""},{"$f":"IF(NHG_ACCPT>0,NHG_ACCPT,\"\")","v":""},{"$f":"IF(NHG_MRecTEFT>0,NHG_MRecTEFT,\"\")","v":""},{"$f":"IF(NHG_MRecTEPT>0,NHG_MRecTEPT,\"\")","v":""},{"$f":"IF(NHG_MRecTCFT>0,NHG_MRecTCFT,\"\")","v":""},{"$f":"IF(NHG_MRecTCPT>0,NHG_MRecTCPT,\"\")","v":""},{"$f":"IF(NHG_MaintEFT>0,NHG_MaintEFT,\"\")","v":""},{"$f":"IF(NHG_MaintEPT>0,NHG_MaintEPT,\"\")","v":""},{"$f":"IF(NHG_MaintCFT>0,NHG_MaintCFT,\"\")","v":""},{"$f":"IF(NHG_MaintCPT>0,NHG_MaintCPT,\"\")","v":""},{"$f":"IF(NHG_HousEFT>0,NHG_HousEFT,\"\")","v":""},{"$f":"IF(NHG_HousEPT>0,NHG_HousEPT,\"\")","v":""},{"$f":"IF(NHG_HousCFT>0,NHG_HousCFT,\"\")","v":""},{"$f":"IF(NHG_HousCPT>0,NHG_HousCPT,\"\")","v":""},{"$f":"IF(NHG_HealEFT>0,NHG_HealEFT,\"\")","v":""},{"$f":"IF(NHG_HealEPT>0,NHG_HealEPT,\"\")","v":""},{"$f":"IF(NHG_HealCFT>0,NHG_HealCFT,\"\")","v":""},{"$f":"IF(NHG_HealCPT>0,NHG_HealCPT,\"\")","v":""},{"$f":"IF(NHG_NHealEFT>0,NHG_NHealEFT,\"\")","v":""},{"$f":"IF(NHG_NHealEPT>0,NHG_NHealEPT,\"\")","v":""},{"$f":"IF(NHG_NHealCFT>0,NHG_NHealCFT,\"\")","v":""},{"$f":"IF(NHG_NHealCPT>0,NHG_NHealCPT,\"\")","v":""},{"$f":"NHG_TotEFT","v":0},{"$f":"NHG_TotEPT","v":0},{"$f":"NHG_TotCFT","v":0},{"$f":"NHG_TotCPT","v":0},{"$f":"IF(NHG_RNASEmp>0,NHG_RNASEmp,\"\")","v":""},{"$f":"IF(NHG_RNASBud>0,NHG_RNASBud,\"\")","v":""},{"$f":"IF(NHG_RNASRec>0,NHG_RNASRec,\"\")","v":""},{"$f":"IF(NHG_RNASRAdd>0,NHG_RNASRAdd,\"\")","v":""},{"$f":"IF(NHG_RNASClin>0,NHG_RNASClin,\"\")","v":""},{"$f":"IF(NHG_RNASAdm>0,NHG_RNASAdm,\"\")","v":""},{"$f":"IF(NHG_RNDipEmp>0,NHG_RNDipEmp,\"\")","v":""},{"$f":"IF(NHG_RNDipBud>0,NHG_RNDipBud,\"\")","v":""},{"$f":"IF(NHG_RNDipRec>0,NHG_RNDipRec,\"\")","v":""},{"$f":"IF(NHG_RNDipAdd>0,NHG_RNDipAdd,\"\")","v":""},{"$f":"IF(NHG_RNDipClin>0,NHG_RNDipClin,\"\")","v":""},{"$f":"IF(NHG_RNDipAdm>0,NHG_RNDipAdm,\"\")","v":""},{"$f":"IF(NHG_RNBAEmp>0,NHG_RNBAEmp,\"\")","v":""},{"$f":"IF(NHG_RNBABud>0,NHG_RNBABud,\"\")","v":""},{"$f":"IF(NHG_RNBARec>0,NHG_RNBARec,\"\")","v":""},{"$f":"IF(NHG_RNBAAdd>0,NHG_RNBAAdd,\"\")","v":""},{"$f":"IF(NHG_RNBAClin>0,NHG_RNBAClin,\"\")","v":""},{"$f":"IF(NHG_RNBAAdm>0,NHG_RNBAAdm,\"\")","v":""},{"$f":"IF(NHG_RNMAEmp>0,NHG_RNMAEmp,\"\")","v":""},{"$f":"IF(NHG_RNMABud>0,NHG_RNMABud,\"\")","v":""},{"$f":"IF(NHG_RNMARec>0,NHG_RNMARec,\"\")","v":""},{"$f":"IF(NHG_RNMAAdd>0,NHG_RNMAAdd,\"\")","v":""},{"$f":"IF(NHG_RNMAClin>0,NHG_RNMAClin,\"\")","v":""},{"$f":"IF(NHG_RNMAAdm>0,NHG_RNMAAdm,\"\")","v":""},{"$f":"IF(NHG_RNDREmp>0,NHG_RNDREmp,\"\")","v":""},{"$f":"IF(NHG_RNDRBud>0,NHG_RNDRBud,\"\")","v":""},{"$f":"IF(NHG_RNDRRec>0,NHG_RNDRRec,\"\")","v":""},{"$f":"IF(NHG_RNDRAdd>0,NHG_RNDRAdd,\"\")","v":""},{"$f":"IF(NHG_RNDRClin>0,NHG_RNDRClin,\"\")","v":""},{"$f":"IF(NHG_RNDRAdm>0,NHG_RNDRAdm,\"\")","v":""},{"$f":"NHG_RNTotEmp","v":0},{"$f":"NHG_RNTotBud","v":0},{"$f":"NHG_RNTotAdd","v":0},{"$f":"NHG_RNTotClin","v":0},{"$f":"NHG_RNTotAdm","v":0},{"$f":"IF(NHG_APNPEmp>0,NHG_APNPEmp,\"\")","v":""},{"$f":"IF(NHG_APNPBud>0,NHG_APNPBud,\"\")","v":""},{"$f":"IF(NHG_APNPRec>0,NHG_APNPRec,\"\")","v":""},{"$f":"IF(NHG_APNPAdd>0,NHG_APNPAdd,\"\")","v":""},{"$f":"IF(NHG_APNPClin>0,NHG_APNPClin,\"\")","v":""},{"$f":"IF(NHG_APNPAdm>0,NHG_APNPAdm,\"\")","v":""},{"$f":"IF(NHG_APCNEmp>0,NHG_APCNEmp,\"\")","v":""},{"$f":"IF(NHG_APCNBud>0,NHG_APCNBud,\"\")","v":""},{"$f":"IF(NHG_APCNRec>0,NHG_APCNRec,\"\")","v":""},{"$f":"IF(NHG_APCNAdd>0,NHG_APCNAdd,\"\")","v":""},{"$f":"IF(NHG_APCNClin>0,NHG_APCNClin,\"\")","v":""},{"$f":"IF(NHG_APCNAdm>0,NHG_APCNAdm,\"\")","v":""},{"$f":"IF(NHG_APNAEmp>0,NHG_APNAEmp,\"\")","v":""},{"$f":"IF(NHG_APNABud>0,NHG_APNABud,\"\")","v":""},{"$f":"IF(NHG_APNARec>0,NHG_APNARec,\"\")","v":""},{"$f":"IF(NHG_APNAAdd>0,NHG_APNAAdd,\"\")","v":""},{"$f":"IF(NHG_APNAClin>0,NHG_APNAClin,\"\")","v":""},{"$f":"IF(NHG_APNAAdm>0,NHG_APNAAdm,\"\")","v":""},{"$f":"NHG_APTotEmp","v":0},{"$f":"NHG_APTotBud","v":0},{"$f":"NHG_APTotAdd","v":0},{"$f":"NHG_APTotClin","v":0},{"$f":"NHG_APTotAdm","v":0},{"$f":"IF(NHG_LPNEmp>0,NHG_LPNEmp,\"\")","v":""},{"$f":"IF(NHG_LPNBud>0,NHG_LPNBud,\"\")","v":""},{"$f":"IF(NHG_LPNRec>0,NHG_LPNRec,\"\")","v":""},{"$f":"IF(NHG_LPNAdd>0,NHG_LPNAdd,\"\")","v":""},{"$f":"IF(NHG_LPNClin>0,NHG_LPNClin,\"\")","v":""},{"$f":"IF(NHG_LPNAdm>0,NHG_LPNAdm,\"\")","v":""},{"$f":"IF(NHG_CNAEmp>0,NHG_CNAEmp,\"\")","v":""},{"$f":"IF(NHG_CNABud>0,NHG_CNABud,\"\")","v":""},{"$f":"IF(NHG_CNARec>0,NHG_CNARec,\"\")","v":""},{"$f":"IF(NHG_CNAAdd>0,NHG_CNAAdd,\"\")","v":""},{"$f":"IF(NHG_CNAClin>0,NHG_CNAClin,\"\")","v":""},{"$f":"IF(NHG_CNAAdm>0,NHG_CNAAdm,\"\")","v":""},{"$f":"NHG_OthN1Specify","v":0},{"$f":"IF(NHG_OthN1Emp>0,NHG_OthN1Emp,\"\")","v":""},{"$f":"IF(NHG_OthN1Bud>0,NHG_OthN1Bud,\"\")","v":""},{"$f":"IF(NHG_OthN1Rec>0,NHG_OthN1Rec,\"\")","v":""},{"$f":"IF(NHG_OthN1Add>0,NHG_OthN1Add,\"\")","v":""},{"$f":"IF(NHG_OthN1Clin>0,NHG_OthN1Clin,\"\")","v":""},{"$f":"IF(NHG_OthN1Adm>0,NHG_OthN1Adm,\"\")","v":""},{"$f":"NHG_OthN2Specify","v":0},{"$f":"IF(NHG_OthN2Emp>0,NHG_OthN2Emp,\"\")","v":""},{"$f":"IF(NHG_OthN2Bud>0,NHG_OthN2Bud,\"\")","v":""},{"$f":"IF(NHG_OthN2Rec>0,NHG_OthN2Rec,\"\")","v":""},{"$f":"IF(NHG_OthN2Add>0,NHG_OthN2Add,\"\")","v":""},{"$f":"IF(NHG_OthN2Clin>0,NHG_OthN2Clin,\"\")","v":""},{"$f":"IF(NHG_OthN2Adm>0,NHG_OthN2Adm,\"\")","v":""},{"$f":"NHG_ConNYN","v":"-"},{"$f":"IF(NHG_ConRNEmp>0,NHG_ConRNEmp,\"\")","v":""},{"$f":"IF(NHG_ConRNBud>0,NHG_ConRNBud,\"\")","v":""},{"$f":"IF(NHG_ConRNRec>0,NHG_ConRNRec,\"\")","v":""},{"$f":"IF(NHG_ConRNAdd>0,NHG_ConRNAdd,\"\")","v":""},{"$f":"IF(NHG_ConRNElim>0,NHG_ConRNElim,\"\")","v":""},{"$f":"IF(NHG_ConLPNEmp>0,NHG_ConLPNEmp,\"\")","v":""},{"$f":"IF(NHG_ConLPNBud>0,NHG_ConLPNBud,\"\")","v":""},{"$f":"IF(NHG_ConLPNRec>0,NHG_ConLPNRec,\"\")","v":""},{"$f":"IF(NHG_ConLPNAdd>0,NHG_ConLPNAdd,\"\")","v":""},{"$f":"IF(NHG_ConLPNElim>0,NHG_ConLPNElim,\"\")","v":""},{"$f":"IF(NHG_ConCNAEmp>0,NHG_ConCNAEmp,\"\")","v":""},{"$f":"IF(NHG_ConCNABud>0,NHG_ConCNABud,\"\")","v":""},{"$f":"IF(NHG_ConCNARec>0,NHG_ConCNARec,\"\")","v":""},{"$f":"IF(NHG_ConCNAAdd>0,NHG_ConCNAAdd,\"\")","v":""},{"$f":"IF(NHG_ConCNAElim>0,NHG_ConCNAElim,\"\")","v":""},{"$f":"IF(NHG_3SRNDay>0,NHG_3SRNDay,\"\")","v":""},{"$f":"IF(NHG_3SRNEve>0,NHG_3SRNEve,\"\")","v":""},{"$f":"IF(NHG_3SRNNig>0,NHG_3SRNNig,\"\")","v":""},{"$f":"NHG_3SRNTot","v":0},{"$f":"IF(NHG_3SLPNDay>0,NHG_3SLPNDay,\"\")","v":""},{"$f":"IF(NHG_3SLPNEve>0,NHG_3SLPNEve,\"\")","v":""},{"$f":"IF(NHG_3SLPNNig>0,NHG_3SLPNNig,\"\")","v":""},{"$f":"NHG_3SLPNTot","v":0},{"$f":"IF(NHG_3SAidDay>0,NHG_3SAidDay,\"\")","v":""},{"$f":"IF(NHG_3SAidEve>0, NHG_3SAidEve,\"\")","v":""},{"$f":"IF(NHG_3SAidNig>0,NHG_3SAidNig,\"\")","v":""},{"$f":"NHG_3SAidTot","v":0},{"$f":"NHG_3STotDay","v":0},{"$f":"NHG_3STotEve","v":0},{"$f":"NHG_3STotNig","v":0},{"$f":"NHG_3STotTot","v":0},{"$f":"IF(NHG_2SRNDay>0,NHG_2SRNDay,\"\")","v":""},{"$f":"IF(NHG_2SRNEve>0,NHG_2SRNEve,\"\")","v":""},{"$f":"NHG_2SRNTot","v":0},{"$f":"IF(NHG_2SLPNDay>0, NHG_2SLPNDay,\"\")","v":""},{"$f":"IF(NHG_2SLPNEve>0,NHG_2SLPNEve,\"\")","v":""},{"$f":"NHG_2SLPNTot","v":0},{"$f":"IF(NHG_2SAidDay>0,NHG_2SAidDay,\"\")","v":""},{"$f":"IF(NHG_2SAidEve>0, NHG_2SAidEve,\"\")","v":""},{"$f":"NHG_2SAidTot","v":0},{"$f":"NHG_2STotDay","v":0},{"$f":"NHG_2STotEve","v":0},{"$f":"NHG_2STotTot","v":0}]
[]
[null,null,null,null,null,null,null,null,null,null,null,null,null,null,null,null,null,null,null,null,null,null,null,null,null,null,null,null,null,null,null,null,null,null,null,null,null,null,null,null,null,null,null,null,null,null,null,null,null,null,null,null,null,null,null,null,null,null,null,null,null,null,null,null,null,null,null,null,null,null,null,null,null,null,null,null,null,null,null,null,null,null,null,null,null,null,null,null,null,null,null,null,null,null,null,null,null,null,null,null," "]

{"sheet":"Sch H","index":24,"n_rows":60,"n_cols":48,"rows_kept":60,"cut":false,"hidden":false,"merged":[[4,0,6,4],[7,5,7,35],[4,8,4,10],[12,31,12,35],[4,5,4,7],[10,17,10,20],[13,28,13,30],[14,28,14,30],[13,21,13,23],[11,17,11,20],[6,31,6,35],[5,14,5,30],[9,21,9,23],[11,10,11,16],[9,17,9,20],[12,17,12,20],[10,10,10,16],[12,10,12,16],[9,28,9,30],[10,24,10,27],[12,24,12,27],[10,21,10,23],[11,31,11,35],[11,21,11,23],[10,31,10,35],[11,24,11,27],[17,24,17,27],[13,31,13,35],[13,24,13,27],[14,31,14,35],[14,21,14,23],[15,21,15,23],[14,24,14,27],[15,28,15,30],[13,10,13,16],[14,10,14,16],[16,10,16,16],[16,28,16,30],[15,24,15,27],[17,28,17,30],[18,28,18,30],[19,28,19,30],[16,31,16,35],[17,31,17,35],[19,31,19,35],[18,21,18,23],[19,24,19,27],[14,17,14,20],[15,17,15,20],[13,17,13,20],[15,31,15,35],[18,31,18,35],[17,17,17,20],[18,24,18,27],[16,24,16,27],[23,0,23,4],[9,0,22,4],[9,5,9,16],[10,5,16,9],[17,5,18,9],[18,10,18,16],[22,24,22,27],[34,31,34,35],[26,31,26,35],[29,5,29,30],[26,5,26,30],[22,17,22,20],[23,17,23,20],[22,21,22,23],[24,5,24,30],[24,0,24,4],[21,17,21,20],[21,28,21,30],[22,28,22,30],[20,28,20,30],[31,5,31,30],[25,0,25,4],[30,0,35,4],[26,0,29,4],[41,36,42,36],[36,36,37,36],[36,37,37,37],[31,37,34,37],[31,31,31,35],[30,31,30,35],[35,31,35,35],[32,31,32,35],[21,31,21,35],[22,31,22,35],[24,31,24,35],[25,31,25,35],[23,31,23,35],[24,37,25,37],[20,10,20,16],[23,21,23,23],[36,5,36,35],[33,5,33,30],[29,31,29,35],[33,31,33,35],[19,5,22,9],[23,24,23,27],[23,28,23,30],[35,5,35,30],[19,21,19,23],[46,0,56,4],[21,24,21,27],[20,21,20,23],[21,21,21,23],[20,24,20,27],[22,10,22,16],[28,5,28,30],[45,21,45,25],[43,11,44,15],[43,16,44,20],[39,11,40,15],[43,26,44,30],[51,30,51,35],[45,16,45,20],[56,8,56,10],[52,11,52,13],[48,5,50,7],[48,11,48,13],[39,16,40,20],[45,31,45,35],[21,10,21,16],[23,5,23,16],[48,30,48,35],[27,31,27,35],[39,26,40,30],[51,14,51,29],[19,10,19,16],[46,5,46,35],[44,5,44,10],[45,5,45,10],[41,11,42,15],[48,8,48,10],[28,31,28,35],[50,8,50,10],[49,8,49,10],[30,5,30,30],[25,5,25,30],[27,5,27,30],[34,5,34,30],[32,5,32,30],[39,5,39,10],[41,5,41,10],[37,26,38,30],[38,16,38,20],[42,5,42,7],[45,11,45,15],[38,21,38,25],[49,30,49,35],[56,30,56,35],[56,11,56,13],[43,21,44,25],[55,14,55,29],[48,14,48,29],[54,14,54,29],[53,11,53,13],[43,31,44,35],[47,5,47,29],[52,30,52,35],[55,30,55,35],[43,8,43,10],[43,5,43,7],[40,5,40,7],[40,8,40,10],[37,5,38,10],[37,11,38,15],[39,31,40,35],[41,31,42,35],[41,26,42,30],[51,5,56,7],[54,11,54,13],[50,11,50,13],[53,30,53,35],[54,30,54,35],[55,11,55,13],[51,11,51,13],[54,8,54,10],[55,8,55,10],[51,8,51,10],[50,30,50,35],[56,14,56,29],[41,16,42,20],[39,21,40,25],[41,21,42,25],[49,11,49,13],[49,14,49,29],[0,36,0,38],[20,17,20,20],[19,17,19,20],[16,17,16,20],[16,21,16,23],[17,21,17,23],[18,17,18,20],[20,31,20,35],[5,31,5,35],[0,0,0,35],[1,0,1,3],[1,4,1,8],[1,9,1,14],[2,0,2,35],[1,33,1,35],[7,0,8,4],[4,11,4,35],[5,5,6,13],[1,15,1,32],[3,0,3,35],[2,37,7,37],[10,28,10,30],[1,36,2,36],[11,28,11,30],[57,36,59,37],[4,36,6,36],[12,28,12,30],[9,31,9,35],[6,14,6,30],[17,10,17,16],[15,10,15,16],[9,24,9,27],[8,5,8,35],[12,21,12,23],[59,0,59,35],[57,0,57,35],[36,0,45,4],[58,0,58,35],[37,31,38,35],[37,16,37,25],[53,14,53,29],[50,14,50,29],[53,8,53,10],[52,14,52,29],[52,8,52,10],[45,26,45,30],[42,8,42,10],[47,30,47,35]]}
["2018 - NURSING HOMES - PROVISIONAL",null,null,null,null,null,null,null,null,null,null,null,null,null,null,null,null,null,null,null,null,null,null,null,null,null,null,null,null,null,null,null,null,null,null,null,"'OK' = Likely no Error\n'Error\" = Maybe Error\nin data provided"]
["State ID:",null,null,null,{"$f":"NHA_StateID","v":0},null,null,null,null,"Facility Name:",null,null,null,null,null,{"$f":"NHA_Name","v":"-"},null,null,null,null,null,null,null,null,null,null,null,null,null,null,null,null,null,2018,null,null,"Yes/No\nquestion"]
["Tennessee Joint Annual Report of Nursing Homes -Schedule H - Financial Data",null,null,null,null,null,null,null,null,null,null,null,null,null,null,null,null,null,null,null,null,null,null,null,null,null,null,null,null,null,null,null,null,null,null,null,null,"Cross\nCheck\n\nReporting\nPeriod\nDifferent \nfor\n\nStatistical\nData\n(Sch A)\n\nand\n\nFinancial\n(Sch H)\n"]
["Round to the nearest dollar. Use the same reporting period as used for the other sections of the Joint Annual Report. \nIf you are reporting for less than a full year, financial data should be presented for days reported only.",null,null,null,null,null,null,null,null,null,null,null,null,null,null,null,null,null,null,null,null,null,null,null,null,null,null,null,null,null,null,null,null,null,null,null,{"$f":"IF(AN5=TRUE,\"Ok\",\"Error\")","v":"Error"}]
["Reporting\nPeriod",null,null,null,null,"Yes/No",null,null,"-",null,null,"Is the financial data reporting period different from the Joint Annual Report\nstatistical data reporting period entered on Schedule A?",null,null,null,null,null,null,null,null,null,null,null,null,null,null,null,null,null,null,null,null,null,null,null,null,"Financial\nBegin\nDate\nLess than\nEnd Date",null,null,{"$f":"OR(NHH_FinDataYN=\"Yes\",NHH_FinDataYN=\"No\")","v":false}]
[null,null,null,null,null," If yes, the different reporting\n period is (Enter dates even\n if less than 12 months.)",null,null,null,null,null,null,null,null," Beginning date of Financial reporting period.",null,null,null,null,null,null,null,null,null,null,null,null,null,null,null,null,{"$f":"IF(NHH_FinDataYN=\"No\",\"01/01/2018\",\"\")","v":""},null,null,null,null,null,null,null,null,null,{"$f":"IF(NHA_RptBegDate=NHH_FinDateBeg,1,0)","v":1},{"$f":"IF(NHH_FinDataYN=\"Yes\",2,0)","v":0},{"$f":"IF(NHH_FinDateBeg=\"\",0,1)","v":0}]
[null,null,null,null,null,null,null,null,null,null,null,null,null,null," Ending date of Financial reporting period.",null,null,null,null,null,null,null,null,null,null,null,null,null,null,null,null,{"$f":"IF(NHH_FinDataYN=\"No\",\"12/31/2018\",\"\")","v":""},null,null,null,null,null,null,null,null,null,{"$f":"IF(NHA_RptEndDate=NHH_FinDateEnd,1,0)","v":1},null,{"$f":"IF(NHH_FinDateEnd=\"\",0,1)","v":0}]
["Revenues",null,null,null,null,"Generally Accepted Accounting Principles require that accounting records be on the accrual basis. \nUnder the accrual basis, revenues are recognized when realizable and earned. The assumption is\nthat Adjustments to Revenue have a normal debit balance. The receipt of cash is not required for \nthe recognition of revenues. Revenues and adjustments should be included for the reporting period \nonly. Gross Patient Revenue is the full established rate charged to patients for services rendered \nduring the accounting period. Adjustments to Revenue are classified as 1) contractual adjustments \nwhen the nursing home agrees through a contractual arrangement to accept less than 100% of the \namount charged for patient services, 2) Bad Debt (see definition to follow), and 3) as Charity Care \n(see definition to follow). Do not include losses in adjustments. Revenues and adjustments that are \nnot appropriately reported in any of the specific categories should be reported in the “other” \ncategory.",null,null,null,null,null,null,null,null,null,null,null,null,null,null,null,null,null,null,null,null,null,null,null,null,null,null,null,null,null,null,{"$f":"IF(NHH_FinDateBeg<NHH_FinDateEnd,\"Ok\",\"Error\")","v":"Error"},null,null,null,null,{"$f":"(AP6+AP7)","v":2},null,{"$f":"SUM(AR6:AR7)","v":0}]
[null,null,null,null,null,"Adjustments to revenue that decrease revenue should be entered as a positive number.",null,null,null,null,null,null,null,null,null,null,null,null,null,null,null,null,null,null,null,null,null,null,null,null,null,null,null,null,null,null,null,{"$f":"IF(AR8=2,\"Ok\", \"Error\")","v":"Error"}]
["Patient\nRevenue",null,null,null,null,"Source",null,null,null,null,null,null,null,null,null,null,null,"Gross\nPatient\nCharges",null,null,null,"minus",null,null,"Adjustments\nto Revenue",null,null,null,"equals",null,null,"Net Patient\nRevenue",null,null,null,null,"Gross\nPatient\nCharges:\nprovide data","Adjust-\nments to\nRevenue:\nprovide\ndata","Adjust-\nments\nmust be\n< charges"]
[null,null,null,null,null,"Government",null,null,null,null," Medicare Advantage",null,null,null,null,null,null,null,null,null,null,"-",null,null,null,null,null,null,"=",null,null,{"$f":"(NHH_GMCGPC-NHH_GMCRev)","v":0},null,null,null,null,{"$f":"IF(NHH_GMCGPC=\"#\",\"Error\", \"Ok\")","v":"Ok"},{"$f":"IF(NHH_GMCRev=\"#\",\"Error\",\"Ok\")","v":"Ok"},{"$f":"IF(AND(NHH_GMCGPC=0,NHH_GMCRev=0),\"Ok\",IF(NHH_GMCRev<NHH_GMCGPC,\"Ok\",\"Error\"))","v":"Ok"},null,null,null,null,null,{"$f":"IF(NHH_GMCGPC=\"#\",\"Error\",\"Ok\")","v":"Ok"}]
[null,null,null,null,null,null,null,null,null,null," All Other Medicare",null,null,null,null,null,null,null,null,null,null,"-",null,null,null,null,null,null,"=",null,null,{"$f":"(NHH_GOMCGPC-NHH_GOMCRev)","v":0},null,null,null,null,{"$f":"IF(NHH_GOMCGPC=\"#\",\"Error\",\"Ok\")","v":"Ok"},{"$f":"IF(NHH_GOMCRev=\"#\",\"Error\",\"Ok\")","v":"Ok"},{"$f":"IF(AND(NHH_GOMCGPC=0,NHH_GOMCRev=0),\"Ok\",IF(NHH_GOMCRev<NHH_GOMCGPC,\"Ok\",\"Error\"))","v":"Ok"}]
[null,null,null,null,null,null,null,null,null,null," TennCare MCO",null,null,null,null,null,null,null,null,null,null,"-",null,null,null,null,null,null,"=",null,null,{"$f":"(NHH_GMTCGPC-NHH_GMTCRev)","v":0},null,null,null,null,{"$f":"IF(NHH_GMTCGPC=\"#\",\"Error\",\"Ok\")","v":"Ok"},{"$f":"IF(NHH_GMTCRev=\"#\",\"Error\",\"Ok\")","v":"Ok"},{"$f":"IF(AND(NHH_GMTCGPC=0,NHH_GMTCRev=0),\"Ok\",IF(NHH_GMTCRev<NHH_GMTCGPC,\"Ok\",\"Error\"))","v":"Ok"}]
[null,null,null,null,null,null,null,null,null,null," All other Medicaid/\n TennCare",null,null,null,null,null,null,null,null,null,null,"-",null,null,null,null,null,null,"=",null,null,{"$f":"(NHH_GMMTCGPC-NHH_GMMTCRev)","v":0},null,null,null,null,{"$f":"IF(NHH_GMMTCGPC=\"#\",\"Error\",\"Ok\")","v":"Ok"},{"$f":"IF(NHH_GMMTCRev=\"#\",\"Error\",\"Ok\")","v":"Ok"},{"$f":"IF(AND(NHH_GMMTCGPC=0,NHH_GMMTCRev=0),\"Ok\",IF(NHH_GMMTCRev<NHH_GMMTCGPC,\"Ok\",\"Error\"))","v":"Ok"}]
[null,null,null,null,null,null,null,null,null,null," VA Contract",null,null,null,null,null,null,null,null,null,null,"-",null,null,null,null,null,null,"=",null,null,{"$f":"(NHH_GVAGPC-NHH_GVARev)","v":0},null,null,null,null,{"$f":"IF(NHH_GVAGPC=\"#\",\"Error\",\"Ok\")","v":"Ok"},{"$f":"IF(NHH_GVARev=\"#\",\"Error\",\"Ok\")","v":"Ok"},{"$f":"IF(AND(NHH_GVAGPC=0,NHH_GVARev=0),\"Ok\",IF(NHH_GVARev<NHH_GVAGPC,\"Ok\",\"Error\"))","v":"Ok"}]
[null,null,null,null,null,null,null,null,null,null," Other Government",null,null,null,null,null,null,null,null,null,null,null,null,null,null,null,null,null,"=",null,null,{"$f":"(NHH_GOGGPC-NHH_GOGRev)","v":0},null,null,null,null,{"$f":"IF(NHH_GOGGPC=\"#\",\"Error\",\"Ok\")","v":"Ok"},{"$f":"IF(NHH_GOGRev=\"#\",\"Error\",\"Ok\")","v":"Ok"},{"$f":"IF(AND(NHH_GOGGPC=0,NHH_GOGRev=0),\"Ok\",IF(NHH_GOGRev<NHH_GOGGPC,\"Ok\",\"Error\"))","v":"Ok"}]
[null,null,null,null,null,null,null,null,null,null,"Total Government ",null,null,null,null,null,null,{"$f":"NHH_GMCGPC+NHH_GOMCGPC+NHH_GMTCGPC+NHH_GMMTCGPC+NHH_GVAGPC+NHH_GOGGPC","v":0},null,null,null,"-",null,null,{"$f":"NHH_GMCRev+NHH_GOMCRev+NHH_GMTCRev+NHH_GMMTCRev+NHH_GVARev+NHH_GOGRev","v":0},null,null,null,"=",null,null,{"$f":"SUM(AF11:AJ16)","v":0}]
[null,null,null,null,null,"Cover\nTennessee",null,null,null,null," Access Tennessee",null,null,null,null,null,null,0,null,null,null,"-",null,null,0,null,null,null,"=",null,null,{"$f":"(NHH_CTATGPC-NHH_CTATRev)","v":0},null,null,null,null,{"$f":"IF(NHH_CTATGPC=\"#\",\"Error\",\"Ok\")","v":"Ok"},{"$f":"IF(NHH_CTATRev=\"#\",\"Error\",\"Ok\")","v":"Ok"},{"$f":"IF(AND(NHH_CTATGPC=0,NHH_CTATRev=0),\"Ok\",IF(NHH_CTATRev<NHH_CTATGPC,\"Ok\",\"Error\"))","v":"Ok"}]
[null,null,null,null,null,null,null,null,null,null,"Total \nCover Tennessee",null,null,null,null,null,null,{"$f":"NHH_CTATGPC+0","v":0},null,null,null,"-",null,null,{"$f":"NHH_CTATRev+0","v":0},null,null,null,"=",null,null,{"$f":"NHH_CTATNet","v":0}]
[null,null,null,null,null,"Non-\ngovernment",null,null,null,null," Private (Self-Pay)",null,null,null,null,null,null,null,null,null,null,null,null,null,null,null,null,null,"=",null,null,{"$f":"(NHH_NGSPGPC-NHH_NGSPRev)","v":0},null,null,null,null,{"$f":"IF(NHH_NGSPGPC=\"#\",\"Error\",\"Ok\")","v":"Ok"},{"$f":"IF(NHH_NGSPRev=\"#\",\"Error\",\"Ok\")","v":"Ok"},{"$f":"IF(IF(NHH_NGSPGPC=0,NHH_NGSPRev=0),\"Ok\",IF(NHH_NGSPRev<NHH_NGSPGPC,\"Ok\",\"Error\"))","v":"Ok"}]
[null,null,null,null,null,null,null,null,null,null," Long Term Care\n Insurance",null,null,null,null,null,null,null,null,null,null,null,null,null,null,null,null,null,"=",null,null,{"$f":"(NHH_NGInsGPC-NHH_NGinsRev)","v":0},null,null,null,null,{"$f":"IF(NHH_NGInsGPC=\"#\",\"Error\",\"Ok\")","v":"Ok"},{"$f":"IF(NHH_NGinsRev=\"#\",\"Error\",\"Ok\")","v":"Ok"},{"$f":"IF(AND(NHH_NGInsGPC=0,NHH_NGinsRev=0),\"Ok\",IF(NHH_NGinsRev<NHH_NGInsGPC,\"Ok\",\"Error\"))","v":"Ok"}]
[null,null,null,null,null,null,null,null,null,null," Other\n Non-government",null,null,null,null,null,null,null,null,null,null,null,null,null,null,null,null,null,"=",null,null,{"$f":"(NHH_NGOthGPC-NHH_NGOthRev)","v":0},null,null,null,null,{"$f":"IF(NHH_NGOthGPC=\"#\",\"Error\",\"Ok\")","v":"Ok"},{"$f":"IF(NHH_NGOthRev=\"#\",\"Error\",\"Ok\")","v":"Ok"},{"$f":"IF(AND(NHH_NGOthGPC=0,NHH_NGOthRev=0),\"Ok\",IF(NHH_NGOthRev<NHH_NGOthGPC,\"Ok\",\"Error\"))","v":"Ok"}]
[null,null,null,null,null,null,null,null,null,null,"Total\n Non-government ",null,null,null,null,null,null,{"$f":"NHH_NGSPGPC+NHH_NGInsGPC+NHH_NGOthGPC","v":0},null,null,null,"-",null,null,{"$f":"NHH_NGSPRev+NHH_NGinsRev+NHH_NGOthRev","v":0},null,null,null,"=",null,null,{"$f":"(NHH_NGTotGPC-NHH_NGTotRev)","v":0},null,null,null,null,""]
["Patient\nRevenue\n(Continued)",null,null,null,null,"                                        Total Patient Revenue\n                      Total Government\n                      + Cover Tennessee           \n                      + Total Non-government",null,null,null,null,null,null,null,null,null,null,null,{"$f":"(NHH_GTotGPC+NHH_CTTotGPC +NHH_NGTotGPC)","v":0},null,null,null,"-",null,null,{"$f":"(NHH_GTotRev+NHH_CTTotRev+NHH_NGTotRev)","v":0},null,null,null,"=",null,null,{"$f":"(NHH_TPRGPC-NHH_TPRRev)","v":0},null,null,null,null,"Non-\nPatient\nRevenue:\nprovide data"]
["Non-Patient\nRevenue",null,null,null,null," All Other Revenue",null,null,null,null,null,null,null,null,null,null,null,null,null,null,null,null,null,null,null,null,null,null,null,null,null,0,null,null,null,null,{"$f":"IF(NHH_OtherRev=\"#\",\"Error\",\"Ok\")","v":"Ok"},"Non-\nGov't\nAdjustments:\nprovide data"]
["Total\nRevenue",null,null,null,null,"Grand Total Revenue\nTotal Patient Revenue + Non Patient Revenue",null,null,null,null,null,null,null,null,null,null,null,null,null,null,null,null,null,null,null,null,null,null,null,null,null,{"$f":"SUM(AF24:AJ25)","v":0}]
["Adjustment\nto Charges",null,null,null,null,"Bad Debts - (See Appendix B: Definitions)",null,null,null,null,null,null,null,null,null,null,null,null,null,null,null,null,null,null,null,null,null,null,null,null,null,null,null,null,null,null,null,{"$f":"IF(NHH_BadDebt=\"#\",\"Error\",\"Ok\")","v":"Ok"}]
[null,null,null,null,null,"Charity Care – (See Appendix B: Definitions)",null,null,null,null,null,null,null,null,null,null,null,null,null,null,null,null,null,null,null,null,null,null,null,null,null,null,null,null,null,null,null,{"$f":"IF(NHH_Charity=\"#\",\"Error\",\"Ok\")","v":"Ok"}]
[null,null,null,null,null,"Other – Any other adjustments that are not appropriately reported in either Bad \nDebt or Charity",null,null,null,null,null,null,null,null,null,null,null,null,null,null,null,null,null,null,null,null,null,null,null,null,null,0,null,null,null,null,null,{"$f":"IF(NHH_OthAdj=\"#\",\"Error\",\"Ok\")","v":"Ok"}]
[null,null,null,null,null,"                                                    Total Adjustments ",null,null,null,null,null,null,null,null,null,null,null,null,null,null,null,null,null,null,null,null,null,null,null,null,null,{"$f":"NHH_BadDebt+NHH_Charity+NHH_OthAdj","v":0}]
["Expenses\n(exclude\ndepreciation)",null,null,null,null,"Expenses are recognized when assets are used in the production of revenue.\nThe disbursement of cash is not required for the recognition of expenses.",null,null,null,null,null,null,null,null,null,null,null,null,null,null,null,null,null,null,null,null,null,null,null,null,null,"Amount",null,null,null,null,"Expenses:\nprovide data"]
[null,null,null,null,null,"Payroll (for full-time and part-time personnel included in Schedule G)",null,null,null,null,null,null,null,null,null,null,null,null,null,null,null,null,null,null,null,null,null,null,null,null,null,null,null,null,null,null,{"$f":"IF(NHH_Payroll=\"#\",\"Error\",\"Ok\")","v":"Ok"},"Capital\nAssets\nCost:\nprovide data"]
[null,null,null,null,null,"Benefits (social security, group insurance, retirement benefits, etc.)",null,null,null,null,null,null,null,null,null,null,null,null,null,null,null,null,null,null,null,null,null,null,null,null,null,null,null,null,null,null,{"$f":"IF(NHH_Benefit=\"#\",\"Error\",\"Ok\")","v":"Ok"}]
[null,null,null,null,null,"Other Operating (contract staff, professional fees, energy expense, etc.)",null,null,null,null,null,null,null,null,null,null,null,null,null,null,null,null,null,null,null,null,null,null,null,null,null,null,null,null,null,null,{"$f":"IF(NHH_OthOpExp=\"#\",\"Error\",\"Ok\")","v":"Ok"}]
[null,null,null,null,null,"Non-Operating (interest, taxes, real estate lease expenses, etc.)",null,null,null,null,null,null,null,null,null,null,null,null,null,null,null,null,null,null,null,null,null,null,null,null,null,null,null,null,null,null,{"$f":"IF(NHH_NonOpExp=\"#\",\"Error\",\"Ok\")","v":"Ok"}]
[null,null,null,null,null,"                                                             Total Expenses ",null,null,null,null,null,null,null,null,null,null,null,null,null,null,null,null,null,null,null,null,null,null,null,null,null,{"$f":"NHH_Payroll+NHH_Benefit+NHH_OthOpExp+NHH_NonOpExp","v":0},null,null,null,null,null,{"$f":"IF(NHH_CABECost>0,\"Ok\",\"Error\")","v":"Error"}]
["Capital\nAssets",null,null,null,null,"Report capital assets recorded on the balance sheet at the end of the reporting period.  Capital \nassets are property, buildings and equipment. Indicate if you lease or own your facility and \nequipment.  Record the estimated fair market and net book value."]
[null,null,null,null,null,"Category",null,null,null,null,null,"Cost",null,null,null,null,"Depreciation",null,null,null,null,null,null,null,null,null,"Net Book \nValue\n(cost minus\naccumulated)",null,null,null,null,"Fair Market\nValue"]
[null,null,null,null,null,null,null,null,null,null,null,null,null,null,null,null,"Annual",null,null,null,null,"Accumulated",null,null,null,null,null,null,null,null,null,null,null,null,null,null,"Building\ndata\nprovided","Equipment\ndata\nprovided","Own or\nLease"]
[null,null,null,null,null," Building",null,null,null,null,null,null,null,null,null,null,null,null,null,null,null,null,null,null,null,null,{"$f":"(NHH_CABCost-NHH_CABDepAc)","v":0},null,null,null,null,null,null,null,null,null,{"$f":"IF(AND(NHH_CABOL<>\"-\",NHH_CABNetB>1),\"Ok\",\"Error\")","v":"Error"},{"$f":"IF(AND(NHH_CABEOL<>\"-\",NHH_CABENetB>1),\"OK\",\"ERROR\")","v":"ERROR"},"Building",null,null,null,{"$f":"IF(NHH_CABOL<>\"-\",1,0)","v":0},{"$f":"IF(NHH_CABCost=\"#\",0,1)","v":1},{"$f":"IF(NHH_CABDepAn=\"#\",0,1)","v":1}]
[null,null,null,null,null," Own or\n Lease",null,null,"-",null,null,null,null,null,null,null,null,null,null,null,null,null,null,null,null,null,null,null,null,null,null,null,null,null,null,null,null,null,{"$f":"IF(NHH_CABOL<>\"-\",\"Ok\",\"Error\")","v":"Error"},null,null,null,{"$f":"IF(NHH_CABDepAc=\"#\",0,1)","v":1},{"$f":"IF(NHH_CABFairM=\"#\",0,1)","v":1},0,{"$f":"SUM(AQ40:AS41)","v":4}]
[null,null,null,null,null," Equipment",null,null,null,null,null,null,null,null,null,null,null,null,null,null,null,null,null,null,null,null,{"$f":"(NHH_CABECost-NHH_CABEDepAc)","v":0},null,null,null,null,null,null,null,null,null,"Other\nAssets\ndata\nProvided",null,"Equipment",null,null,null,{"$f":"IF(NHH_CABEOL<>\"-\",1,0)","v":0},{"$f":"IF(NHH_CABECost=\"#\",0,1)","v":1},{"$f":"IF(NHH_CABEDepAn=\"#\",0,1)","v":1},null,null,"X"]
[null,null,null,null,null," Own or\n Lease",null,null,"-",null,null,null,null,null,null,null,null,null,null,null,null,null,null,null,null,null,null,null,null,null,null,null,null,null,null,null,null,null,{"$f":"IF(NHH_CABEOL<>\"-\",\"Ok\",\"Error\")","v":"Error"},null,null,null,{"$f":"IF(NHH_CABEDepAc=\"#\",0,1)","v":1},{"$f":"IF(NHH_CABEFairM=\"#\",0,1)","v":1},0,{"$f":"SUM(AQ42:AS43)","v":4},null,"-"]
[null,null,null,null,null," Other, Specify",null,null,"-",null,null,null,null,null,null,null,null,null,null,null,null,null,null,null,null,null,{"$f":"(NHH_CAOthCost-NHH_CAOthDepAc)","v":0},null,null,null,null,null,null,null,null,null,{"$f":"IF(AND(NHH_OtherSpcFyCapAssts=\"X\",NHH_CAothNetB>1),\"Ok\",\"Error\")","v":"Error"},null,null,null,null,null,{"$f":"IF(NHH_CAOIthSp<>\"\",1,0)","v":1},{"$f":"IF(NHH_CAOthCost=\"#\",0,1)","v":1},{"$f":"IF(NHH_CAOthDepAn=\"#\",0,1)","v":1},{"$f":"OR(AT45=0,AT45=5)","v":true}]
[null,null,null,null,null,"All Other Capital Assets (i.e. Capital Leases)",null,null,null,null,null,null,null,null,null,null,null,null,null,null,null,null,null,null,null,null,null,null,null,null,null,null,null,null,null,null,null,null,null,null,null,null,{"$f":"IF(NHH_CAOthDepAc=\"#\",0,1)","v":1},{"$f":"IF(NHH_CAOthFairM=\"#\",0,1)","v":1},0,{"$f":"SUM(AQ44:AS45)","v":5}]
[null,null,null,null,null,"Total Capital \nAssets ",null,null,null,null,null,{"$f":"(NHH_CABCost+NHH_CABECost+NHH_CAOthCost)","v":0},null,null,null,null,{"$f":"(NHH_CABDepAn+NHH_CABEDepAn+NHH_CAOthDepAn)","v":0},null,null,null,null,{"$f":"(NHH_CABDepAc+NHH_CABEDepAc+NHH_CAOthDepAc)","v":0},null,null,null,null,{"$f":"(NHH_CATotCost-NHH_CATotDepAc)","v":0},null,null,null,null,{"$f":"(NHH_CABFairM+NHH_CABEFairM+NHH_CAOthFairM)","v":0},null,null,null,null,null,null,null,null,null,null,{"$f":"IF(NHH_CAOIthSp<>\"\",10,0)","v":10},{"$f":"NHH_CAOthCost+NHH_CAOthDepAn+NHH_CAOthDepAc+NHH_CAOthFairM","v":0},{"$f":"IF(AR46>=10,0)","v":false},{"$f":"AQ46+AS46","v":10}]
["Daily\nCharge            ",null,null,null,null,"Please indicate your daily charge for each category. The daily charge should be based on charges \nfor all services not just the room and board charge. Levels of care (Level I and Level II): The \nintensity of care provided to nursing home patients depends on their medical needs. Most patients \nneed a less intensive level of care that the Medicaid program calls Level I (formerly called \nintermediate care), while others need a more intensive level called Level II or skilled nursing care. \nThe cost of Level II care is higher than that of Level I, both to private pay patients and to the \nMedicaid program. The Medicare program does not cover Level I care and covers skilled care only \nin certain circumstances and in certified facilities.",null,null,null,null,null,null,null,null,null,null,null,null,null,null,null,null,null,null,null,null,null,null,null,null,null,null,null,null,null,null,null,null,null,null,null,null,{"$f":"IF(AND(NHH_CAOIthSp=\"\",AR46=0),\"Ok\",IF(AND(NHH_CAOIthSp<>\"\",AR46>=1),\"Ok\",\"Error\"))","v":"Error"}]
[null,null,null,null,null,"Type",null,null,null,null,null,null,null,null,null,null,null,null,null,null,null,null,null,null,null,null,null,null,null,null,"Daily Charge on\nthe last day of\nreporting period",null,null,null,null,null,"Yes/No\nquestion","Daily Charge\nvalue of\n# changed","Charge =\nYes;\nprovide data"]
[null,null,null,null,null,"Federal\nand\nState",null,null,"Yes/No",null,null,"-",null,null,"Medicare/Skilled Care (Average Daily Charge)",null,null,null,null,null,null,null,null,null,null,null,null,null,null,null,null,null,null,null,null,null,{"$f":"IF(AN49=TRUE,\"OK\",\"ERROR\")","v":"ERROR"},{"$f":"IF(NHH_DCMSC<>\"#\",\"Ok\",\"Error\")","v":"Ok"},{"$f":"IF(AR49=TRUE,\"OK\",\"ERROR\")","v":"ERROR"},{"$f":"OR(NHH_DCMSCYN=\"Yes\",NHH_DCMSCYN=\"No\")","v":false},{"$f":"IF(NHH_DCMSCYN=\"Yes\",1,0)","v":0},{"$f":"IF(NHH_DCMSC=\"\",0,10)","v":0},{"$f":"SUM(AO49:AP49)","v":0},{"$f":"OR(AQ49=10,AQ49=11)","v":false},{"$f":"IF(NHH_DCMSC>=2000,1,0)","v":0}]
[null,null,null,null,null,null,null,null,"Yes/No",null,null,"-",null,null,"Medicaid/TennCare Level II",null,null,null,null,null,null,null,null,null,null,null,null,null,null,null,null,null,null,null,null,null,{"$f":"IF(AN50=TRUE,\"OK\",\"ERROR\")","v":"ERROR"},{"$f":"IF(NHH_DCMCLevII<>\"#\",\"Ok\",\"Error\")","v":"Ok"},{"$f":"IF(AR50=TRUE,\"OK\",\"ERROR\")","v":"ERROR"},{"$f":"OR(NHH_DCMTCLevIIYN=\"Yes\",NHH_DCMTCLevIIYN=\"No\")","v":false},{"$f":"IF(NHH_DCMTCLevIIYN=\"Yes\",1,0)","v":0},{"$f":"IF(NHH_DCMCLevII=\"\",0,10)","v":0},{"$f":"SUM(AO50:AP50)","v":0},{"$f":"OR(AQ50=10,AQ50=11)","v":false},{"$f":"IF(NHH_DCMCLevII>=2000,1,0)","v":0}]
[null,null,null,null,null,null,null,null,"Yes/No",null,null,"-",null,null,"Medicaid/TennCare Level I",null,null,null,null,null,null,null,null,null,null,null,null,null,null,null,null,null,null,null,null,null,{"$f":"IF(AN51=TRUE,\"OK\",\"ERROR\")","v":"ERROR"},{"$f":"IF(NHH_DCMTCLevI<>\"#\",\"Ok\",\"Error\")","v":"Ok"},{"$f":"IF(AR51=TRUE,\"OK\",\"ERROR\")","v":"ERROR"},{"$f":"OR(NHH_DCMTCLevIYN=\"Yes\",NHH_DCMTCLevIYN=\"No\")","v":false},{"$f":"IF(NHH_DCMTCLevIYN=\"Yes\",1,0)","v":0},{"$f":"IF(NHH_DCMTCLevI=\"\",0,10)","v":0},{"$f":"SUM(AO51:AP51)","v":0},{"$f":"OR(AQ51=10,AQ51=11)","v":false},{"$f":"IF(NHH_DCMTCLevI>=2000,1,0)","v":0}]
[null,null,null,null,null,"Private\nPay",null,null,"Yes/No",null,null,"-",null,null,"Private Level II (one resident per room)",null,null,null,null,null,null,null,null,null,null,null,null,null,null,null,null,null,null,null,null,null,"ERROR",{"$f":"IF(NHH_DCPRiLevII<>\"#\",\"Ok\",\"Error\")","v":"Ok"},"ERROR",{"$f":"OR(NHH_DCPriLevIIYN=\"Yes\",NHH_DCPriLevIIYN=\"No\")","v":false},{"$f":"IF(NHH_DCPriLevIIYN=\"Yes\",1,0)","v":0},{"$f":"IF(NHH_DCPRiLevII=\"\",0,10)","v":0},0,false,{"$f":"IF(NHH_DCPRiLevII>=2000,1,0)","v":0}]
[null,null,null,null,null,null,null,null,"Yes/No",null,null,"-",null,null,"Private Level I (one resident per room)",null,null,null,null,null,null,null,null,null,null,null,null,null,null,null,null,null,null,null,null,null,"ERROR",{"$f":"IF(NHH_DCPriLevI<>\"#\",\"Ok\",\"Error\")","v":"Ok"},"ERROR",{"$f":"OR(NHH_DCPriLevIYN=\"Yes\",NHH_DCPriLevIYN=\"No\")","v":false},{"$f":"IF(NHH_DCPriLevIYN=\"Yes\",1,0)","v":0},{"$f":"IF(NHH_DCPriLevI=\"\",0,10)","v":0},0,false,{"$f":"IF(NHH_DCPriLevI>=2000,1,0)","v":0}]
[null,null,null,null,null,null,null,null,"Yes/No",null,null,"-",null,null,"Semi Private Level II (two residents per room)",null,null,null,null,null,null,null,null,null,null,null,null,null,null,null,null,null,null,null,null,null,"ERROR",{"$f":"IF(NHH_DCSPLevII<>\"#\",\"Ok\",\"Error\")","v":"Ok"},"ERROR",{"$f":"OR(NHH_DCSPLEVIIYN=\"Yes\",NHH_DCSPLEVIIYN=\"No\")","v":false},{"$f":"IF(NHH_DCSPLEVIIYN=\"Yes\",1,0)","v":0},{"$f":"IF(NHH_DCSPLevII=\"\",0,10)","v":0},0,false,{"$f":"IF(NHH_DCSPLevII>=2000,1,0)","v":0}]
[null,null,null,null,null,null,null,null,"Yes/No",null,null,"-",null,null,"Semi Private Level I (two residents per room",null,null,null,null,null,null,null,null,null,null,null,null,null,null,null,null,null,null,null,null,null,"ERROR",{"$f":"IF(NHH_DCSPLevI<>\"#\",\"Ok\",\"Error\")","v":"Ok"},"ERROR",{"$f":"OR(NHH_DCSPLevIYN=\"Yes\",NHH_DCSPLevIYN=\"No\")","v":false},{"$f":"IF(NHH_DCSPLevIYN=\"Yes\",1,0)","v":0},{"$f":"IF(NHH_DCSPLevI=\"\",0,10)","v":0},0,false,{"$f":"IF(NHH_DCSPLevI>=2000,1,0)","v":0}]
[null,null,null,null,null,null,null,null,"Yes/No",null,null,"-",null,null,"Ward Level II (more than two residents per room)",null,null,null,null,null,null,null,null,null,null,null,null,null,null,null,null,null,null,null,null,null,"ERROR",{"$f":"IF(NHH_DCWardLevII<>\"#\",\"Ok\",\"Error\")","v":"Ok"},"ERROR",{"$f":"OR(NHH_DCWardLevIIYN=\"Yes\",NHH_DCWardLevIIYN=\"No\")","v":false},{"$f":"IF(NHH_DCWardLevIIYN=\"Yes\",1,0)","v":0},{"$f":"IF(NHH_DCWardLevII=\"\",0,10)","v":0},0,false,{"$f":"IF(NHH_DCWardLevII>=2000,1,0)","v":0}]
[null,null,null,null,null,null,null,null,"Yes/No",null,null,"-",null,null,"Ward Level I (more than two residents per room)",null,null,null,null,null,null,null,null,null,null,null,null,null,null,null,null,null,null,null,null,null,"ERROR",{"$f":"IF(NHH_DCWardLevI<>\"#\",\"Ok\",\"Error\")","v":"Ok"},"ERROR",{"$f":"OR(NHH_DCWardLevIYN=\"Yes\",NHH_DCWardLevIYN=\"No\")","v":false},{"$f":"IF(NHH_DCWardLevIYN=\"Yes\",1,0)","v":0},{"$f":"IF(NHH_DCWardLevI=\"\",0,10)","v":0},0,false,{"$f":"IF(NHH_DCWardLevI>=2000,1,0)","v":0}]
["Go to Next Schedule",null,null,null,null,null,null,null,null,null,null,null,null,null,null,null,null,null,null,null,null,null,null,null,null,null,null,null,null,null,null,null,null,null,null,null,"Daily Charge is over\n$2000",null,null,null,null,null,null,null,{"$f":"SUM(AS49:AS57)","v":0}]
["Return to Main Menu"]
["Go to Error Listing",null,null,null,null,null,null,null,null,null,null,null,null,null,null,null,null,null,null,null,null,null,null,null,null,null,null,null,null,null,null,null,null,null,null,null,null,null,{"$f":"IF(AS58=0,\"Ok\",\"Error\")","v":"Ok"}]

{"sheet":"H-Data","index":25,"n_rows":4,"n_cols":100,"rows_kept":4,"cut":false,"hidden":true,"merged":[]}
["Facility ID Info",null,null,"Reporting Period",null,null,"Patient Revenue",null,null,null,null,null,null,null,null,null,null,null,null,null,null,null,null,null,null,null,null,null,null,null,null,null,null,null,null,null,null,null,null,null,null,null,null,null,null,null,null,null,"Non-Patient","Grand Total","Adjustment to charges",null,null,null,"Expenses (exclude depreciation)",null,null,null,null,"Capital Assets",null,null,null,null,null,null,"Capital Assets",null,null,null,null,null,null,null,null,null,null,null,null,null,null,null,"Daily Charge"]
[null,null,null,null,null,null,"Government Medicare Advantage",null,null,"Government All Other Medicare",null,null,"Government TennCare MCO",null,null,"Government All other Medicaid/TC",null,null,"Government VA Contract",null,null,"Government Other Government",null,null,"Government Total Government",null,null,"Cover Tennessee Access Tennessee",null,null,"Cover Tennessee Total Cover TN",null,null,"Non-Govt Private (Self-Pay)",null,null,"Non-Govt Long Term Care Insurance",null,null,"Non-Govt Other Non-government",null,null,"Non-Govt Total",null,null,"Patient Revenue Total",null,null,"Revenue","Revenue",null,null,null,null,null,null,null,null,null,"Building",null,null,null,null,null,"Equipment",null,null,null,null,null,"All Other","All Other",null,null,null,null,"Total Capital Assets (System Calculation)",null,null,null,null,"Federal and State",null,null,null,null,null,"Private Pay"]
["State ID","NH Name","County","Same as\nstat data?\nYes/No","Financial\nBeginning\nDate","Financial\nEnding\nDate","Gross\nPatent\nCharges","Adjustment\nto Revenue","Net Patient\nRevenue","Gross\nPatent\nCharges","Adjustment\nto Revenue","Net Patient\nRevenue","Gross\nPatent\nCharges","Adjustment\nto Revenue","Net Patient\nRevenue","Gross\nPatent\nCharges","Adjustment\nto Revenue","Net Patient\nRevenue","Gross\nPatent\nCharges","Adjustment\nto Revenue","Net Patient\nRevenue","Gross\nPatent\nCharges","Adjustment\nto Revenue","Net Patient\nRevenue","Gross\nPatent\nCharges","Adjustment\nto Revenue","Net Patient\nRevenue","Gross\nPatent\nCharges","Adjustment\nto Revenue","Net Patient\nRevenue","Gross\nPatent\nCharges","Adjustment\nto Revenue","Net Patient\nRevenue","Gross\nPatent\nCharges","Adjustment\nto Revenue","Net Patient\nRevenue","Gross\nPatent\nCharges","Adjustment\nto Revenue","Net Patient\nRevenue","Gross\nPatent\nCharges","Adjustment\nto Revenue","Net Patient\nRevenue","Gross\nPatent\nCharges","Adjustment\nto Revenue","Net Patient\nRevenue","Gross\nPatent\nCharges","Adjustment\nto Revenue","Net Patient\nRevenue","All\nOther\nRevenue","Total Patient\nand\nNon-Patient","Bad Debt","Charity\nCare","Other\nAdjustments","Total\nAdjustments","Payroll","Benefits","Other\nOperating","Non\nOperating","Total\nExpenses","Own/\nLease","Cost","Deprciation\nAnnual","Deprciation\nAccumulate","Net Book\nValue","Fair market\nValue","Own/\nLease","Cost","Deprciation\nAnnual","Deprciation\nAccumulate","Net Book\nValue","Fair market\nValue","Specify","Cost","Deprciation\nAnnual","Deprciation\nAccumulate","Net Book\nValue","Fair market\nValue","Cost","Deprciation\nAnnual","Deprciation\nAccumulate","Net Book\nValue","Fair market\nValue","Medicare/\nSkilled\nYes/No","Medicare/\nSkilled\nD. Charge","Medicaid/\nTNCare L II\nYes/No","Medicaid/\nTNCare L II\nD. Charge","Medicaid/\nTNCare L I\nYes/No","Medicaid/\nTNCare L I\nD. Charge","Private L II\nYes/No","Private L II\nD. Charge","Private L I\nYes/No","Private L I\nD. Charge","Semi-\nPrivate L II\nYes/No","Semi-\nPrivate L II\nD. Charge","Semi-\nPrivate L I\nYes/No","Semi-\nPrivate L I\nD. Charge","Ward L II\nYes/No","Wared L II\nD. Charge","Ward L I\nYes/No","Wared L I\nD. Charge"]
[{"$f":"NHA_StateID","v":0},{"$f":"NHA_Name","v":"-"},{"$f":"NHA_County","v":"-"},{"$f":"NHH_FinDataYN","v":"-"},{"$f":"NHH_FinDateBeg","v":""},{"$f":"NHH_FinDateEnd","v":""},{"$f":"NHH_GMCGPC","v":0},{"$f":"NHH_GMCRev","v":0},{"$f":"NHH_GMCNet","v":0},{"$f":"(NHH_GOMCGPC)","v":0},{"$f":"(NHH_GOMCRev)","v":0},{"$f":"(NHH_GOMCNet)","v":0},{"$f":"NHH_GMTCGPC","v":0},{"$f":"NHH_GMTCRev","v":0},{"$f":"NHH_GMTCNet","v":0},{"$f":"(NHH_GMMTCGPC)","v":0},{"$f":"(NHH_GMMTCRev)","v":0},{"$f":"(NHH_GMMTCNet)","v":0},{"$f":"(NHH_GVAGPC)","v":0},{"$f":"(NHH_GVARev)","v":0},{"$f":"(NHH_GVANet)","v":0},{"$f":"NHH_GOGGPC","v":0},{"$f":"NHH_GOGRev","v":0},{"$f":"NHH_GOGNet","v":0},{"$f":"NHH_GTotGPC","v":0},{"$f":"NHH_GTotRev","v":0},{"$f":"NHH_GTotNet","v":0},{"$f":"NHH_CTATGPC","v":0},{"$f":"NHH_CTATRev","v":0},{"$f":"NHH_CTATNet","v":0},{"$f":"NHH_CTTotGPC","v":0},{"$f":"NHH_CTTotRev","v":0},{"$f":"NHH_CTTotNet","v":0},{"$f":"NHH_NGSPGPC","v":0},{"$f":"NHH_NGSPRev","v":0},{"$f":"NHH_NGSPNet","v":0},{"$f":"NHH_NGInsGPC","v":0},{"$f":"NHH_NGinsRev","v":0},{"$f":"NHH_NGInsNet","v":0},{"$f":"NHH_NGOthGPC","v":0},{"$f":"NHH_NGOthRev","v":0},{"$f":"NHH_NGOthNet","v":0},{"$f":"NHH_NGTotGPC","v":0},{"$f":"NHH_NGTotRev","v":0},{"$f":"NHH_NGTotNet","v":0},{"$f":"NHH_TPRGPC","v":0},{"$f":"NHH_TPRRev","v":0},{"$f":"NHH_TPRNet","v":0},{"$f":"NHH_OtherRev","v":0},{"$f":"NHH_GrandRev","v":0},{"$f":"NHH_BadDebt","v":0},{"$f":"NHH_Charity","v":0},{"$f":"NHH_OthAdj","v":0},{"$f":"NHH_TotAdj","v":0},{"$f":"NHH_Payroll","v":0},{"$f":"NHH_Benefit","v":0},{"$f":"NHH_OthOpExp","v":0},{"$f":"NHH_NonOpExp","v":0},{"$f":"NHH_TotExp","v":0},{"$f":"NHH_CABOL","v":"-"},{"$f":"NHH_CABCost","v":0},{"$f":"NHH_CABDepAn","v":0},{"$f":"NHH_CABDepAc","v":0},{"$f":"NHH_CABNetB","v":0},{"$f":"NHH_CABFairM","v":0},{"$f":"NHH_CABEOL","v":"-"},{"$f":"NHH_CABECost","v":0},{"$f":"NHH_CABEDepAn","v":0},{"$f":"NHH_CABEDepAc","v":0},{"$f":"NHH_CABENetB","v":0},{"$f":"NHH_CABEFairM","v":0},{"$f":"NHH_CAOIthSp","v":"All Other Capital Assets (i.e. Capital Leases)"},{"$f":"NHH_CAOthCost","v":0},{"$f":"NHH_CAOthDepAn","v":0},{"$f":"NHH_CAOthDepAc","v":0},{"$f":"NHH_CAothNetB","v":0},{"$f":"NHH_CAOthFairM","v":0},{"$f":"NHH_CATotCost","v":0},{"$f":"NHH_CATotDepAn","v":0},{"$f":"NHH_CATotDepAc","v":0},{"$f":"NHH_CATotNetB","v":0},{"$f":"NHH_CATotFairM","v":0},{"$f":"NHH_DCMSCYN","v":"-"},{"$f":"IF(NHH_DCMSC>0,NHH_DCMSC,\"\")","v":""},{"$f":"NHH_DCMTCLevIIYN","v":"-"},{"$f":"IF(NHH_DCMCLevII>0,NHH_DCMCLevII,\"\")","v":""},{"$f":"NHH_DCMTCLevIYN","v":"-"},{"$f":"IF(NHH_DCMTCLevI>0,NHH_DCMTCLevI,\"\")","v":""},{"$f":"NHH_DCPriLevIIYN","v":"-"},{"$f":"IF(NHH_DCPRiLevII>0,NHH_DCPRiLevII,\"\")","v":""},{"$f":"NHH_DCPriLevIYN","v":"-"},{"$f":"IF(NHH_DCPriLevI>0,NHH_DCPriLevI,\"\")","v":""},{"$f":"NHH_DCSPLEVIIYN","v":"-"},{"$f":"IF(NHH_DCSPLevII>0,NHH_DCSPLevII,\"\")","v":""},{"$f":"NHH_DCSPLevIYN","v":"-"},{"$f":"IF(NHH_DCSPLevI>0,NHH_DCSPLevI,\"\")","v":""},{"$f":"NHH_DCWardLevIIYN","v":"-"},{"$f":"IF(NHH_DCWardLevII>0,NHH_DCWardLevII,\"\")","v":""},{"$f":"NHH_DCWardLevIYN","v":"-"},{"$f":"IF(NHH_DCWardLevI>0,NHH_DCWardLevI,\"\")","v":""}]

{"sheet":"Error Sheet","index":26,"n_rows":246,"n_cols":6,"rows_kept":246,"cut":false,"hidden":false,"merged":[[245,0,245,5]]}
["State \nID","Ok/\nError","Return to\nschedule","Error\nNumber","2018 Tennessee Joint Annual Report of Nursing Homes Provisional                                                                  Error Message ","Please provide an explanation of why the data cannot be changed                                       (Why an ERROR may remain)                                                                                              For all Error Messages that are marked \"Error\"\nHealthcare Facility Commentary: "]
[]
[{"$f":"(NHA_StateID)","v":0},{"$f":"('Sch A'!AK7)","v":"Error"},"NHA_NameChange","A-01-01","Indicate Yes or No to question concerning facility name change during reporting period."]
[0,{"$f":"('Sch A'!AK10)","v":"Ok"},"NHA_NameChange","A-01-02","Prior Name change was indicated; provide prior name."]
[0,{"$f":"'Sch A'!AK16","v":"Error"},"NHA_MAYN","A-01-03","Facility Maining address information is needed."]
[0,{"$f":"('Sch A'!AK21)","v":"Error"},"NHA_RptPeriodYN","A-01-04","Indicate Yes or No to question concerning reporting period."]
[0,{"$f":"('Sch A'!AL9)","v":"Error"},"NHA_StreetAddress","A-02-01","Facility address information is needed."]
[0,{"$f":"'Sch A'!AL14","v":"Error"},"NHA_MAYN","A-02-02","Indicate Yes or No to question concerning facility mailing address different from Street address."]
[0,{"$f":"'Sch A'!AL18","v":"Error"},"NHA_PrepName","A-02-03","Preparer information is needed."]
[0,{"$f":"('Sch A'!AL23)","v":"Ok"},"NHA_RptPeriodYN","A-02-04","Reporting Period answered No; however; Beginning and Ending Date(s) not changed."]
[0,{"$f":"('Sch A'!AL26)","v":"Error"},"NHA_Admin","A-02-05","Provide Administrator name and license."]
[0,{"$f":"('Sch B'!AK7)","v":"Error"},"NHB_OwnName","B-01-01","Provide complete owner information. "]
[0,{"$f":"('Sch B'!AK11)","v":"Error"},"NHB_TpeProfProp","B-01-02","Select only one type of owner. "]
[0,{"$f":"('Sch B'!AK13)","v":"Ok"},"NHB_TypeGovtOther","B-01-03","Other Government checked; specify name."]
[0,{"$f":"('Sch B'!AK16)","v":"Error"},"NHB_MangOwn","B-01-04","Place X in only one managed by boxes (Owner; Contract with Firm; or Other)."]
[0,{"$f":"('Sch B'!AK20)","v":"Error"},"NHB_OwnName","B-01-05","Provide complete building owner information.  "]
[0,{"$f":"('Sch B'!AK32)","v":"Error"},"NHB_BldgConstYN","  ","Indicate Yes or No to question concerning year of original construction date."]
[0,{"$f":"('Sch B'!AK33)","v":"Error"},"NHB_BldgRenYN","B-01-07","Indicate Yes or No to question concerning major renovation of building data."]
[0,{"$f":"('Sch B'!AK34)","v":"Error"},"NHB_BldgNewCYN","B-01-08","Indicate Yes or No to question concerning new construction to add to bed count."]
[0,{"$f":"('Sch B'!AK36)","v":"Error"},"NHB_OrgSHBYN","B-01-09","Indicate Yes or No to question concerning hospital based facility."]
[0,{"$f":"('Sch B'!AK37)","v":"Error"},"NHB_OrgSChYN","B-01-10","Indicate Yes or No to question concerning Chain based facility."]
[0,{"$f":"('Sch B'!AL48)","v":"Ok"},"NHB_OrgSHCYN","B-01-11","Indicate Yes or No to question concerning Holding Company/Parent Corporation based facility."]
[0,{"$f":"('Sch B'!AL17)","v":"Error"},"NHB_MangName","B-02-01","Provide complete management information."]
[0,{"$f":"'Sch B'!AL32","v":"Ok"},"NHB_BldgConstYr","B-02-02","Knowledge of original construction year was indicated; enter the original construction year."]
[0,{"$f":"'Sch B'!AL33","v":"Ok"},"NHB_BldgRenYr","B-02-03","A major building renovation was indicated; enter the major renovation year."]
[0,{"$f":"'Sch B'!AL34","v":"Ok"},"NHB_BldgNewCYr","B-02-04","New construction that increased licensed bed count was indicated; enter the new construction year."]
[0,{"$f":"'Sch B'!AL35","v":"Ok"},"NHB_BldgNewCCs","B-02-05","New construction that increased licensed bed count was indicated; enter the new construction cost."]
[0,{"$f":"('Sch B'!AL44)","v":"Ok"},"NHB_OrgSChName","B-02-06","Chain was indicated; provide complete chain information."]
[0,{"$f":"('Sch B'!AL48)","v":"Ok"},"NHB_OrgSHCName","B-02-07","Holding Company/Parent Corporation was indicated; provide complete information."]
[0,{"$f":"('Sch B'!AM40)","v":"Ok"},"NHB_OrgSHBSpecify","B-03-01","Hospital Based was indicated; provide hospital name."]
[0,{"$f":"('Sch C'!AK6)","v":"Error"},"NHC_AcrJComYN","C-01-01","Indicate Yes or No to question concerning Joint Commission on Accreditation of Healthcare."]
[0,{"$f":"('Sch C'!AK8)","v":"Error"},"NHC_AcrOtherYN","C-01-02","Indicate Yes or No to question concerning other accreditation."]
[0,{"$f":"('Sch C'!AK9)","v":"Error"},"NHC_MemNHOYN","C-01-03","Indicate Yes or No to question concerning National Hospice Organization membership."]
[0,{"$f":"('Sch C'!AK10)","v":"Error"},"NHC_MemTAHCYN","C-01-04","Indicate Yes or No to question concerning Tennessee Association for Home Care."]
[0,{"$f":"('Sch C'!AK11)","v":"Error"},"NHC_MemTAHSAgeYN","C-01-05","Indicate Yes or No to question concerning Tennessee Association of Homes and Services for the Aging."]
[0,{"$f":"('Sch C'!AK12)","v":"Error"},"NHC_MemTHCAYN","C-01-06","Indicate Yes or No to question concerning Tennessee Health Care Association."]
[0,{"$f":"('Sch C'!AK13)","v":"Error"},"NHC_MemTHOYN","C-01-07","Indicate Yes or No to question concerning Tennessee Hospice Organization."]
[0,{"$f":"'Sch C'!AK14","v":"Error"},"NHC_MemTAHCYN","C-01-08","Indicate Yes or No to question concerning American Health Care Association."]
[0,{"$f":"('Sch C'!AK15)","v":"Error"},"NHC_MemTHAYN","C-01-09","Indicate Yes or No to question concerning THA Home Care Alliance."]
[0,{"$f":"('Sch C'!AK16)","v":"Error"},"NHC_MemOtherYN","C-01-10","Indicate Yes or No to question concerning Other memberships."]
[0,{"$f":"'Sch C'!AK20","v":"Error"},"NHC_LicYear","C-01-11","Please record license number."]
[0,{"$f":"('Sch C'!AL4)","v":"Ok"},"NHC_AcrJComYN","C-02-01","Joint Commission on Accreditation of Healthcare Organizations was indicated; enter the approval and expiration dates or check 'No'."]
[0,{"$f":"('Sch C'!AL7)","v":"Ok"},"NHC_AcrJcomAD","C-02-02","Indicate Joint Commission on Accreditation of Healthcare Organizations expiration year that is later than the approval year."]
[0,{"$f":"('Sch C'!AL10)","v":"Ok"},"NHC_MemOtherYN","C-02-03","Other Accreditation was indicated; specify additional data."]
[0,{"$f":"('Sch C'!AL16)","v":"Ok"},"NHC_MemOther","C-02-04","Other Member was indicated; specify additional data."]
[0,{"$f":"'Sch C'!AL20","v":"Error"},"NHC_LicSurvey","C-02-05","Please record most recent survey date."]
[0,{"$f":"('Sch D-1'!AK4)","v":"Error"},"NHD1_ConProjectYN","D1-01-01","Indicate Yes or No to question concerning approved Certificate of Need."]
[0,{"$f":"('Sch D-1'!AK11)","v":"Error"},"NHD1_SrvCCRCYN","D1-01-02","Indicate Yes or No to question concerning Continuing Care."]
[0,{"$f":"('Sch D-1'!AK16)","v":"Error"},"NHD1_SrvHHCSYN","D1-01-03","Indicate Yes or No to question concerning  Home Health Care Services."]
[0,{"$f":"('Sch D-1'!AK19)","v":"Error"},"NHD1_SrvHHRefYN","D1-01-04","Indicate Yes or No to question concerning Home Health Care Services Referrals."]
[0,{"$f":"('Sch D-1'!AK21)","v":"Error"},"NHD1_SrvADCYN","D1-01-05","Indicate Yes or No to question concerning  Adult Day Care."]
[0,{"$f":"('Sch D-1'!AK22)","v":"Error"},"NHD1_SrvORSYN","D1-01-06","Indicate Yes or No to question concerning Outpatient/Rehabilitation Services."]
[0,{"$f":"('Sch D-1'!AK23)","v":"Error"},"NHD1_SrvRCSYN","D1-01-07","Indicate Yes or No to question concerning Respite Care Services."]
[0,{"$f":"('Sch D-1'!AK24)","v":"Error"},"NHD1_SrvCMSYN","D1-01-08","Indicate Yes or No to question concerning Case Management Services."]
[0,{"$f":"('Sch D-1'!AK25)","v":"Error"},"NHD1_SrvHSYN","D1-01-09","Indicate Yes or No to question concerning Homemaker Services."]
[0,{"$f":"('Sch D-1'!AK26)","v":"Error"},"NHD1_SrvPCSYN","D1-01-10","Indicate Yes or No to question concerning Personal Care Services."]
[0,{"$f":"('Sch D-1'!AK27)","v":"Error"},"NHD1_SrvHDMYN","D1-01-11","Indicate Yes or No to question concerning Home Delivered Meals."]
[0,{"$f":"('Sch D-1'!AK28)","v":"Error"},"NHD1_SrvTSYN","D1-01-12","Indicate Yes or No to question concerning Transportation Services."]
[0,{"$f":"('Sch D-1'!AK29)","v":"Error"},"NHD1_SrvAlzYN","D1-01-13","Indicate Yes or No to question concerning Licensed/Approved Specialized Unit for Alzheimer's patients."]
[0,{"$f":"('Sch D-1'!AK30)","v":"Error"},"NHD1_SrvAlzProgYN","D1-01-14","Indicate Yes or No to question concerning Specialized Programs for Alzheimer's Patients."]
[0,{"$f":"('Sch D-1'!AK31)","v":"Error"},"NHD1_SrvSecUYN","D1-01-15","Indicate Yes or No to question concerning Secured Unit."]
[0,{"$f":"('Sch D-1'!AK32)","v":"Error"},"NHD1_SrvBehUYN","D1-01-16","Indicate Yes or No to question concerning Behavioral Health Unit."]
[0,{"$f":"('Sch D-1'!AK33)","v":"Error"},"NHD1_SrvHosCareYN","D1-01-17","Indicate Yes or No to question concerning Hospice Care."]
[0,{"$f":"('Sch D-1'!AK34)","v":"Error"},"NHD1_SrvHosCareYN","D1-01-18","Indicate Yes or No to question concerning Hospice services provided by separately licensed agency."]
[0,{"$f":"('Sch D-1'!AK36)","v":"Error"},"NHD1_SrvTrainYN","D1-01-19","Indicate Yes or No to question concerning Training in skills required to return to community."]
[0,{"$f":"('Sch D-1'!AL7)","v":"OK"},"NHD1_ConDate1","D1-02-01","Certificate of Need was indicated; provide additional data."]
[{"$f":"(NHA_StateID)","v":0},{"$f":"('Sch D-1'!AL15)","v":"Ok"},"NHD1_SrvCCRCIAL","D1-02-02","Continuing Care was indicated; provide number of units. "]
[0,{"$f":"('Sch D-1'!AL18)","v":"Ok"},"NHD1_SrvHHCSDisch","D1-02-03","Home Health Care Services was indicated; provide additional data."]
[0,{"$f":"('Sch D-1'!AL21)","v":"Ok"},"NHD1_SrvHHRefDisch","D1-01-06","Home Health Care Service Referrals was indicated; provide additional data."]
[0,{"$f":"('Sch D-1'!AL25)","v":"Ok"},"NHD1_SrvAlzBed","D1-02-07","Licensed Specialized Alzheimer's unit was indicated; provide additional data."]
[0,{"$f":"('Sch D-1'!AL30)","v":"Ok"},"NHD1_SrvSecUBed","D1-02-08","Secured Unit was indicated; provide additional data."]
[0,{"$f":"('Sch D-1'!AL33)","v":"Ok"},"NHD1_SrvBehUBed","D1-02-09","Behavior Health Unit was indicated; provide additional data."]
[0,{"$f":"'Sch D-1'!AL36","v":"Ok"},"NHD1_HospiceData","D1-02-10","Hospice Service by a separately licensed hospice agency was indicated; provide additional data."]
[0,{"$f":"('Sch D-2'!AK4)","v":"Error"},"NHD2_SCPChemoYN","D2-01-01","Indicate Yes or No to question concerning Chemotherapy."]
[0,{"$f":"('Sch D-2'!AK5)","v":"Error"},"NHD2_SCPDialYN","D2-01-02","Indicate Yes or No to question concerning Dialysis."]
[0,{"$f":"('Sch D-2'!AK6)","v":"Error"},"NHD2_SCPIVmedYN","D2-01-03","Indicate Yes or No to question concerning IV Medication."]
[0,{"$f":"('Sch D-2'!AK7)","v":"Error"},"NHD2_SCPInOutYN","D2-01-04","Indicate Yes or No to question concerning Intake/Output."]
[0,{"$f":"('Sch D-2'!AK8)","v":"Error"},"NHD2_SCPOstoYN","D2-01-05","Indicate Yes or No to question concerning Ostomy Care."]
[0,{"$f":"('Sch D-2'!AK9)","v":"Error"},"NHD2_SCPOxyYN","D2-01-06","Indicate Yes or No to question concerning Oxygen Therapy."]
[0,{"$f":"('Sch D-2'!AK10)","v":"Error"},"NHD2_SCPRadYN","D2-01-07","Indicate Yes or No to question concerning Radiation."]
[0,{"$f":"('Sch D-2'!AK11)","v":"Error"},"NHD2_SCPSuctYN","D2-01-08","Indicate Yes or No to question concerning Suctioning."]
[0,{"$f":"('Sch D-2'!AK12)","v":"Error"},"NHD2_SCPTrachYN","D2-01-09","Indicate Yes or No to question concerning Tracheotomy Care."]
[0,{"$f":"('Sch D-2'!AK13)","v":"Error"},"NHD2_SCPTransYN","D2-01-10","Indicate Yes or No to question concerning Transfusions."]
[0,{"$f":"('Sch D-2'!AK14)","v":"Error"},"NHD2_SCPVentYN","D2-01-11","Indicate Yes or No to question concerning Ventilator/Respirator."]
[0,{"$f":"('Sch D-2'!AK16)","v":"Error"},"NHD2_SCPOccupYN","D2-01-12","Indicate Yes or No to question concerning  Occupational therapy."]
[0,{"$f":"('Sch D-2'!AK17)","v":"Error"},"NHD2_SCPPhysYN","D2-01-13","Indicate Yes or No to question concerning Physical therapy."]
[0,{"$f":"('Sch D-2'!AK18)","v":"Error"},"NHD2_SCPRespYN","D2-01-14","Indicate Yes or No to question concerning Respiratory therapy."]
[0,{"$f":"('Sch D-2'!AK19)","v":"Error"},"NHD2_SCPPsychYN","D2-01-15","Indicate Yes or No to question concerning Psychological therapy."]
[0,{"$f":"('Sch D-2'!AK20)","v":"Error"},"NHD2_SCPSpeecYN","D2-01-16","Indicate Yes or No to question concerning Speech therapy."]
[0,{"$f":"('Sch D-2'!AK21)","v":"Error"},"NHD2_SCPColoYN","D2-01-17","Indicate Yes or No to question concerning Colostomy Irrigation."]
[0,{"$f":"('Sch D-2'!AK22)","v":"Error"},"NHD2_SCPIleoYN","D2-01-18","Indicate Yes or No to question concerning Ileostomy."]
[0,{"$f":"('Sch D-2'!AK24)","v":"Error"},"NHD2_ADLBath","D2-01-19","Provide additional data concerning Activities of Daily Living (ADL)."]
[0,{"$f":"('Sch D-2'!AK29)","v":"Error"},"NHD2_ADLNo","D2-01-20","Provide additional data concerning number of ADLs."]
[0,{"$f":"('Sch D-2'!AK33)","v":"Error"},"NHD2_MedAnxiety","D2-01-21","Provide additional data concerning Medication."]
[0,{"$f":"('Sch D-2'!AK37)","v":"Error"},"NHD2_ImmuGiven","D2-01-22","Provide additional data concerning Immunization."]
[0,{"$f":"('Sch D-2'!AK44)","v":"Error"},"NHD2_MobBed","D2-01-23","Provide additional data concerning Mobility."]
[0,{"$f":"('Sch D-3'!AK5)","v":"Error"},"NHD3_HCBSYN","D3-01-01","Indicate Yes or No to question concerning Home and Community Based Services waiver program."]
[0,{"$f":"('Sch D-3'!AK7)","v":"Error"},"NHD3_AdultDayYN","D3-01-02","Indicate Yes or No to question concerning Adult Day Care."]
[0,{"$f":"('Sch D-3'!AK8)","v":"Error"},"NHD3_CaseMgmtYN","D3-01-03","Indicate Yes or No to question concerning Case Management."]
[0,{"$f":"('Sch D-3'!AK9)","v":"Error"},"NHD3_HMakeYN","D3-01-04","Indicate Yes or No to question concerning  Homemaker."]
[0,{"$f":"('Sch D-3'!AK10)","v":"Error"},"NHD3_PCSYN","D3-01-05","Indicate Yes or No to question concerning Personal Care Services."]
[0,{"$f":"('Sch D-3'!AK11)","v":"Error"},"NHD3_HMealsYN","D3-01-06","Indicate Yes or No to question concerning Home Delivered Meals."]
[0,{"$f":"('Sch D-3'!AK12)","v":"Error"},"NHD3_PERSYN","D3-01-07","Indicate Yes or No to question concerning Personal Emergency Response System."]
[0,{"$f":"('Sch D-3'!AK13)","v":"Error"},"NHD3_InResYN","D3-01-08","Indicate Yes or No to question concerning Inpatient Respite."]
[0,{"$f":"('Sch D-3'!AK14)","v":"Error"},"NHD3_IHomeResYN","D3-01-09","Indicate Yes or No to question concerning In-home Respite."]
[0,{"$f":"('Sch D-3'!AK15)","v":"Error"},"NHD3_AsTechYN","D3-01-10","Indicate Yes or No to question concerning Assistive Technology."]
[0,{"$f":"('Sch D-3'!AK16)","v":"Error"},"NHD3_PerCareYN","D3-01-11","Indicate Yes or No to question concerning Personal Care Assistance/Attendant."]
[0,{"$f":"('Sch D-3'!AK17)","v":"Error"},"NHD3_PestCYN","D3-01-12","Indicate Yes or No to question concerning Pest Control."]
[0,{"$f":"('Sch D-3'!AK18)","v":"Error"},"NHD3_ACLFYN","D3-01-13","Indicate Yes or No to question concerning Assisted Care Living Facility."]
[0,{"$f":"('Sch D-3'!AK19)","v":"Error"},"NHD3_MinHomeYN","D3-01-14","Indicate Yes or No to question concerning Minor Home Modifications."]
[0,{"$f":"'Sch D-3'!AL19","v":"Ok"},"NHD3_HCBSYN","D3-02-01","HCBS checked Yes; additional data concerning HCBS Services is needed."]
[0,{"$f":"('Sch E'!AK5)","v":"Error"},"NHE_BedMCOYN","E-01-01","Indicate Yes or No to question concerning Medicare Certified only."]
[0,{"$f":"('Sch E'!AK6)","v":"Error"},"NHE_BedMCaidTCYN","E-01-02","Indicate Yes or No to question concerning Medicaid/TennCare Certified only."]
[0,{"$f":"('Sch E'!AK7)","v":"Error"},"NHE_BedMCareMTCYN","E-01-03","Indicate Yes or No to question concerning Medicare and Medicaid/TennCare Certified."]
[0,{"$f":"('Sch E'!AK8)","v":"Error"},"NHE_BedNonCertYN","E-01-04","Indicate Yes or No to question concerning Non-Certified beds."]
[0,{"$f":"('Sch E'!AK10)","v":"Error"},"NHE_BedChangeYN","E-01-05","Indicate Yes or No to question concerning changes in Licensed bed count."]
[0,{"$f":"('Sch E'!AK18)","v":"Error"},"MedicareAppdate","E-01-06","Indicate Yes or No to question concerning entering the Medicare program."]
[0,{"$f":"('Sch E'!AK20)","v":"Error"},"MedicareWithdate","E-01-07","Indicate Yes or No to question concerning withdrawal the Medicare program."]
[0,{"$f":"('Sch E'!AK25)","v":"Error"},"NHE_EnterMTCYN","E-01-08","Indicate Yes or No to question concerning entering the Medicaid/TennCare program."]
[0,{"$f":"('Sch E'!AK27)","v":"Error"},"NHE_WdrawMTCYN","E-01-09","Indicate Yes or No to question concerning withdrawal from the  Medicaid/TennCare program. "]
[0,{"$f":"('Sch E'!AK30)","v":"Ok"},"NHE_PrivateYN","E-01-10","Indicate Yes or No to question concerning private room beds."]
[0,{"$f":"('Sch E'!AK31)","v":"Error"},"NHE_SemiPYN","E-01-11","Indicate Yes or No to question concerning semi-private room beds."]
[0,{"$f":"('Sch E'!AK32)","v":"Error"},"NHE_WardsYN","E-01-12","Indicate Yes or No to question concerning Ward beds."]
[0,{"$f":"('Sch E'!AK34)","v":"Error"},"NHE_TotBeds","E-01-13","Indicate Yes or No to question concerning Changes in staffed bed count."]
[0,{"$f":"('Sch E'!AK39)","v":"Ok"},"NHE_SBedOpn1","E-01-14","A change in the number of beds Set up and Staffed was indicated; provide additional data."]
[0,{"$f":"('Sch E'!AL5)","v":"Ok"},"NHE_BedMCO","E-02-01","Medicare Certified only was indicated; provide number of beds."]
[0,{"$f":"('Sch E'!AL6)","v":"Ok"},"NHE_BedMCaidTC","E-02-02","Medicaid/TennCare Certified only was indicated; provide number of beds.  "]
[0,{"$f":"('Sch E'!AL7)","v":"Ok"},"NHE_BedMCareMTC","E-02-03","Medicare and Medicaid/TennCare Certified was indicated; provide number of beds."]
[0,{"$f":"('Sch E'!AL8)","v":"OK"},"NHE_BedNonCert","E-02-04","Non-Certified beds was indicated; provide number of beds."]
[0,{"$f":"('Sch E'!AL14)","v":"Ok"},"NHE_BedOpn1","E-02-05","Change in licensed bed count was indicated; provide additional data."]
[{"$f":"(NHA_StateID)","v":0},{"$f":"('Sch E'!AL19)","v":"Ok"},"MedicareEnterdate","E-02-06","Yes was indicated to Medicare enter program, provide approval date"]
[0,{"$f":"('Sch E'!AL21)","v":"Ok"},"MedicareWithEnterdate","E-02-07","Yes was indicated to Medicare end program, provide withdrawal date"]
[0,{"$f":"('Sch E'!AL26)","v":"Ok"},"NHE_EnterMTCdate","E-02-08","Entry into Medicaid/TennCare was indicated; provide additional data."]
[0,{"$f":"('Sch E'!AL28)","v":"Ok"},"NHE_WdrawMTCdate","E-02-09","Withdrawal from Medicaid/TennCare was indicated; provide additional data."]
[0,{"$f":"('Sch E'!AL30)","v":"Error"},"NHE_Private","E-02-10","Private room beds were indicated; provide additional data."]
[0,{"$f":"('Sch E'!AL31)","v":"Ok"},"NHE_SemiP","E-02-11","Semi-Private room beds were indicated; provide additional data."]
[0,{"$f":"('Sch E'!AL32)","v":"Ok"},"NHE_Wards","E-02-12","Ward room beds were indicated; provide additional data."]
[0,{"$f":"'Sch E'!AM22","v":"Error"},"NHE_MCarePNum","E-03-01","Please record Medicare provider number."]
[0,{"$f":"'Sch E'!AM22","v":"Error"},"NHE_MCaidTC1PNum","E-03-02","Please record Medicaid/TennCare provider number level I."]
[0,{"$f":"'Sch E'!AM23","v":"Error"},"NHE_MCaidTC2PNum","E-03-03","Please record Medicaid/TennCare provider number level II."]
[0,{"$f":"'Sch F-1'!AK6","v":"Ok"},"NHF1_Lev2Medicare_Admin","F1-01-01","Average Length of Medicare/Skilled Care:  Based on number of discharge days divided by discharges including deaths; the average length of stay is less than 1 day.  Re-calculate the discharge days according to instructions provided on the form."]
[0,{"$f":"'Sch F-1'!AK7","v":"Ok"},"NHF1_Lev2Admin","F1-01-02","Average Length of Stay Level II/Skilled Care:  Based on number of discharge days divided by discharges including deaths; the average length of stay is less than 1 day.  Re-calculate the discharge days according to instructions provided on the form."]
[0,{"$f":"'Sch F-1'!AK8","v":"Ok"},"NHF1_Lev1Admin","F1-01-03","Average Length of Stay Level I/Intermediate Care:  Based on number of discharge days divided by discharges including deaths; the average length of stay is less than 1 day.  Re-calculate the discharge days according to instructions provided on the form."]
[0,{"$f":"('Sch F-1'!AK27)","v":"Ok"},"NHF1_TransOther","F1-01-04","Admissions from another source was indicated; provide additional data."]
[0,{"$f":"('Sch F-1'!AK46)","v":"Ok"},"NHF1_TWFOtherSpec","F1-01-05","Discharges to other destinations was indicated; provide additional data."]
[0,{"$f":"('Sch F-1'!AM6)","v":"Error"},"NHF1_Lev2MedicareYN","F1-01-06","Level of Care in the Facility - Medicare -Skilled Care Yes or No"]
[0,{"$f":"('Sch F-1'!AM7)","v":"Error"},"NHF1_Lev2YN","F1-01-07","Level of Care in the Facility -Level II Skilled Care \"Non-Medicare\"  Yes or No"]
[0,{"$f":"('Sch F-1'!AM8)","v":"Error"},"NHF1_Lev1YN","F1-01-08","Level of Care in the Facility -Intermediate Care  Yes or No"]
[0,{"$f":"'Sch F-1'!AL6","v":"Ok"},"NHF1_Lev2Medicare_Admin","F1-02-01","Average Length of Medicare/Skilled Care:  Based on number of discharge days divided by discharges including deaths; the average length of stay is greater than four years.  Re-calculate the discharge days according to instructions provided on the form."]
[0,{"$f":"'Sch F-1'!AL7","v":"Ok"},"NHF1_Lev2Admin","F1-02-02","Average Length of Stay Level II/Skilled Care:  Based on number of discharge days divided by discharges including deaths; the average length of stay is greater than four years.  Re-calculate the discharge days according to instructions provided on the form."]
[0,{"$f":"'Sch F-1'!AL8","v":"Ok"},"NHF1_Lev1Admin","F1-02-03","Average Length of Stay Level I/Intermediate:  Based on number of discharge days divided by discharges including deaths; the average length of stay is greater than four years.  Re-calculate the discharge days according to instructions provided on the form."]
[0,{"$f":"('Sch F-1'!AL28)","v":"Ok"},"NHF1_Lev2Admin","F1-02-04","Level of Care in the facility Admissions total does not equal Source of Admissions total; check for accuracy."]
[0,{"$f":"'Sch F-1'!AL47","v":"Ok"},"NHF1_Lev2Admin","F1-02-05","Level of Care in the Facility: discharges (including deaths) minus deaths does not equal Discharge Destination total (not including deaths)."]
[0,{"$f":"('Sch F-2'!AK16)","v":"Error"},"NHF2_RDCMALev2","F2-01-01","Total Resident Days of Care Total is zero; provide additional data."]
[0,{"$f":"('Sch F-2'!AK32)","v":"Error"},"NHF2_U21WM","F2-01-02","Male and Female residents Total is zero; provide additional data."]
[0,{"$f":"('Sch F-2'!AK43)","v":"Error"},"NHF2_LSL100","F2-01-03","Length of Stay: Total residents is zero; provide additional data."]
[0,{"$f":"('Sch F-2'!AK78)","v":"Error"},"NHF2_TN01","F2-01-04","Patient Origin Total Residents is zero; provide additional data."]
[0,{"$f":"'Sch F-2'!AL11","v":"Error"},"NHF2_RDCMALev2","F2-02-01","Total resident days of care is less than 50% of estimated maximum occupancy rate (licensed beds x 365 days)."]
[0,{"$f":"'Sch F-2'!AL16","v":"Error"},"NHF2_RDCMALev2","F2-02-02","Total resident days of care is greater than 100% of estimated maximum occupancy rate (licensed beds x 365 days)."]
[0,{"$f":"'Sch F-2'!AL27","v":0},"NHF2_RDCMALev2","F2-02-03","Total Resident Days of Care is less than 50% of total staffed beds x 365 days per year."]
[0,{"$f":"'Sch F-2'!AL29","v":"Ok"},"NHF2_RDCMALev2","F2-02-04","Total Resident Days of Care is greater than 100% of total staffed beds x 365 days per year."]
[0,{"$f":"'Sch F-2'!AL80","v":"Ok"},"NHF2_LSL100","F2-02-05","Total number of residents does not match among these sections: length of stay; patient origin; check calculations."]
[0,{"$f":"('Sch G'!AK48)","v":"Ok"},"NHG_OthN1Specify","G-01-01","Data for Other Nurses line one was indicated; specify type of nurse. "]
[0,{"$f":"('Sch G'!AK50)","v":"Error"},"NHG_ConNYN","G-01-02","Indicate Yes or No to question concerning contract nursing personnel used by facility."]
[0,{"$f":"'Sch G'!AK58","v":"Error"},"NHG_3SRNDay","G-01-03","No nursing shift data was indicated; provide additional data."]
[0,{"$f":"('Sch G'!AL48)","v":"Ok"},"NHG_OthN2Specify","G-02-01","Data for Other Nurses line two was indicated; specify type of nurse. "]
[0,{"$f":"('Sch G'!AL51)","v":"Ok"},"NHG_ConRNEmp","G-02-02","Contract Nursing was indicated; provide additional data."]
[0,{"$f":"('Sch H'!AK4)","v":"Error"},"NHH_FinDataYN","H-01-01","Indicate Yes or No to question concerning Financial data reporting period."]
[0,{"$f":"('Sch H'!AK8)","v":"Error"},"NHH_FinDateBeg","H-01-02","Financial Begin Date is after the End Date; check dates."]
[0,{"$f":"('Sch H'!AK11)","v":"Ok"},"NHH_GMCGPC","H-01-03","Medicare Advantage Gross Patient Charges was omitted; provide data."]
[0,{"$f":"'Sch H'!AK12","v":"Ok"},"NHH_GOMCGPC","H-01-04","All Other Medicare  Gross Patient Charges was omitted; provide data. "]
[0,{"$f":"('Sch H'!AK13)","v":"Ok"},"NHH_GMMTCGPC","H-01-05","TennCare MCO Gross Patient Charges was omitted; provide data.  "]
[0,{"$f":"'Sch H'!AK14","v":"Ok"},"NHH_GMMTCGPC","H-01-06","All other Medicaid/TennCare Gross Patient Charges was omitted; provide data.  "]
[0,{"$f":"'Sch H'!AK15","v":"Ok"},"NHH_GVAGPC","H-01-07","VA Contract Gross Patient Charges was omitted; provide data.  "]
[0,{"$f":"('Sch H'!AK16)","v":"Ok"},"NHH_GOGGPC","H-01-08","Other Government Gross Patient Charges was omitted; provide data. "]
[0,{"$f":"'Sch H'!AK18","v":"Ok"},"NHH_CTATGPC","H-01-09","Access Tennessee Gross Patient Charges was omitted; provide data.  "]
[0,{"$f":"('Sch H'!AK20)","v":"Ok"},"NHH_NGSPGPC","H-01-10","Private Self-Pay Gross Patient Charges was omitted; provide data.  "]
[0,{"$f":"('Sch H'!AK21)","v":"Ok"},"NHH_NGInsGPS","H-01-11","Long Term Care Insurance Gross Patient Charges was omitted; provide data.  "]
[0,{"$f":"('Sch H'!AK22)","v":"Ok"},"NHH_NGOthGPC","H-01-12","Other Non-government Gross Patient Charges was omitted; provide data.  "]
[0,{"$f":"('Sch H'!AK25)","v":"Ok"},"NHH_OtherRev","H-01-13","Non-Patient Revenue was omitted; provide data.  "]
[0,{"$f":"'Sch H'!AK32","v":"Ok"},"NHH_Payroll","H-01-14","Payroll expenses were omitted; provide data.  "]
[0,{"$f":"'Sch H'!AK33","v":"Ok"},"NHH_Benefit","H-01-15","Benefits expenses were omitted; provide data."]
[0,{"$f":"'Sch H'!AK34","v":"Ok"},"NHH_OthOpExp","H-01-16","Other Operating expenses were omitted; provide data.  "]
[0,{"$f":"'Sch H'!AK35","v":"Ok"},"NHH_NonOpExp","H-01-17","Non-Operating expenses was omitted; provide data.  "]
[0,{"$f":"'Sch H'!AK40","v":"Error"},"NHH_CABOL","H-01-18","Building data was omitted; provide data."]
[0,{"$f":"'Sch H'!AK44","v":"Error"},"NHH_CAOIthSp","H-01-19","Other Assets data in not complete; provide data."]
[0,{"$f":"('Sch H'!AK49)","v":"ERROR"},"NHH_DCMSCYN","H-01-20","Indicate Yes or No to question concerning Medicare/Skilled Care."]
[0,{"$f":"('Sch H'!AK50)","v":"ERROR"},"NHH_DCMTCLevIIYN","H-01-21","Indicate Yes or No to question concerning Medicaid/TennCare Level II."]
[0,{"$f":"('Sch H'!AK51)","v":"ERROR"},"NHH_DCMTCLevIYN","H-01-22","Indicate Yes or No to question concerning Medicaid/TennCare Level I."]
[0,{"$f":"('Sch H'!AK52)","v":"ERROR"},"NHH_DCPriLevIIYN","H-01-23","Indicate Yes or No to question concerning Private Level II."]
[0,{"$f":"('Sch H'!AK53)","v":"ERROR"},"NHH_DCPriLevIYN","H-01-24","Indicate Yes or No to question concerning Private Level I."]
[0,{"$f":"('Sch H'!AK54)","v":"ERROR"},"NHH_DCSPLEVIIYN","H-01-25","Indicate Yes or No to question concerning Semi-Private Level II."]
[0,{"$f":"('Sch H'!AK55)","v":"ERROR"},"NHH_DCSPLevIYN","H-01-26","Indicate Yes or No to question concerning Semi-Private Level I."]
[0,{"$f":"('Sch H'!AK56)","v":"ERROR"},"NHH_DCWardLevIIYN","H-01-27","Indicate Yes or No to question concerning Ward Level II."]
[0,{"$f":"('Sch H'!AK57)","v":"ERROR"},"NHH_DCWardLevIYN","H-01-28","Indicate Yes or No to question concerning Ward Level I."]
[0,{"$f":"'Sch H'!AL9","v":"Error"},"NHH_FinDateBeg","H-02-01","Statistical Data and Financial Data reporting period different; check dates."]
[0,{"$f":"'Sch H'!AL11","v":"Ok"},"NHH_GMCRev","H-02-02","Medicare Advantage Adjustments to Revenue was omitted; provide data."]
[{"$f":"(NHA_StateID)","v":0},{"$f":"'Sch H'!AL12","v":"Ok"},"NHH_GOMCRev","H-02-03","All Other Medicare  Adjustments to Revenue was omitted; provide data. "]
[0,{"$f":"'Sch H'!AL13","v":"Ok"},"NHH_GMTCRev","H-02-04","TennCare MCO Adjustments to Revenue was omitted; provide data.  "]
[0,{"$f":"'Sch H'!AL14","v":"Ok"},"NHH_GMMTCRev","H-02-05","All other Medicaid/TennCare Adjustments to Revenue was omitted; provide data.  "]
[0,{"$f":"'Sch H'!AL15","v":"Ok"},"NHH_GVARev","H-02-06","VA Contract Adjustments to Revenue was omitted; provide data.  "]
[0,{"$f":"'Sch H'!AL16","v":"Ok"},"NHH_GOGRev","H-02-07","Other Government Adjustments to Revenue was omitted; provide data. "]
[0,{"$f":"'Sch H'!AL18","v":"Ok"},"NHH_CTATRev","H-02-08","Access Tennessee Adjustments to Revenue was omitted; provide data.  "]
[0,{"$f":"'Sch H'!AL20","v":"Ok"},"NHH_NGSPRev","H-02-09","Private Self-Pay Adjustments to Revenue was omitted; provide data.  "]
[0,{"$f":"'Sch H'!AL21","v":"Ok"},"NHH_NGinsRev","H-02-10","Long Term Care Insurance Adjustments to Revenue was omitted; provide data.  "]
[0,{"$f":"'Sch H'!AL22","v":"Ok"},"NHH_NGOthRev","H-02-11","Other Non-government Adjustments to Revenue was omitted; provide data.  "]
[0,{"$f":"'Sch H'!AL27","v":"Ok"},"NHH_BadDebt","H-02-12","Bad Debts Adjustment to Charges was omitted; provide data.  "]
[0,{"$f":"'Sch H'!AL28","v":"Ok"},"NHH_Charity","H-02-13","Charity Care Non-Government Adjustments was omitted; provide data.  "]
[0,{"$f":"'Sch H'!AL29","v":"Ok"},"NHH_OthAdj","H-02-14","Other Non-Government Adjustments was omitted; provide data.  "]
[0,{"$f":"'Sch H'!AL36","v":"Error"},"NHH_CABECost","H-02-15","Capital Assets Cost was omitted; provide data."]
[0,{"$f":"'Sch H'!AL40","v":"ERROR"},"NHH_CABEDepAc","H-02-16","Capital Assets Accumulated Depreciation was omitted; provide data.  "]
[0,{"$f":"'Sch H'!AL40","v":"ERROR"},"NHH_CABEOL","H-02-17","Equipment data was omitted; provide data."]
[0,{"$f":"'Sch H'!AL49","v":"Ok"},"NHH_DCMSC","H-02-18","Medicare/Skilled Care average daily charge default value of \"#\" was not changed.  "]
[0,{"$f":"'Sch H'!AL50","v":"Ok"},"NHH_DCMCLevII","H-02-19","Medicaid/TennCare Level II average daily charge default value of \"#\" was not changed.  "]
[0,{"$f":"'Sch H'!AL51","v":"Ok"},"NHH_DCMTCLevI","H-02-20","Medicaid/TennCare Level I average daily charge default value of \"#\" was not changed.  "]
[0,{"$f":"'Sch H'!AL52","v":"Ok"},"NHH_DCPRiLevII","H-02-21","Private Level II average daily charge default value of \"#\" was not changed.  "]
[0,{"$f":"'Sch H'!AL53","v":"Ok"},"NHH_DCPriLevI","H-02-22","Private Level I average daily charge default value of \"#\" was not changed.  "]
[0,{"$f":"'Sch H'!AL54","v":"Ok"},"NHH_DCSPLevII","H-02-23","Semi-Private Level II average daily charge default value of \"#\" was not changed.  "]
[0,{"$f":"'Sch H'!AL55","v":"Ok"},"NHH_DCSPLevI","H-02-24","Semi-Private Level I average daily charge default value of \"#\" was not changed.  "]
[0,{"$f":"'Sch H'!AL56","v":"Ok"},"NHH_DCWardLevII","H-02-25","Ward Level II average daily charge default value of \"#\" was not changed.  "]
[0,{"$f":"'Sch H'!AL57","v":"Ok"},"NHH_DCWardLevI","H-02-26","Ward Level I average daily charge default value of \"#\" was not changed.  "]
[0,{"$f":"'Sch H'!AM12","v":"Ok"},"NHH_GMCRev","H-03-01","Medicare Advantage Adjustment to Revenue was omitted; provide data."]
[0,{"$f":"'Sch H'!AM12","v":"Ok"},"NHH_GOMCRev","H-03-02","All Other Medicare Adjustment to Revenue was omitted; provide data. "]
[0,{"$f":"'Sch H'!AM13","v":"Ok"},"NHH_GMTCRev","H-03-03","TennCare MCO Adjustment to Revenue was omitted; provide data.  "]
[0,{"$f":"'Sch H'!AM14","v":"Ok"},"NHH_GMMTCRev","H-03-04","All other Medicaid/TennCare Adjustment to Revenue was omitted; provide data.  "]
[0,{"$f":"'Sch H'!AM15","v":"Ok"},"NHH_GTotRev","H-03-05","VA Contract Adjustment to Revenue was omitted; provide data. "]
[0,{"$f":"'Sch H'!AM16","v":"Ok"},"NHH_GOGRev","H-03-06","Other Government Adjustment to Revenue was omitted; provide data. "]
[0,{"$f":"'Sch H'!AM18","v":"Ok"},"NHH_CTATRev","H-03-07","Access Tennessee Adjustment to Revenue was omitted; provide data. "]
[0,{"$f":"('Sch H'!AM20)","v":"Ok"},"NHH_NGSPRev","H-03-08","Private Self-Pay Adjustment to Revenue was omitted; provide data.  "]
[0,{"$f":"'Sch H'!AM21","v":"Ok"},"NHH_NGinsRev","H-03-09","Long Term Care Insurance Adjustment to Revenue was omitted; provide data.  "]
[0,{"$f":"'Sch H'!AM22","v":"Ok"},"NHH_NGOthRev","H-03-10","Other Non-government Adjustment to Revenue was omitted; provide data.  "]
[0,{"$f":"'Sch H'!AM41","v":"Error"},"NHH_CABOL","H-03-11","Building Own or Lease data was omitted; provide data."]
[0,{"$f":"'Sch H'!AM43","v":"Error"},"NHH_CABEOL","H-03-12","Equipment Own or Lease data was ommited;provide data. "]
[0,{"$f":"'Sch H'!AM49","v":"ERROR"},"NHH_GMCRev","H-03-13","Medicare/Skilled Care average daily charge was indicated; provide data.  "]
[0,{"$f":"'Sch H'!AM50","v":"ERROR"},"NHH_GOMCRev","H-03-14","Medicaid/TennCare Level II average daily charge was indicated; provide data.  "]
[0,{"$f":"'Sch H'!AM51","v":"ERROR"},"NHH_GMTCRev","H-03-15","Medicaid/TennCare Level I average daily charge was indicated; provide data.  "]
[0,{"$f":"'Sch H'!AM52","v":"ERROR"},"NHH_GMMTCRev","H-03-16","Private Level II average daily charge was indicated; provide data.  "]
[0,{"$f":"'Sch H'!AM53","v":"ERROR"},"NHH_GTotRev","H-03-17","Private Level I average daily charge was indicated; provide data.  "]
[0,{"$f":"'Sch H'!AM54","v":"ERROR"},"NHH_GOGRev","H-03-18","Semi-Private Level II average daily charge was indicated; provide data.  "]
[0,{"$f":"'Sch H'!AM55","v":"ERROR"},"NHH_CTATRev","H-03-19","Semi-Private Level I average daily charge was indicated; provide data.  "]
[0,{"$f":"'Sch H'!AM56","v":"ERROR"},"NHH_NGSPRev","H-03-20","Ward Level II average daily charge was indicated; provide data.  "]
[0,{"$f":"'Sch H'!AM57","v":"ERROR"},"NHH_NGinsRev","H-03-21","Ward Level I average daily charge was indicated; provide data.  "]
[0,{"$f":"'Sch H'!AM60","v":"Ok"},"NHH_NGOthRev","H-03-22","Daily charges over $2000 were indicated; check for accuracy.  "]
[0,{"$f":"('Adm Dec'!AK7)","v":"Error"},"NHAD_AdmDec","NHAD-02-01","Administrator's Declaration was not indicated."]
[0,{"$f":"('Adm Dec'!AL7)","v":"Error"},"NHAD_AdmDecDate","NHAD-02-02","Administrator's Declaration Date was not indicated; provide date."]
["Return to Main Menu"]

{"sheet":"Adm Dec","index":27,"n_rows":13,"n_cols":40,"rows_kept":13,"cut":false,"hidden":false,"merged":[[0,36,0,38],[1,9,1,14],[2,0,2,35],[1,0,1,3],[0,0,0,35],[1,15,1,32],[1,4,1,8],[1,33,1,35],[3,0,3,1],[3,2,3,35],[4,0,4,1],[8,0,8,35],[6,0,6,8],[7,0,7,35],[4,2,4,35],[6,9,6,21],[5,0,5,5],[5,6,5,8],[5,9,5,35]]}
["2018 - NURSING HOMES - PROVISIONAL",null,null,null,null,null,null,null,null,null,null,null,null,null,null,null,null,null,null,null,null,null,null,null,null,null,null,null,null,null,null,null,null,null,null,null,"'OK' = Likely no Error\n'Error\" = Maybe Error\nin data provided"]
["State ID:",null,null,null,{"$f":"NHA_StateID","v":0},null,null,null,null,"Facility Name:",null,null,null,null,null,{"$f":"NHA_Name","v":"-"},null,null,null,null,null,null,null,null,null,null,null,null,null,null,null,null,null,2018]
["Tennessee Joint Annual Report of Nursing Homes - Administrator's Declaration"]
["Yes,",null,"  I have  Saved and Renamed the report with our Facility State ID# and Facility name as previously instructed. \n Example:  State ID # 00000  Your Facility Name _JAR_NH_2017\"",null,null,null,null,null,null,null,null,null,null,null,null,null,null,null,null,null,null,null,null,null,null,null,null,null,null,null,null,null,null,null,null,null,null,null,null,"Yes"]
["Yes,",null," I have Checked and Corrected all Errors on the Error Tab and provided an Explantion for all Uncorrected Errors. ",null,null,null,null,null,null,null,null,null,null,null,null,null,null,null,null,null,null,null,null,null,null,null,null,null,null,null,null,null,null,null,null,null,null,null,null,"No"]
["Administrator's Declaration",null,null,null,null,null,"-",null,null,"I, the administrator, declare that I have examined this report and to the best of my \nknowledge and belief, it is true, correct, and complete.",null,null,null,null,null,null,null,null,null,null,null,null,null,null,null,null,null,null,null,null,null,null,null,null,null,null,"Admin\nDec","Date"]
["DATE ACKNOWLEDGED",null,null,null,null,null,null,null,null,{"$f":"IF(NHAD_AdmDec=\"X\",IF(NHAD_AdmDecDate=\"\",NOW(),NHAD_AdmDecDate),\"\")","v":""},null,null,null,null,null,null,null,null,null,null,null,null,null,null,null,null,null,null,null,null,null,null,null,null,null,null,{"$f":"IF(NHAD_AdmDec=\"X\",\"Ok\",\"Error\")","v":"Error"},{"$f":"IF(NHAD_AdmDec=\"x\",\"Ok\",\"Error\")","v":"Error"}]
[]
["Go to Error Listing"]
[""]
[""]
[""]
[""]

{"sheet":"Dec-Data","index":28,"n_rows":4,"n_cols":22,"rows_kept":4,"cut":false,"hidden":true,"merged":[]}
["Facility ID Info",null,null,"Administrator's"]
[null,null,null,"Declaration"]
["State ID","NH Name","County","Yes/No","Date","","","","","","","","","","","","","","","","",""]
[{"$f":"NHA_StateID","v":0},{"$f":"NHA_Name","v":"-"},{"$f":"NHA_County","v":"-"},{"$f":"NHAD_AdmDec","v":"-"},{"$f":"NHAD_AdmDecDate","v":""}]

{"sheet":"Appendix A","index":29,"n_rows":38,"n_cols":25,"rows_kept":38,"cut":false,"hidden":false,"merged":[[31,0,31,11],[37,0,37,35],[31,24,31,35],[32,12,32,35],[36,0,36,11],[33,12,33,35],[32,0,32,11],[36,24,36,35],[35,24,35,35],[36,12,36,23],[31,12,31,23],[35,12,35,23],[34,24,34,35],[34,12,34,23],[33,0,33,11],[34,0,34,11],[35,0,35,11],[26,24,26,35],[27,12,27,23],[27,24,27,35],[27,0,27,11],[30,24,30,35],[29,24,29,35],[28,24,28,35],[26,0,26,11],[26,12,26,23],[28,12,28,23],[28,0,28,11],[30,0,30,11],[29,12,29,23],[30,12,30,23],[29,0,29,11],[21,12,21,23],[21,24,21,35],[22,12,22,23],[22,24,22,35],[25,0,25,11],[25,24,25,35],[21,0,21,11],[22,0,22,11],[23,0,23,11],[24,24,24,35],[23,12,23,23],[23,24,23,35],[24,12,24,23],[25,12,25,23],[24,0,24,11],[19,0,19,11],[19,12,19,23],[19,24,19,35],[20,0,20,11],[20,12,20,23],[20,24,20,35],[18,0,18,11],[18,12,18,35],[17,0,17,35],[15,0,15,11],[15,12,15,23],[15,24,15,35],[16,0,16,11],[16,12,16,23],[16,24,16,35],[13,0,13,11],[13,12,13,23],[13,24,13,35],[14,0,14,11],[14,12,14,23],[14,24,14,35],[11,0,11,11],[11,12,11,23],[11,24,11,35],[12,0,12,11],[12,12,12,23],[12,24,12,35],[9,0,9,11],[9,12,9,23],[9,24,9,35],[10,0,10,11],[10,12,10,23],[10,24,10,35],[7,0,7,11],[7,12,7,23],[7,24,7,35],[8,0,8,11],[8,12,8,23],[8,24,8,35],[5,0,5,11],[5,12,5,23],[5,24,5,35],[6,0,6,11],[6,12,6,23],[6,24,6,35],[0,0,0,35],[4,0,4,11],[4,12,4,23],[4,24,4,35],[1,0,1,35],[2,0,2,35],[3,0,3,11],[3,12,3,35]]}
["PROVISIONAL Nursing Homes PROVISIONAL"]
["Appendix A: Commonly Prescribed medications by Category by Brand (Generic)"]
["This list includes examples of anti-anxiety, anti-depressants, anti-psychotics, diuretics and hypnotics (brand name \nand generic equivalents) likely to be used in a nursing facility population.  This list is not inclusive;  consult your \npharmacist, the resident’s physician, or a drug reference manual, as necessary.  Medications are listed as Brand \n(Generic). "]
["Antianziety",null,null,null,null,null,null,null,null,null,null,null,"Antidepressants"]
["Atarax (Hydroxyzine)",null,null,null,null,null,null,null,null,null,null,null,"Asendin (Amoxapine)",null,null,null,null,null,null,null,null,null,null,null,"Norpramin (Desipramine)"]
["Ativan (Lorazepam)",null,null,null,null,null,null,null,null,null,null,null,"Asimia (Paroxetine Mesylate)",null,null,null,null,null,null,null,null,null,null,null,"Pamelor (Nortriptyline)"]
["Buspar (Buspirone)",null,null,null,null,null,null,null,null,null,null,null,"Aventyl, Pamelor (Nortriptyline)",null,null,null,null,null,null,null,null,null,null,null,"Parnate (Tranylcypromine)"]
["Centrax (Prazepam)",null,null,null,null,null,null,null,null,null,null,null,"Celexa (Citalopram Hydrobromide)",null,null,null,null,null,null,null,null,null,null,null,"Paxil (Paroxetine Hydrochloride)"]
["Equanil, Miltown (Meprobamate)",null,null,null,null,null,null,null,null,null,null,null,"Citalopram ODT (Citalopram)",null,null,null,null,null,null,null,null,null,null,null,"Pexeva (Paroxetine Mesylate)"]
["Librium (Chlordiazepoxide)",null,null,null,null,null,null,null,null,null,null,null,"Cymbalta (Duloxetine)",null,null,null,null,null,null,null,null,null,null,null,"Prozac (Fluoxetine)"]
["Noctec (Chloral Hydrate)",null,null,null,null,null,null,null,null,null,null,null,"Desyrel (Trazodone)",null,null,null,null,null,null,null,null,null,null,null,"Remeron Soltab (Mirtazapine)"]
["(Phenobarbital)",null,null,null,null,null,null,null,null,null,null,null,"Elavil (Amitriptyline)",null,null,null,null,null,null,null,null,null,null,null,"Serzone (Nefazodone)"]
["Tranxene (Clorazepate)",null,null,null,null,null,null,null,null,null,null,null,"Etrafon (Perphenazine & Amitriptyline)",null,null,null,null,null,null,null,null,null,null,null,"Sinequan (Doxepin)"]
["Valium (Diazepam)",null,null,null,null,null,null,null,null,null,null,null,"Lexapro (Escitalopram Oxalate)",null,null,null,null,null,null,null,null,null,null,null,"Surmontil (Trimipramine)"]
["Vistaril (Hydroxyzine)",null,null,null,null,null,null,null,null,null,null,null,"Lithonate, Lithane (Lithium)",null,null,null,null,null,null,null,null,null,null,null,"Tofranil (Imipramine)"]
["Xanax (Alprazolam)",null,null,null,null,null,null,null,null,null,null,null,"Marplan (Isocarboxazid)",null,null,null,null,null,null,null,null,null,null,null,"Wellbutrin (Bupropion)"]
["",null,null,null,null,null,null,null,null,null,null,null,"Nardil (Phenelzine)",null,null,null,null,null,null,null,null,null,null,null,"Zoloft (Sertraline)"]
[""]
["Antipsychotics",null,null,null,null,null,null,null,null,null,null,null,"Diuretics"]
["Clozaril (Clozapine)             ",null,null,null,null,null,null,null,null,null,null,null,"Aldactazide (Spironolactone/hydrochlorothiazide)",null,null,null,null,null,null,null,null,null,null,null,"Hydrodiuril (Hydrochlorothiazide)"]
["Haldol (Haloperidol)",null,null,null,null,null,null,null,null,null,null,null,"Aldactone (Spironolactone)",null,null,null,null,null,null,null,null,null,null,null,"Hydromox (Quinethazone)"]
["Inapsine (Droperidol)",null,null,null,null,null,null,null,null,null,null,null,"Aquatensen (Methyclothiazide)",null,null,null,null,null,null,null,null,null,null,null,"Hygroton (Chlorthalidone)"]
["Loxitane (Loxapine)",null,null,null,null,null,null,null,null,null,null,null,"Bumex (Bumetanide)",null,null,null,null,null,null,null,null,null,null,null,"Lasix (Furosemide)"]
["Mellaril (Thioridazine)",null,null,null,null,null,null,null,null,null,null,null,"Demadex (Torsemide)",null,null,null,null,null,null,null,null,null,null,null,"Lozol (Indapamide)"]
["Moban (Molindone)",null,null,null,null,null,null,null,null,null,null,null,"Diamox (Acetazolamide)",null,null,null,null,null,null,null,null,null,null,null,"Mannitol (Mannitol)"]
["Navane (Thiothizene)",null,null,null,null,null,null,null,null,null,null,null,"Diucardin (Hydroflumethiazide)",null,null,null,null,null,null,null,null,null,null,null,"Maxzide (Triameterene/hydrochlorothiazide)"]
["Orap (Pimozide)",null,null,null,null,null,null,null,null,null,null,null,"Diuril (Chlorothiazide)",null,null,null,null,null,null,null,null,null,null,null,"Midamor (Amiloride)"]
["Prolixin (Fluphenzaine)",null,null,null,null,null,null,null,null,null,null,null,"Dyazide (Triamterene/hydrochlorothiazide)",null,null,null,null,null,null,null,null,null,null,null,"Moduretic (Amiloride HC1/hydrochlorothiazide)"]
["Risperdal (Risperidone)",null,null,null,null,null,null,null,null,null,null,null,"Dyrenium (Triamterene)",null,null,null,null,null,null,null,null,null,null,null,"Mykrox (Metolazone)"]
["Serentil (Mesoridazine)",null,null,null,null,null,null,null,null,null,null,null,"Edecrin (Ethacrynic Acid)",null,null,null,null,null,null,null,null,null,null,null,"Neptazane (Methazolamide)"]
["Seroquel (Aquetiapine Fumarate)",null,null,null,null,null,null,null,null,null,null,null,"Enduron (Methyclothiazide)",null,null,null,null,null,null,null,null,null,null,null,"Oretic (Hydrochlorothiazide)"]
["Stelazine (Trifluoperazine)",null,null,null,null,null,null,null,null,null,null,null,"Esidrix (Hydrochlorothiazide)",null,null,null,null,null,null,null,null,null,null,null,"Zaroxolyn (Metolazone)"]
["Taractan (Chlorprothixene)"]
["Thorazine (Chlorpromazine",null,null,null,null,null,null,null,null,null,null,null,"Hypnotics"]
["Trilafon (Perphenazine)",null,null,null,null,null,null,null,null,null,null,null,"Dalmane (Flurazepam)",null,null,null,null,null,null,null,null,null,null,null,"ProSom (Estazolam)"]
["Zyprexa (Olanzapine)",null,null,null,null,null,null,null,null,null,null,null,"Halcion (Triazolam)",null,null,null,null,null,null,null,null,null,null,null,"Restoril (Temazepam)"]
["",null,null,null,null,null,null,null,null,null,null,null,"Nembutal (Pentobarbital)"]
["Return to Main menu"]

{"sheet":"Appendix B","index":30,"n_rows":10,"n_cols":36,"rows_kept":10,"cut":false,"hidden":false,"merged":[[0,0,0,35],[4,0,4,35],[1,0,1,35],[2,0,2,4],[2,5,2,35],[3,0,3,4],[3,5,3,35]]}
["PROVISIONAL Nursing Homes PROVISIONAL"]
["Appendix B: Definitions"]
["Bad Debt",null,null,null,null,"(1) Bad debts are amounts considered to be uncollectible from accounts and notes receivable which \nare created or acquired in providing services. \"Accounts receivable\" and \"notes receivable\" are \ndesignations for claims arising from rendering services and are collectible in money in the relatively \nnear future.\n(A) A debt must meet these criteria: (i) The provider must be able to establish that reasonable \ncollection efforts were made. (ii) The debt was actually uncollectible when claimed as worthless. \n(iii) Sound business judgment established that there was no likelihood of recovery at any time in the \nfuture.  (iv) Accounts turned over to a collection agency should be classified as bad debt.\n(B) If after reasonable and customary attempts to collect a bill, the debt remains unpaid more than \none hundred twenty (120) days from the date the first bill is mailed to the patient, the debt may be \ndeemed uncollectible. Bankrupt accounts shall be considered bad debts, unless there is \ndocumented evidence that the medical bill caused bankruptcy. Such accounts would then be \ncounted as charity."]
["Charity\nCare",null,null,null,null,"(2) Charity care is reductions in charges made by the provider of services because of the indigence \nor medical indigence of the patient. The provider should apply the following guidelines for making a \ndetermination of indigence or medical indigence:\n(A) The patient's indigence must be determined by the provider, not by the patient; i.e., a patient's\nsigned declaration of his inability to pay his medical bills cannot be considered proof of indigence;\n(B) The provider should take into account a patient's total resources which would include, but are not \nlimited to, an analysis of assets (only those convertible to cash and unnecessary for the patient's \ndaily living), liabilities, and income and expenses. Indigence income means an amount not to exceed \none hundred percent (100%) of the federal poverty guidelines. Medical indigence is a status reached \nwhen a person uses or commits all available current and expected resources to pay for medical bills \nand is not limited to a defined percent of the federal poverty guidelines. In making this analysis the \nprovider should take into account any extenuating circumstances that would affect the determination \nof the patient's indigence;\n(C) The provider must determine that no source other than the patient would be legally responsible\nfor  the patient's medical bill; e.g., Title XIX, local welfare agency and guardian; and \n(D) The patient's file should contain documentation of the method by which indigence was \ndetermined in addition to all backup information to substantiate the determination.\n(E) Once indigence is determined and the provider concludes that there had been no improvement in \nthe beneficiary's financial condition, the debt may be deemed uncollectible without applying the bad \ndebt collection criteria."]
["Return to Main Menu"]
[""]
[""]
[""]
[""]
["","","","","","","","","","","","","","","","","","","","","","","","","","","","","","","","","","","",""]

{"sheet":"Tips","index":31,"n_rows":211,"n_cols":4,"rows_kept":211,"cut":false,"hidden":false,"merged":[[161,1,161,18],[3,1,3,12],[4,1,4,12]]}
[]
[]
[]
[null,"TENNESSEE JOINT ANNUAL REPORT OF NURSING HOMES"]
[null,"2018 General Information and Tips to Avoid Common Errors "]
[]
[null,"The following guidelines are written to assist you to complete the 2018 Joint Annual Report Nursing Home for the "]
[null,"reporting year."]
[]
[null,"A.","Please read all information carefully before completing your Joint Annual Report form."]
[]
[null,"B.","Please complete all items on the Excel data entry form.  "]
[]
[null,null,"1.","No schedule should be left with all blank fields."]
[null,null,"2.","Check all computations, especially where totals are required.  Notice that all totals are "]
[null,null,null,"system calculated (represented by green cells)."]
[null,null,"3.","Use 0 (zero) only in Schedule H (financial); on all other schedules, zero is not required."]
[null,null,"4.","If the value of an item is unknown, leave the item blank."]
[null,null,"5.","Please provide the appropriate answer to all Yes or No questions.  If you mistakenly "]
[null,null,null,"enter something into a Yes/No box that causes the error message:"]
[null,null,null,"\"You did not select Yes or No\" and the system provides you with the options \"Retry\" and"]
[null,null,null,"\"Cancel, \" click on the \"Cancel\" section to be able to change your answer to either \"Yes\" or "]
[null,null,null,"\"No.\""]
[null,null,"6.","Use the drop down boxes when available."]
[null,null,"7.","If you find that you cannot change the data to eliminate the \"Error\" message, you can type your "]
[null,null,null,"comment on the \"Error Sheet\" in the last column. "]
[null,null,null,"Please submit on a separate sheet the errors so I can expedite the query process.  "]
[]
[null,"C.","Items which appear to be inconsistent will be queried.  "]
[null,null,"Facilities will be reported to the Board for Licensing Health Care Facilities for failure to file a "]
[null,null,"report and failure to respond to queries."]
[]
[null,"SCHEDULE A - IDENTIFICATION"]
[]
[null,"There is a tab named \"State ID\" that shows the state id, license number, facility names and addresses for your information.   "]
[null,"Please look up the state id and the name of your facility. Place the state id in Schedule A and the information will populate at the top of each schedule, as well as the complete address information.  "]
[null,"The mailing address will populate if same as street address question is answered \"Yes\".  "]
[null,"The email address is an excellent tool for communications.  "]
[]
[null,"Reporting Period:  All facilities are requested to report data based on the twelve month period from January 1, 2018 to December 31, 2018. "]
[null,"This reporting period shows as the default in the field.  If unable to report based on this twelve month period, type in the beginning and ending dates for the reporting period."]
[]
[null,"SCHEDULE B - ORGANIZATION STRUCTURE"]
[]
[null,"Fill out the owner name and address. "]
[]
[null,"For type of owner, choose one and only one from the list of choices.  "]
[null,"Consult https://tnbear.tn.gov/Ecommerce/FilingSearch.aspx  if you have any questions."]
[]
[null,"If the facility is managed by the owner, fill out all fields matching owner fields at the top of Schedule B.  In the managed by fields check one and fill out the name and address in the appropriate fields.  "]
[null,"If you check \"contract with firm or other,\" be sure to type in the correct management company.  "]
[]
[null,"SCHEDULE C - LICENSURE, ACCREDITATIONS, AND MEMBERSHIPS"]
[]
[null,"Fill in facility license number which you can find on the tab marked \"State ID\" for reference.  Fill in the most recent survey date with mm/dd/yyyy format.  "]
[null,"Survey date field has been extended in case the facility survey was done at a later date.  Answer all \"Yes\" or \"No\" boxes."]
[]
[null,"SCHEDULE D - FACILITIES AND SERVICES - PART 1 "]
[]
[null,"The Certificate of Need dates of approval have been extended from 2007 through 2018 in order to accommodate dates.  "]
[null,"Fill in appropriate boxes and answer \"Yes\" or \"No\" to all services and number of units or beds if applicable.  "]
[]
[null,"SCHEDULE D - FACILITIES AND SERVICES - PART 2"]
[]
[null,"Fill in appropriate boxes and answer \"Yes\" or \"No\" to all services.  "]
[null,"If you check \"Yes\" to occupational therapy, physical therapy or respiratory therapy, be sure to enter the number of employees in Schedule G.   Do not put in zeros.  "]
[]
[null,"SCHEDULE D - FACILITIES AND SERVICES - PART 3"]
[]
[null,"This schedule is called \"Home and Community Based Services Waiver Program.\" "]
[null,"If you check \"Yes\" to the first question, then follow through to answer all of the questions in that schedule.  If you check \"No\", you do not have to answer any other question in this schedule."]
[]
[null,"SCHEDULE E - BEDS"]
[]
[null,"Fill out completely.  Totals for licensed beds and beds set up and staffed will be calculated by the system.  "]
[null,"Licensed Beds are the maximum number of beds that are certified or non-certified and licensed by the Health Care Facilities.  "]
[null,"Staffed Beds are beds set up and staffed in the facility that have nursing staff available or could have nursing staff available if needed for admission of a patient. "]
[]
[null,"Fill out provider numbers for Medicare, Medicaid/TennCare Level II or Medicaid/TennCare Level I if applicable."]
[]
[null,"SCHEDULE F - UTILIZATION - PART 1"]
[]
[null,"Fill out completely.  Totals for the \"level of care in the facility\" section will be calculated by the system.  "]
[null,"Definitions to be used for level of care section:  Admissions are the number of all residents admitted to the facility during the reporting period. "]
[null,"Discharges include all residents discharged from the facility during the reporting period, including those who died during their stay.  "]
[null,"Transferring a resident from one level of care to another level of care within the facility is counted as a discharge and admission."]
[]
[null,"Definition of discharge resident days:  The total number of discharge resident days of care rendered to residents who were discharged or died during the reporting period.  "]
[null,"This figure should include days of care rendered to those residents admitted prior to the beginning of the reporting period. "]
[null,"For example:  a resident admitted on 01-01-2009 and discharged on 06-30-2010 would produce 546 resident discharge days.  "]
[null,"Below is a website that will give you a quick calculation of the number of days between admission and discharge date for each of your discharged residents: "]
[null,"http://www.timeanddate.com/date/timeduration.html "]
[]
[null,"The Average Length of Stay for Level II, Level I, and the total of all residents is calculated by the system based on discharge days and discharges including deaths.  For example,"]
[]
[null,"Total Discharge Resident Days    =      3,178      =     227 days (average length of stay)"]
[null,"Total Discharges including deaths           14"]
[]
[null,"This indicates the facility had 14 discharges or deaths during the reporting period. The average patient stayed approximately 227 days, or approximately 7 months, before discharge or death. "]
[null,"If very low numbers or very high numbers are obtained for the Average Length of Stay, it probably means that the Discharge Days have not been calculated correctly."]
[]
[null,"Four possible errors will appear if the calculated length of stay for either Level I or Level II is less than 90 days or greater than four years.  "]
[null,"If the average length of stay is reasonable to you but results in an error message, provide an explanation in the comments column of Excel's Error Sheet."]
[]
[null,"SCHEDULE F - UTILIZATION - PART 2"]
[]
[null,"Definition of Resident Days of Care:  The total amount of resident days of care is the number of days the resident stayed there for the reporting period only. "]
[null,"For example, if a resident came in 01-01-2013 and left 06-30-2013, the total days would be 180 days.  "]
[null,"If a resident stays all year, it would be 365 days.  If the resident days are not calculated correctly, then the following errors will pop up in the schedule."]
[]
[null,"1.","Total Resident Days of Care Total is zero; provide additional data."]
[null,"2.","Low percentage of occupancy compared to total licensed beds (see top of Schedule E) "]
[null,null,"would be total resident days of care are less than 50% of estimated maximum occupancy rate (licensed beds x 365 days). "]
[null,"3.","High percentage of occupancy would be total resident days of care are greater than 100% of estimated maximum occupancy rate (licensed beds x 365 days)."]
[null,"4.","Low percentage of occupancy compared to total staffed beds (see bottom of Schedule E).  would be total resident days of care is less than 50% of total staffed beds x 365  days per year.  "]
[null,"5.","High percentage of occupancy would be total resident days of care is greater than 100% of total staffed beds x 365 days per year."]
[]
[null,"These errors will be reviewed during the edit process. The data will be queried in a follow-up letter if an error is detected and there is no reasonable explanation recorded in the Error Sheet. "]
[null,"The totals are system calculated.  "]
[]
[null,"Zeros are not needed in Age, Race and Gender Section or the Patient Origin Section (this is an exception to the rule.)  "]
[null,"Be sure that the system calculated total of the number of residents match between the Length of Stay section and the Age, Race and Gender section.  "]
[null,"Both sections are based on the number of residents served during the entire reporting period.  "]
[]
[null,"The Patient Origin section asks for information for only those residents in the facility on the last day of the reporting period.  Be careful to put the numbers in the right county.  "]
[null,"For example, if your facility is located in Knox County then most of the residents will be from that county; however,"]
[null,"the next county down on the sheet is Lake County and that is located in the West Region of Tennessee.  Please do not put a number in Lake County by mistake."]
[]
[null,"Length of Stay Total (line 44) should equal Total Residents (line 84)."]
[]
[null,"SCHEDULE G - PERSONNEL"]
[]
[null,"Indicate the number of personnel as of September 30.  Do not include a type of employee for which you do not provide that type of service. "]
[null,"The number of full time personnel should be represented by whole numbers.  Enter FTEs rounded to two decimal places for part-time personnel."]
[]
[null,"The sections on Nurses, Contract Nursing Personnel and Nursing by shifts should be filled out if possible.  "]
[null,"Record nurses working on September 30 according to the staffing patterns of two or three shifts per day.  If both patterns are used in the facility, please indicate both types."]
[]
[null,"SCHEDULE H - FINANCIAL DATA"]
[]
[null,"Please note:  This reporting period should be consistent with the reporting period listed in Schedule A of this report.  "]
[]
[null,"Read the shaded instruction boxes carefully.  All numbers should be entered as whole numbers to the nearest dollar.  "]
[]
[null,"Patient Revenue:  Please do not leave anything blank, put in zeros where applicable. "]
[]
[null,"Gross Patient Revenue (Charges): This represents the sum of all charges for services rendered to patients during the reporting year at the facility's established rate."]
[]
[null,"Adjustments to Revenue (Charges): Adjustments to revenue that decrease revenue should be entered as a positive number.  "]
[null,"This represents the amount of reduction of gross patient charges (revenue) due to contractual allowances, bad debt, charity care, etc."]
[]
[null,"Adjustment to Charges:  If you put in zeros for bad debt, charity or other, make sure it is accurate data."]
[]
[null,"Expenses:  Fill in the appropriate boxes excluding depreciation. All numbers should be entered as whole numbers to the nearest dollar."]
[]
[null,"Capital Assets:  Indicate if you own or lease your building and equipment as indicated.  Report capital assets recorded on the balance sheet at the end of the reporting period.  "]
[null,"See shaded instruction box.  There is a system calculation for the Net Book Value (cost minus accumulated). "]
[]
[null,"Daily Charge:  Please indicate your daily charge for each category.  The daily charge should be based on charges for all services, not just the room and board charge."]
[]
[]
[null,"BAD DEBT"]
[]
[null,"(1) Bad debs are amounts considered to be uncollectible from accounts and notes receivable which are created or acquired in providing services.  \"Accounts Receivable\" and "]
[null,"\"Notes Receivable\" are designations for claims arising from rendering services and are collectible in money in the relatively near future."]
[]
[null,"(A)  A debt must meet these criteria:  i)  The provider must be able to establish that reasonable collection efforts were made.  (ii)  The debt was actually uncollectible when"]
[null,"claimed as worthless.  (iii)  Sound business judgement established that there were no likelihood of recovery at any time in the future.  (iv)  Accounts turned over to a collection"]
[null,"agency should be classified as bad debt."]
[]
[null,"(B)  If after reasonable and customary attempts to collect a bill, the debt remains unpaid more than one hundred twenty (120) days from the date the first bill is mailed to the"]
[null,"patient, the debt may be deemed uncollectible.  Bankrupt accounts shall be considered bad debts, unless there is documented evidence that the medical bill caused bankruptcy."]
[null,"Such accounts would then be counted as charity."]
[]
[]
[null,"CHARITY CARE"]
[]
[null,"(2)  Charity care is reductions charges made by the provider of services because of the indigence or medical indigence of the patient.  The provider should apply the following guidelines"]
[null,"for making a determination of indigence or medical indigence:"]
[]
[null,"(A)  The patient's indigence must be determined by the provider, not by the patient, i.e., a patient's signed declaration of his inability to pay his medical bills cannot be considered proof "]
[null,"of indigence."]
[]
[null,"(B)  The provider should take into account a patient's total resources which would include, but are not limited to, an analysis of assets (only those convertible to cash and unnecessary for "]
[null,"the patient's  daily living), liabilities, and income and expenses.  Indigence income means an amount not to exceed one hundred percent (100%) of the federal poverty guidelines. "]
[null,"Medical indigence is a status reached when a person uses or commits all available current and expected resources to pay for medical bills and is not limited to a defined percent of the"]
[null,"federal poverty guidelines.  In making this analysis the provider should take into account any extenuating circumstances that would affect the determination of the patient's indigence."]
[]
[null,"(C) The provider must determine that no source otter than the patient would be legally responsible for the patient's medical bill, e.g., Title XIX, local welfare agency and guardian, and"]
[]
[null,"(D)  The patient's file should contain documentation of the method by which indigence was determined in addition to all backup information to substantiate the determination."]
[]
[null,"(E)  Once indigence is determined and the provider concludes that there had been no improvement in the beneficiary's financial condition, the debt may be deemed  uncollectible without"]
[null,"applying the bad debt collection criteria."]
[]
[]
[null,"ERROR TAB"]
[]
[null,"Use the Error Tab at the bottom right of the Excel form to identify and correct possible problems with your data. "]
[null,"The Error sheet will list \"Ok\" or \"Error\", along with the Error location and the Error message.  "]
[]
[null,"ADMINISTRATOR'S DECLARATION"]
[null,"Once the Errors have been corrected, proceed to the Adm Dec Tab.  Acknowledge the report has been reviewed and that the data is correct, enter the date, and submit your report."]
[null,"via Email Address:  JARNursingHome.Health@tn.gov"]
[]
[null,"Instructions on how to e-mail the report as an attachment are found on page six of the User Instructions."]
[]
[null,"We look forward to receiving your report before the due date of Friday, July 20, 2018    "]
[]
[]
[null,"Thank you for your cooperation."]