{"text_format":"1","workbook":"xlsx","n_sheets":8,"sheets":["Instructions","Plant & Energy Data Entry","Energy Data Summary","Summary Table","Annual Energy Summary","Annual Cost Summary","Monthly Trends","QA Check"],"not_rendered":{"charts":6,"images":4,"macros":1,"external_links":0,"defined_names":41,"comments":0,"pivot_tables":0},"unopened":[{"sheet":"Annual Energy Summary","index":4,"reason":"not_a_worksheet"},{"sheet":"Annual Cost Summary","index":5,"reason":"not_a_worksheet"},{"sheet":"Monthly Trends","index":6,"reason":"not_a_worksheet"}],"bounds":{"document_bytes":16777216,"sheet_cells":100000,"rows_first":2000,"rows_last":500,"rows_between":2000,"halvings":0,"cell_chars":16384,"cell_head_chars":4096},"cells_cut":0,"cells_raw":0,"read":"whole","date_system":"1900"}

{"sheet":"Instructions","index":0,"n_rows":36,"n_cols":2,"rows_kept":36,"cut":false,"hidden":false,"merged":[[35,1,36,7],[31,1,33,7],[34,1,34,7],[4,1,5,4],[0,1,2,7],[8,1,8,4],[14,1,14,7],[9,1,12,7],[17,1,30,7],[13,1,13,2]]}
[null,"R4 Energy Assessment Tool for Water & Wastewater Facilities\n EPA Region 4 - Atlanta - Version 2.1 (March 2018)  "]
[]
[]
[]
[null,"INSTRUCTIONS FOR USE:"]
[]
[]
[]
{"$rows_left_out":29}
{"sheet":"Plant & Energy Data Entry","index":1,"n_rows":108,"n_cols":32,"rows_kept":108,"cut":false,"hidden":false,"merged":[[21,18,21,21],[22,18,22,21],[21,23,21,26],[22,23,22,26],[22,3,22,6],[21,8,21,11],[22,8,22,11],[21,13,21,16],[22,13,22,16],[4,29,4,31],[5,29,5,31],[6,29,6,31],[20,28,20,31],[22,28,22,31],[21,28,21,31],[19,28,19,31],[14,28,14,30],[15,28,15,30],[16,28,16,30],[0,0,2,6],[4,0,6,6],[14,0,17,6],[21,3,21,6],[11,0,11,1],[10,0,10,1],[12,0,12,1],[11,2,11,4],[12,2,12,4],[10,3,10,4],[8,1,8,6],[7,1,7,6]]}
["R4  Energy Assessment Tool for Water & Wastewater Facilities - EPA Region 4\nYellow-shaded cells indicate data entry fields"]
[]
[]
[]
[" ENTER PLANT NAME AND BRIEF DESCRIPTION OF PROCESSES: Design flow, Anoxic zones, Biosolids Processes, Activated Sludge Process, Fine/Coarse Bubble, etc."]
[]
[]
["Name of Facility:"]
{"$rows_left_out":101}
{"sheet":"Energy Data Summary","index":2,"n_rows":106,"n_cols":20,"rows_kept":106,"cut":false,"hidden":true,"merged":[[0,0,1,4],[2,0,2,9]]}
["Energy Data Summary & Results"]
[]
["The values in these cells will change as data is entered in the other sheets"]
["MONTH","# DAYS IN MONTH","Average Daily Flow (MGD)","Monthly Flow","12-month period","FLOW counter"," TOTAL MONTHLY ELECTRICAL USAGE  kWh","MONTHLY GAS USAGE \n(kWh equiv)","Total Monthly Energy Usage (kWh equiv)","ENERGY Counter","TOTAL COST OF ELECTRICITY","Electric Demand Actual (kW)","Electric Demand Billed (kW)","TOTAL MONTHLY DEMAND COST","TOTAL MONTHLY COST OF ENERGY (W/GAS)","COST Counter","ELEC. ENERGY UTILIZATION kWh/MG","GAS ENERGY UTILIZATION kWh/MG","TOTAL ENERGY UTILIZATION kWh/MG","TOTAL ENERGY COST $/MG"]
[{"$f":"'Plant & Energy Data Entry'!A25","v":"3798-01-31"},{"$f":"IF(Table4[[#This Row],[Average Daily Flow (MGD)]]=\"\",\"\",_xlfn.DAYS(DATE(YEAR(Table4[[#This Row],[MONTH]]),MONTH(Table4[[#This Row],[MONTH]])+1,DAY(Table4[[#This Row],[MONTH]])),DATE(YEAR(Table4[[#This Row],[MONTH]]),MONTH(Table4[[#This Row],[MONTH]]),DAY(Table4[[#This Row],[MONTH]]))))","v":""},{"$f":"IF(OR('Plant & Energy Data Entry'!B25=\"\",'Plant & Energy Data Entry'!B25=0),\"\",'Plant & Energy Data Entry'!B25)","v":""},{"$f":"IF(ISERROR(Table4[[#This Row],[Average Daily Flow (MGD)]]*_xlfn.DAYS(DATE(YEAR(A5),MONTH(A5)+1,DAY(A5)),DATE(YEAR(A5),MONTH(A5),DAY(A5)))),\"\",Table4[[#This Row],[Average Daily Flow (MGD)]]*_xlfn.DAYS(DATE(YEAR(A5),MONTH(A5)+1,DAY(A5)),DATE(YEAR(A5),MONTH(A5),DAY(A5))))","v":""},1,{"$f":"IF(OR(Table4[[#This Row],[Monthly Flow]]=0,Table4[[#This Row],[Monthly Flow]]=\"\"),0,1)","v":0},{"$f":"'Plant & Energy Data Entry'!C25+'Plant & Energy Data Entry'!H25+'Plant & Energy Data Entry'!M25+'Plant & Energy Data Entry'!R25+'Plant & Energy Data Entry'!W25","v":0},{"$f":"'Plant & Energy Data Entry'!AF25","v":0},{"$f":"Table4[[#This Row],[MONTHLY GAS USAGE \n(kWh equiv)]]+Table4[[#This Row],[ TOTAL MONTHLY ELECTRICAL USAGE  kWh]]","v":0},{"$f":"IF(AND(Table4[[#This Row],[ TOTAL MONTHLY ELECTRICAL USAGE  kWh]]<>\"\",Table4[[#This Row],[ TOTAL MONTHLY ELECTRICAL USAGE  kWh]]<>0),1,0)","v":0},{"$f":"'Plant & Energy Data Entry'!$D25+'Plant & Energy Data Entry'!$I25+'Plant & Energy Data Entry'!$N25+'Plant & Energy Data Entry'!$S25+'Plant & Energy Data Entry'!$X25","v":0},{"$f":"IF('Plant & Energy Data Entry'!E25+'Plant & Energy Data Entry'!J25+'Plant & Energy Data Entry'!O25+'Plant & Energy Data Entry'!T25+'Plant & Energy Data Entry'!Y25=0,\"\",'Plant & Energy Data Entry'!E25+'Plant & Energy Data Entry'!J25+'Plant & Energy Data Entry'!O25+'Plant & Energy Data Entry'!T25+'Plant & Energy Data Entry'!Y25)","v":""},{"$f":"IF('Plant & Energy Data Entry'!F25+'Plant & Energy Data Entry'!K25+'Plant & Energy Data Entry'!P25+'Plant & Energy Data Entry'!U25+'Plant & Energy Data Entry'!Z25=0,\"\",'Plant & Energy Data Entry'!F25+'Plant & Energy Data Entry'!K25+'Plant & Energy Data Entry'!P25+'Plant & Energy Data Entry'!U25+'Plant & Energy Data Entry'!Z25)","v":""},{"$f":"'Plant & Energy Data Entry'!G25+'Plant & Energy Data Entry'!L25+'Plant & Energy Data Entry'!Q25+'Plant & Energy Data Entry'!V25+'Plant & Energy Data Entry'!AA25","v":0},{"$f":"IF(ISERROR(Table4[[#This Row],[TOTAL COST OF ELECTRICITY]]+'Plant & Energy Data Entry'!AE25),\"\",Table4[[#This Row],[TOTAL COST OF ELECTRICITY]]+'Plant & Energy Data Entry'!AE25)","v":0},{"$f":"IF(OR(Table4[[#This Row],[TOTAL MONTHLY COST OF ENERGY (W/GAS)]]=0,Table4[[#This Row],[TOTAL MONTHLY COST OF ENERGY (W/GAS)]]=\"\"),0,1)","v":0},{"$f":"IF(ISERROR(Table4[[#This Row],[ TOTAL MONTHLY ELECTRICAL USAGE  kWh]]/Table4[Monthly Flow]),\"\",Table4[[#This Row],[ TOTAL MONTHLY ELECTRICAL USAGE  kWh]]/(Table4[Monthly Flow]))","v":""},{"$f":"IF(ISERROR(Table4[[#This Row],[MONTHLY GAS USAGE \n(kWh equiv)]]/Table4[[#This Row],[Monthly Flow]]),0,Table4[[#This Row],[MONTHLY GAS USAGE \n(kWh equiv)]]/(Table4[[#This Row],[Monthly Flow]]))","v":0},{"$f":"IF(ISERROR(Table4[[#This Row],[GAS ENERGY UTILIZATION kWh/MG]]+Table4[[#This Row],[ELEC. ENERGY UTILIZATION kWh/MG]]),\"\",Table4[[#This Row],[GAS ENERGY UTILIZATION kWh/MG]]+Table4[[#This Row],[ELEC. ENERGY UTILIZATION kWh/MG]])","v":""},{"$f":"IF(ISERROR(Table4[[#This Row],[TOTAL MONTHLY COST OF ENERGY (W/GAS)]]/(Table4[[#This Row],[Average Daily Flow (MGD)]]*30.4)),\"\",Table4[[#This Row],[TOTAL MONTHLY COST OF ENERGY (W/GAS)]]/(Table4[[#This Row],[Average Daily Flow (MGD)]]*30.4))","v":""}]
[{"$f":"'Plant & Energy Data Entry'!A26","v":"3798-02-28"},{"$f":"IF(Table4[[#This Row],[Average Daily Flow (MGD)]]=\"\",\"\",_xlfn.DAYS(DATE(YEAR(Table4[[#This Row],[MONTH]]),MONTH(Table4[[#This Row],[MONTH]])+1,DAY(Table4[[#This Row],[MONTH]])),DATE(YEAR(Table4[[#This Row],[MONTH]]),MONTH(Table4[[#This Row],[MONTH]]),DAY(Table4[[#This Row],[MONTH]]))))","v":""},{"$f":"IF(OR('Plant & Energy Data Entry'!B26=\"\",'Plant & Energy Data Entry'!B26=0),\"\",'Plant & Energy Data Entry'!B26)","v":""},{"$f":"IF(ISERROR(Table4[[#This Row],[Average Daily Flow (MGD)]]*_xlfn.DAYS(DATE(YEAR(A6),MONTH(A6)+1,DAY(A6)),DATE(YEAR(A6),MONTH(A6),DAY(A6)))),\"\",Table4[[#This Row],[Average Daily Flow (MGD)]]*_xlfn.DAYS(DATE(YEAR(A6),MONTH(A6)+1,DAY(A6)),DATE(YEAR(A6),MONTH(A6),DAY(A6))))","v":""},1,{"$f":"IF(OR(Table4[[#This Row],[Monthly Flow]]=0,Table4[[#This Row],[Monthly Flow]]=\"\"),0,1)","v":0},{"$f":"'Plant & Energy Data Entry'!C26+'Plant & Energy Data Entry'!H26+'Plant & Energy Data Entry'!M26+'Plant & Energy Data Entry'!R26+'Plant & Energy Data Entry'!W26","v":0},{"$f":"'Plant & Energy Data Entry'!AF26","v":0},{"$f":"Table4[[#This Row],[MONTHLY GAS USAGE \n(kWh equiv)]]+Table4[[#This Row],[ TOTAL MONTHLY ELECTRICAL USAGE  kWh]]","v":0},{"$f":"IF(AND(Table4[[#This Row],[ TOTAL MONTHLY ELECTRICAL USAGE  kWh]]<>\"\",Table4[[#This Row],[ TOTAL MONTHLY ELECTRICAL USAGE  kWh]]<>0),1,0)","v":0},{"$f":"'Plant & Energy Data Entry'!$D26+'Plant & Energy Data Entry'!$I26+'Plant & Energy Data Entry'!$N26+'Plant & Energy Data Entry'!$S26+'Plant & Energy Data Entry'!$X26","v":0},{"$f":"IF('Plant & Energy Data Entry'!E26+'Plant & Energy Data Entry'!J26+'Plant & Energy Data Entry'!O26+'Plant & Energy Data Entry'!T26+'Plant & Energy Data Entry'!Y26=0,\"\",'Plant & Energy Data Entry'!E26+'Plant & Energy Data Entry'!J26+'Plant & Energy Data Entry'!O26+'Plant & Energy Data Entry'!T26+'Plant & Energy Data Entry'!Y26)","v":""},{"$f":"IF('Plant & Energy Data Entry'!F26+'Plant & Energy Data Entry'!K26+'Plant & Energy Data Entry'!P26+'Plant & Energy Data Entry'!U26+'Plant & Energy Data Entry'!Z26=0,\"\",'Plant & Energy Data Entry'!F26+'Plant & Energy Data Entry'!K26+'Plant & Energy Data Entry'!P26+'Plant & Energy Data Entry'!U26+'Plant & Energy Data Entry'!Z26)","v":""},{"$f":"'Plant & Energy Data Entry'!G26+'Plant & Energy Data Entry'!L26+'Plant & Energy Data Entry'!Q26+'Plant & Energy Data Entry'!V26+'Plant & Energy Data Entry'!AA26","v":0},{"$f":"IF(ISERROR(Table4[[#This Row],[TOTAL COST OF ELECTRICITY]]+'Plant & Energy Data Entry'!AE26),\"\",Table4[[#This Row],[TOTAL COST OF ELECTRICITY]]+'Plant & Energy Data Entry'!AE26)","v":0},{"$f":"IF(OR(Table4[[#This Row],[TOTAL MONTHLY COST OF ENERGY (W/GAS)]]=0,Table4[[#This Row],[TOTAL MONTHLY COST OF ENERGY (W/GAS)]]=\"\"),0,1)","v":0},{"$f":"IF(ISERROR(Table4[[#This Row],[ TOTAL MONTHLY ELECTRICAL USAGE  kWh]]/Table4[Monthly Flow]),\"\",Table4[[#This Row],[ TOTAL MONTHLY ELECTRICAL USAGE  kWh]]/(Table4[Monthly Flow]))","v":""},{"$f":"IF(ISERROR(Table4[[#This Row],[MONTHLY GAS USAGE \n(kWh equiv)]]/Table4[[#This Row],[Monthly Flow]]),0,Table4[[#This Row],[MONTHLY GAS USAGE \n(kWh equiv)]]/(Table4[[#This Row],[Monthly Flow]]))","v":0},{"$f":"IF(ISERROR(Table4[[#This Row],[GAS ENERGY UTILIZATION kWh/MG]]+Table4[[#This Row],[ELEC. ENERGY UTILIZATION kWh/MG]]),\"\",Table4[[#This Row],[GAS ENERGY UTILIZATION kWh/MG]]+Table4[[#This Row],[ELEC. ENERGY UTILIZATION kWh/MG]])","v":""},{"$f":"IF(ISERROR(Table4[[#This Row],[TOTAL MONTHLY COST OF ENERGY (W/GAS)]]/(Table4[[#This Row],[Average Daily Flow (MGD)]]*30.4)),\"\",Table4[[#This Row],[TOTAL MONTHLY COST OF ENERGY (W/GAS)]]/(Table4[[#This Row],[Average Daily Flow (MGD)]]*30.4))","v":""}]
[{"$f":"'Plant & Energy Data Entry'!A27","v":"3798-03-31"},{"$f":"IF(Table4[[#This Row],[Average Daily Flow (MGD)]]=\"\",\"\",_xlfn.DAYS(DATE(YEAR(Table4[[#This Row],[MONTH]]),MONTH(Table4[[#This Row],[MONTH]])+1,DAY(Table4[[#This Row],[MONTH]])),DATE(YEAR(Table4[[#This Row],[MONTH]]),MONTH(Table4[[#This Row],[MONTH]]),DAY(Table4[[#This Row],[MONTH]]))))","v":""},{"$f":"IF(OR('Plant & Energy Data Entry'!B27=\"\",'Plant & Energy Data Entry'!B27=0),\"\",'Plant & Energy Data Entry'!B27)","v":""},{"$f":"IF(ISERROR(Table4[[#This Row],[Average Daily Flow (MGD)]]*_xlfn.DAYS(DATE(YEAR(A7),MONTH(A7)+1,DAY(A7)),DATE(YEAR(A7),MONTH(A7),DAY(A7)))),\"\",Table4[[#This Row],[Average Daily Flow (MGD)]]*_xlfn.DAYS(DATE(YEAR(A7),MONTH(A7)+1,DAY(A7)),DATE(YEAR(A7),MONTH(A7),DAY(A7))))","v":""},1,{"$f":"IF(OR(Table4[[#This Row],[Monthly Flow]]=0,Table4[[#This Row],[Monthly Flow]]=\"\"),0,1)","v":0},{"$f":"'Plant & Energy Data Entry'!C27+'Plant & Energy Data Entry'!H27+'Plant & Energy Data Entry'!M27+'Plant & Energy Data Entry'!R27+'Plant & Energy Data Entry'!W27","v":0},{"$f":"'Plant & Energy Data Entry'!AF27","v":0},{"$f":"Table4[[#This Row],[MONTHLY GAS USAGE \n(kWh equiv)]]+Table4[[#This Row],[ TOTAL MONTHLY ELECTRICAL USAGE  kWh]]","v":0},{"$f":"IF(AND(Table4[[#This Row],[ TOTAL MONTHLY ELECTRICAL USAGE  kWh]]<>\"\",Table4[[#This Row],[ TOTAL MONTHLY ELECTRICAL USAGE  kWh]]<>0),1,0)","v":0},{"$f":"'Plant & Energy Data Entry'!$D27+'Plant & Energy Data Entry'!$I27+'Plant & Energy Data Entry'!$N27+'Plant & Energy Data Entry'!$S27+'Plant & Energy Data Entry'!$X27","v":0},{"$f":"IF('Plant & Energy Data Entry'!E27+'Plant & Energy Data Entry'!J27+'Plant & Energy Data Entry'!O27+'Plant & Energy Data Entry'!T27+'Plant & Energy Data Entry'!Y27=0,\"\",'Plant & Energy Data Entry'!E27+'Plant & Energy Data Entry'!J27+'Plant & Energy Data Entry'!O27+'Plant & Energy Data Entry'!T27+'Plant & Energy Data Entry'!Y27)","v":""},{"$f":"IF('Plant & Energy Data Entry'!F27+'Plant & Energy Data Entry'!K27+'Plant & Energy Data Entry'!P27+'Plant & Energy Data Entry'!U27+'Plant & Energy Data Entry'!Z27=0,\"\",'Plant & Energy Data Entry'!F27+'Plant & Energy Data Entry'!K27+'Plant & Energy Data Entry'!P27+'Plant & Energy Data Entry'!U27+'Plant & Energy Data Entry'!Z27)","v":""},{"$f":"'Plant & Energy Data Entry'!G27+'Plant & Energy Data Entry'!L27+'Plant & Energy Data Entry'!Q27+'Plant & Energy Data Entry'!V27+'Plant & Energy Data Entry'!AA27","v":0},{"$f":"IF(ISERROR(Table4[[#This Row],[TOTAL COST OF ELECTRICITY]]+'Plant & Energy Data Entry'!AE27),\"\",Table4[[#This Row],[TOTAL COST OF ELECTRICITY]]+'Plant & Energy Data Entry'!AE27)","v":0},{"$f":"IF(OR(Table4[[#This Row],[TOTAL MONTHLY COST OF ENERGY (W/GAS)]]=0,Table4[[#This Row],[TOTAL MONTHLY COST OF ENERGY (W/GAS)]]=\"\"),0,1)","v":0},{"$f":"IF(ISERROR(Table4[[#This Row],[ TOTAL MONTHLY ELECTRICAL USAGE  kWh]]/Table4[Monthly Flow]),\"\",Table4[[#This Row],[ TOTAL MONTHLY ELECTRICAL USAGE  kWh]]/(Table4[Monthly Flow]))","v":""},{"$f":"IF(ISERROR(Table4[[#This Row],[MONTHLY GAS USAGE \n(kWh equiv)]]/Table4[[#This Row],[Monthly Flow]]),0,Table4[[#This Row],[MONTHLY GAS USAGE \n(kWh equiv)]]/(Table4[[#This Row],[Monthly Flow]]))","v":0},{"$f":"IF(ISERROR(Table4[[#This Row],[GAS ENERGY UTILIZATION kWh/MG]]+Table4[[#This Row],[ELEC. ENERGY UTILIZATION kWh/MG]]),\"\",Table4[[#This Row],[GAS ENERGY UTILIZATION kWh/MG]]+Table4[[#This Row],[ELEC. ENERGY UTILIZATION kWh/MG]])","v":""},{"$f":"IF(ISERROR(Table4[[#This Row],[TOTAL MONTHLY COST OF ENERGY (W/GAS)]]/(Table4[[#This Row],[Average Daily Flow (MGD)]]*30.4)),\"\",Table4[[#This Row],[TOTAL MONTHLY COST OF ENERGY (W/GAS)]]/(Table4[[#This Row],[Average Daily Flow (MGD)]]*30.4))","v":""}]
[{"$f":"'Plant & Energy Data Entry'!A28","v":"3798-04-30"},{"$f":"IF(Table4[[#This Row],[Average Daily Flow (MGD)]]=\"\",\"\",_xlfn.DAYS(DATE(YEAR(Table4[[#This Row],[MONTH]]),MONTH(Table4[[#This Row],[MONTH]])+1,DAY(Table4[[#This Row],[MONTH]])),DATE(YEAR(Table4[[#This Row],[MONTH]]),MONTH(Table4[[#This Row],[MONTH]]),DAY(Table4[[#This Row],[MONTH]]))))","v":""},{"$f":"IF(OR('Plant & Energy Data Entry'!B28=\"\",'Plant & Energy Data Entry'!B28=0),\"\",'Plant & Energy Data Entry'!B28)","v":""},{"$f":"IF(ISERROR(Table4[[#This Row],[Average Daily Flow (MGD)]]*_xlfn.DAYS(DATE(YEAR(A8),MONTH(A8)+1,DAY(A8)),DATE(YEAR(A8),MONTH(A8),DAY(A8)))),\"\",Table4[[#This Row],[Average Daily Flow (MGD)]]*_xlfn.DAYS(DATE(YEAR(A8),MONTH(A8)+1,DAY(A8)),DATE(YEAR(A8),MONTH(A8),DAY(A8))))","v":""},1,{"$f":"IF(OR(Table4[[#This Row],[Monthly Flow]]=0,Table4[[#This Row],[Monthly Flow]]=\"\"),0,1)","v":0},{"$f":"'Plant & Energy Data Entry'!C28+'Plant & Energy Data Entry'!H28+'Plant & Energy Data Entry'!M28+'Plant & Energy Data Entry'!R28+'Plant & Energy Data Entry'!W28","v":0},{"$f":"'Plant & Energy Data Entry'!AF28","v":0},{"$f":"Table4[[#This Row],[MONTHLY GAS USAGE \n(kWh equiv)]]+Table4[[#This Row],[ TOTAL MONTHLY ELECTRICAL USAGE  kWh]]","v":0},{"$f":"IF(AND(Table4[[#This Row],[ TOTAL MONTHLY ELECTRICAL USAGE  kWh]]<>\"\",Table4[[#This Row],[ TOTAL MONTHLY ELECTRICAL USAGE  kWh]]<>0),1,0)","v":0},{"$f":"'Plant & Energy Data Entry'!$D28+'Plant & Energy Data Entry'!$I28+'Plant & Energy Data Entry'!$N28+'Plant & Energy Data Entry'!$S28+'Plant & Energy Data Entry'!$X28","v":0},{"$f":"IF('Plant & Energy Data Entry'!E28+'Plant & Energy Data Entry'!J28+'Plant & Energy Data Entry'!O28+'Plant & Energy Data Entry'!T28+'Plant & Energy Data Entry'!Y28=0,\"\",'Plant & Energy Data Entry'!E28+'Plant & Energy Data Entry'!J28+'Plant & Energy Data Entry'!O28+'Plant & Energy Data Entry'!T28+'Plant & Energy Data Entry'!Y28)","v":""},{"$f":"IF('Plant & Energy Data Entry'!F28+'Plant & Energy Data Entry'!K28+'Plant & Energy Data Entry'!P28+'Plant & Energy Data Entry'!U28+'Plant & Energy Data Entry'!Z28=0,\"\",'Plant & Energy Data Entry'!F28+'Plant & Energy Data Entry'!K28+'Plant & Energy Data Entry'!P28+'Plant & Energy Data Entry'!U28+'Plant & Energy Data Entry'!Z28)","v":""},{"$f":"'Plant & Energy Data Entry'!G28+'Plant & Energy Data Entry'!L28+'Plant & Energy Data Entry'!Q28+'Plant & Energy Data Entry'!V28+'Plant & Energy Data Entry'!AA28","v":0},{"$f":"IF(ISERROR(Table4[[#This Row],[TOTAL COST OF ELECTRICITY]]+'Plant & Energy Data Entry'!AE28),\"\",Table4[[#This Row],[TOTAL COST OF ELECTRICITY]]+'Plant & Energy Data Entry'!AE28)","v":0},{"$f":"IF(OR(Table4[[#This Row],[TOTAL MONTHLY COST OF ENERGY (W/GAS)]]=0,Table4[[#This Row],[TOTAL MONTHLY COST OF ENERGY (W/GAS)]]=\"\"),0,1)","v":0},{"$f":"IF(ISERROR(Table4[[#This Row],[ TOTAL MONTHLY ELECTRICAL USAGE  kWh]]/Table4[Monthly Flow]),\"\",Table4[[#This Row],[ TOTAL MONTHLY ELECTRICAL USAGE  kWh]]/(Table4[Monthly Flow]))","v":""},{"$f":"IF(ISERROR(Table4[[#This Row],[MONTHLY GAS USAGE \n(kWh equiv)]]/Table4[[#This Row],[Monthly Flow]]),0,Table4[[#This Row],[MONTHLY GAS USAGE \n(kWh equiv)]]/(Table4[[#This Row],[Monthly Flow]]))","v":0},{"$f":"IF(ISERROR(Table4[[#This Row],[GAS ENERGY UTILIZATION kWh/MG]]+Table4[[#This Row],[ELEC. ENERGY UTILIZATION kWh/MG]]),\"\",Table4[[#This Row],[GAS ENERGY UTILIZATION kWh/MG]]+Table4[[#This Row],[ELEC. ENERGY UTILIZATION kWh/MG]])","v":""},{"$f":"IF(ISERROR(Table4[[#This Row],[TOTAL MONTHLY COST OF ENERGY (W/GAS)]]/(Table4[[#This Row],[Average Daily Flow (MGD)]]*30.4)),\"\",Table4[[#This Row],[TOTAL MONTHLY COST OF ENERGY (W/GAS)]]/(Table4[[#This Row],[Average Daily Flow (MGD)]]*30.4))","v":""}]
{"$rows_left_out":99}
{"sheet":"Summary Table","index":3,"n_rows":12,"n_cols":9,"rows_kept":12,"cut":false,"hidden":false,"merged":[[2,8,3,8],[4,8,5,8],[8,8,9,8]]}
[]
[null,null,{"$f":"'Energy Data Summary'!B95","v":{"$error":"#NUM!"}},{"$f":"'Energy Data Summary'!B96","v":{"$error":"#NUM!"}},{"$f":"'Energy Data Summary'!B97","v":"Jan 1900 - Dec 1900"},{"$f":"'Energy Data Summary'!B98","v":"Jan 1901 - Dec 1901"},{"$f":"'Energy Data Summary'!B99","v":"Jan 1902 - Dec 1902"},"% \nChange","Cumulative\nSavings since Optimization"]
[null,"Average Daily Flow\n(MGD)",{"$f":"'Energy Data Summary'!D95","v":""},{"$f":"'Energy Data Summary'!D96","v":""},{"$f":"'Energy Data Summary'!D97","v":""},{"$f":"'Energy Data Summary'!D98","v":""},{"$f":"'Energy Data Summary'!D99","v":""},{"$f":"'Energy Data Summary'!D102","v":{"$error":"#DIV/0!"}},"N/A"]
[null,"Total Flow Treated\n(MG)",{"$f":"'Energy Data Summary'!C95","v":""},{"$f":"'Energy Data Summary'!C96","v":""},{"$f":"'Energy Data Summary'!C97","v":""},{"$f":"'Energy Data Summary'!C98","v":""},{"$f":"'Energy Data Summary'!C99","v":""},"N/A"]
[null,"Monthly Average Energy Used (kWh equiv)",{"$f":"'Energy Data Summary'!G95","v":""},{"$f":"'Energy Data Summary'!G96","v":""},{"$f":"'Energy Data Summary'!G97","v":""},{"$f":"'Energy Data Summary'!G98","v":""},{"$f":"'Energy Data Summary'!G99","v":""},{"$f":"'Energy Data Summary'!G102","v":{"$error":"#DIV/0!"}},"N/A"]
[null,"Total Energy Used\n (kWh equiv)",{"$f":"'Energy Data Summary'!F95","v":""},{"$f":"'Energy Data Summary'!F96","v":""},{"$f":"'Energy Data Summary'!F97","v":""},{"$f":"'Energy Data Summary'!F98","v":""},{"$f":"'Energy Data Summary'!F99","v":""},"N/A"]
[null,"Energy per volume treated (kWh/MG)",{"$f":"'Energy Data Summary'!H95","v":"Insufficient data"},{"$f":"'Energy Data Summary'!H96","v":"Insufficienct data"},{"$f":"'Energy Data Summary'!H97","v":"insufficient data"},{"$f":"'Energy Data Summary'!H98","v":"Insufficient data"},{"$f":"'Energy Data Summary'!H99","v":"Insufficient data"},{"$f":"IF('Energy Data Summary'!H102>=0,TEXT('Energy Data Summary'!H102,\"0.0%\")&\" Reduction per Volume\",TEXT('Energy Data Summary'!H102,\"0.0%\")&\" Increase per Volume\")","v":{"$error":"#DIV/0!"}},"N/A"]
[null,"Annual Energy Savings (kWh eq)","N/A","N/A",{"$f":"'Energy Data Summary'!I97","v":""},{"$f":"'Energy Data Summary'!I98","v":""},{"$f":"'Energy Data Summary'!I99","v":""},"N/A",{"$f":"'Energy Data Summary'!I103","v":0}]
{"$rows_left_out":5}
{"sheet":"QA Check","index":7,"n_rows":4,"n_cols":1,"rows_kept":4,"cut":false,"hidden":true,"merged":[]}
["1. Enter zeros for gas energy use"]
[]
["3. Hide Energy Data Summary"]
["4. Hide this tab"]