{"text_format":"1","workbook":"xlsx","n_sheets":13,"sheets":["Instructions","Energy Data Entry","Process Data Entry","Flow-based Summary","Flow Efficiency","BOD-based Summary","BOD Efficiency","Nutrient Removal Summary","TP removal","TN removal","Calculation Notes","Background Calculations","Other Charts"],"not_rendered":{"charts":12,"images":4,"macros":1,"external_links":0,"defined_names":63,"comments":2,"pivot_tables":0},"unopened":[{"sheet":"Flow Efficiency","index":4,"reason":"not_a_worksheet"},{"sheet":"BOD Efficiency","index":6,"reason":"not_a_worksheet"},{"sheet":"TP removal","index":8,"reason":"not_a_worksheet"},{"sheet":"TN removal","index":9,"reason":"not_a_worksheet"}],"bounds":{"document_bytes":16777216,"sheet_cells":100000,"rows_first":2000,"rows_last":500,"rows_between":2000,"halvings":0,"cell_chars":16384,"cell_head_chars":4096},"cells_cut":0,"cells_raw":0,"read":"whole","date_system":"1900"}

{"sheet":"Instructions","index":0,"n_rows":40,"n_cols":2,"rows_kept":40,"cut":false,"hidden":false,"merged":[[17,1,30,7],[38,1,38,7],[39,1,40,7],[1,1,3,7],[10,1,10,4],[11,1,14,7],[5,1,7,7],[33,1,33,7],[36,1,36,7]]}
[]
[null,"Nutrient & Energy Assessment Tool - Wastewater Optimization\nVersion 3.0 beta (March 2019)  "]
[]
[]
[]
[null,"ABOUT THIS TOOL:\nThis tool is intended to help wastewater operators track changes in energy usage, treatment costs, and nutrient discharge resulting from efforts to optimize their facilities. It calculates savings and displays them on summary charts, and plots related data to help identify trends. This information can be used to evaluate optimization efforts and identify further opportunities. "]
{"$rows_left_out":35}
{"sheet":"Energy Data Entry","index":1,"n_rows":108,"n_cols":33,"rows_kept":108,"cut":false,"hidden":false,"merged":[[0,1,2,7],[22,3,22,6],[10,1,10,2],[10,4,10,5],[11,1,11,2],[11,3,11,5],[12,1,12,2],[12,3,12,5],[22,29,22,32],[4,1,6,6],[7,2,7,6],[8,2,8,6],[22,8,22,11],[22,13,22,16],[22,18,22,21],[22,23,22,26],[14,1,17,6],[20,29,20,32],[21,3,21,6],[21,8,21,11],[21,13,21,16],[21,18,21,21],[21,23,21,26],[21,29,21,32]]}
[null,"R4  Energy Assessment Tool for Water & Wastewater Facilities - EPA Region 4\nYellow-shaded cells indicate data entry fields"]
[]
[]
[]
[null," ENTER PLANT NAME AND BRIEF DESCRIPTION OF PROCESSES: Design flow, Anoxic zones, Biosolids Processes, Activated Sludge Process, Fine/Coarse Bubble, etc."]
[]
{"$rows_left_out":103}
{"sheet":"Process Data Entry","index":2,"n_rows":89,"n_cols":14,"rows_kept":89,"cut":false,"hidden":false,"merged":[]}
[]
[]
[]
[]
[null,"MONTH\n(Auto-filled)\n","Avg Daily Flow\n(MGD)","Avg Influent CBOD \n(mg/L)","Avg Effluent CBOD \n(mg/L)","CBOD removal (lbs/d)","Avg influent TKN (mg/L)","Avg influent NH3 (mg/L)","Avg influent NOx (mg/L)","Avg effluent TKN (mg/L)","Avg effluent NH3  (mg/L)","Avg effluent NOx (mg/L)","Avg influent TP (mg/L)","Avg effluent TP (mg/L)"]
[null,{"$f":"'Energy Data Entry'!B25","v":"2017-08-01"},null,null,null,{"$f":"IF(C6*(D6-E6)*8.34=0,\"\",C6*(D6-E6)*8.34)","v":""}]
{"$rows_left_out":84}
{"sheet":"Flow-based Summary","index":3,"n_rows":22,"n_cols":9,"rows_kept":22,"cut":false,"hidden":false,"merged":[[1,1,2,8],[5,9,6,9],[7,9,8,9],[9,9,10,9],[11,9,12,9],[17,8,18,8],[13,9,14,9],[15,9,16,9],[5,8,6,8],[7,8,8,8],[9,8,10,8],[11,8,12,8],[13,8,14,8],[15,8,16,8]]}
[]
[null,"Flow-based Energy and Cost Savings"]
[]
[]
[null,null,{"$f":"'Background Calculations'!C147","v":"Baseline: Aug 2017 - Jul 2019"},{"$f":"CONCATENATE('Background Calculations'!C149,'Background Calculations'!H188)","v":"Aug 2019 - Jul 2020\n(to date)"},{"$f":"CONCATENATE('Background Calculations'!C150,'Background Calculations'!H189)","v":"Aug 2020 - Jul 2021"},{"$f":"CONCATENATE('Background Calculations'!C151,'Background Calculations'!H190)","v":"Aug 2021 - Jul 2022"},{"$f":"CONCATENATE('Background Calculations'!C152,'Background Calculations'!H191)","v":"Aug 2022 - Jul 2023"},{"$f":"CONCATENATE('Background Calculations'!C153,'Background Calculations'!H192)","v":"Aug 2023 - Jul 2024"},"Cumulative Change"]
[null,"Avg energy usage (kWh/month)",{"$f":"IFERROR('Background Calculations'!F147,\"\")","v":""},{"$f":"IFERROR('Background Calculations'!F149,\"\")","v":""},{"$f":"IFERROR('Background Calculations'!F150,\"\")","v":""},{"$f":"IFERROR('Background Calculations'!F151,\"\")","v":""},{"$f":"IFERROR('Background Calculations'!F152,\"\")","v":""},{"$f":"IFERROR('Background Calculations'!F153,\"\")","v":""},{"$f":"IFERROR('Background Calculations'!F154,\"\")","v":""}]
{"$rows_left_out":17}
{"sheet":"BOD-based Summary","index":5,"n_rows":22,"n_cols":9,"rows_kept":22,"cut":false,"hidden":false,"merged":[[17,8,18,8],[11,8,12,8],[11,9,12,9],[13,8,14,8],[13,9,14,9],[15,8,16,8],[15,9,16,9],[9,8,10,8],[9,9,10,9],[1,1,2,8],[5,8,6,8],[5,9,6,9],[7,8,8,8],[7,9,8,9]]}
[]
[null,"BOD-based Energy and Cost Savings"]
[]
[]
[null,null,{"$f":"'Background Calculations'!C147","v":"Baseline: Aug 2017 - Jul 2019"},{"$f":"CONCATENATE('Background Calculations'!C149,'Background Calculations'!H188)","v":"Aug 2019 - Jul 2020\n(to date)"},{"$f":"CONCATENATE('Background Calculations'!C150,'Background Calculations'!H189)","v":"Aug 2020 - Jul 2021"},{"$f":"CONCATENATE('Background Calculations'!C151,'Background Calculations'!H190)","v":"Aug 2021 - Jul 2022"},{"$f":"CONCATENATE('Background Calculations'!C152,'Background Calculations'!H191)","v":"Aug 2022 - Jul 2023"},{"$f":"CONCATENATE('Background Calculations'!C153,'Background Calculations'!H192)","v":"Aug 2023 - Jul 2024"},"Cumulative Change"]
[null,"Avg energy usage (kWh/month)",{"$f":"IFERROR('Background Calculations'!F160,\"\")","v":""},{"$f":"IFERROR('Background Calculations'!F162,\"\")","v":""},{"$f":"IFERROR('Background Calculations'!F163,\"\")","v":""},{"$f":"IFERROR('Background Calculations'!F164,\"\")","v":""},{"$f":"IFERROR('Background Calculations'!F165,\"\")","v":""},{"$f":"IFERROR('Background Calculations'!F166,\"\")","v":""},{"$f":"IFERROR('Background Calculations'!F167,\"\")","v":""}]
{"$rows_left_out":17}
{"sheet":"Nutrient Removal Summary","index":7,"n_rows":22,"n_cols":9,"rows_kept":22,"cut":false,"hidden":false,"merged":[[17,8,18,8],[9,8,10,8],[9,9,10,9],[1,1,2,8],[5,8,6,8],[5,9,6,9],[7,8,8,8],[7,9,8,9],[15,9,16,9],[15,8,16,8],[11,9,12,9],[13,8,14,8],[13,9,14,9],[11,8,12,8]]}
[]
[null,"Nutrient Removal Summary"]
[]
[]
[null,null,{"$f":"'Background Calculations'!C147","v":"Baseline: Aug 2017 - Jul 2019"},{"$f":"CONCATENATE('Background Calculations'!C149,'Background Calculations'!H188)","v":"Aug 2019 - Jul 2020\n(to date)"},{"$f":"CONCATENATE('Background Calculations'!C150,'Background Calculations'!H189)","v":"Aug 2020 - Jul 2021"},{"$f":"CONCATENATE('Background Calculations'!C151,'Background Calculations'!H190)","v":"Aug 2021 - Jul 2022"},{"$f":"CONCATENATE('Background Calculations'!C152,'Background Calculations'!H191)","v":"Aug 2022 - Jul 2023"},{"$f":"CONCATENATE('Background Calculations'!C153,'Background Calculations'!H192)","v":"Aug 2023 - Jul 2024"},"Cumulative Change"]
[null,"Avg Influent TN\n(mg/L)",{"$f":"IFERROR('Background Calculations'!D197,\"\")","v":""},{"$f":"IFERROR('Background Calculations'!D199,\"\")","v":""},{"$f":"IFERROR('Background Calculations'!D200,\"\")","v":""},{"$f":"IFERROR('Background Calculations'!D201,\"\")","v":""},{"$f":"IFERROR('Background Calculations'!D202,\"\")","v":""},{"$f":"IFERROR('Background Calculations'!D203,\"\")","v":""},{"$f":"IFERROR('Background Calculations'!D204,\"\")","v":""}]
{"$rows_left_out":17}
{"sheet":"Calculation Notes","index":10,"n_rows":0,"n_cols":0,"rows_kept":0,"cut":false,"hidden":true,"merged":[]}

{"sheet":"Background Calculations","index":11,"n_rows":204,"n_cols":34,"rows_kept":204,"cut":false,"hidden":true,"merged":[]}
[]
[]
["Year","Column2","Avg Daily Flow","Monthly Flow","BOD removed","Total BOD removed","Electric kWh usage","Gas kWh usage","Total Energy Usage","Flow Efficiency","BOD efficiency","Total Electric Demand (Actual)","Total Electric Demand (Billed)","Electric Demand Cost","Total electric cost","Total Gas cost","Avg $/kWh","Avg $/kW demand","Total Energy Cost","Column6","Energy Cost per Volume Treated","Energy Cost per lb BOD","Column7","Avg influent TKN","Avg influent NH3","Avg influent NOx","Avg effluent TKN","Avg effluent NH3","Avg effluent NOx","Approx TN removal (mg/L)","Approx TN removal (lbs)","Avg influent TP","Avg effluent TP","Calculated TP removal (lbs)"]
[1,{"$f":"'Energy Data Entry'!B25","v":"2017-08-01"},{"$f":"IF(OR('Process Data Entry'!C6=\"\",'Process Data Entry'!C6=0),\"\",'Process Data Entry'!C6)","v":""},{"$f":"IF(Table4[Avg Daily Flow]=\"\",\"\",_xlfn.DAYS(EOMONTH(B4,0),EOMONTH(B4,-1))*C4)","v":""},{"$f":"IF('Process Data Entry'!F6=\"\",\"\",'Process Data Entry'!F6)","v":""},{"$f":"IF(Table4[BOD removed]=\"\",\"\",Table4[BOD removed]*_xlfn.DAYS(EOMONTH(Table4[[#This Row],[Column2]],0),EOMONTH(Table4[[#This Row],[Column2]],-1)))","v":""},{"$f":"IF(SUM('Energy Data Entry'!C25,'Energy Data Entry'!H25,'Energy Data Entry'!M25,'Energy Data Entry'!R25,'Energy Data Entry'!W25)=0,\"\",SUM('Energy Data Entry'!C25,'Energy Data Entry'!H25,'Energy Data Entry'!M25,'Energy Data Entry'!R25,'Energy Data Entry'!W25))","v":""},{"$f":"'Energy Data Entry'!AG25","v":0},{"$f":"IF(Table4[[#This Row],[Electric kWh usage]]=\"\",\"\",Table4[[#This Row],[Gas kWh usage]]+Table4[[#This Row],[Electric kWh usage]])","v":""},{"$f":"IF(OR(Table4[[#This Row],[Electric kWh usage]]=\"\",Table4[[#This Row],[Monthly Flow]]=\"\"),\"\",(Table4[[#This Row],[Electric kWh usage]]+Table4[[#This Row],[Gas kWh usage]])/Table4[[#This Row],[Monthly Flow]])","v":""},{"$f":"IFERROR(IF(Table4[[#This Row],[Electric kWh usage]]=\"\",\"\",(Table4[[#This Row],[Electric kWh usage]]+Table4[[#This Row],[Gas kWh usage]])/Table4[[#This Row],[Total BOD removed]]),\"\")","v":""},{"$f":"IF('Energy Data Entry'!E25+'Energy Data Entry'!J25+'Energy Data Entry'!O25+'Energy Data Entry'!T25+'Energy Data Entry'!Y25=0,\"\",'Energy Data Entry'!E25+'Energy Data Entry'!J25+'Energy Data Entry'!O25+'Energy Data Entry'!T25+'Energy Data Entry'!Y25)","v":""},{"$f":"IF('Energy Data Entry'!F25+'Energy Data Entry'!K25+'Energy Data Entry'!P25++'Energy Data Entry'!U25+'Energy Data Entry'!Z25=0,\"\",'Energy Data Entry'!F25+'Energy Data Entry'!K25+'Energy Data Entry'!P25++'Energy Data Entry'!U25+'Energy Data Entry'!Z25)","v":""},{"$f":"IF('Energy Data Entry'!G25+'Energy Data Entry'!L25+'Energy Data Entry'!Q25+'Energy Data Entry'!V25+'Energy Data Entry'!AA25=0,\"\",'Energy Data Entry'!G25+'Energy Data Entry'!L25+'Energy Data Entry'!Q25+'Energy Data Entry'!V25+'Energy Data Entry'!AA25)","v":""},{"$f":"IF('Energy Data Entry'!D25+'Energy Data Entry'!I25+'Energy Data Entry'!N25+'Energy Data Entry'!S25+'Energy Data Entry'!X25=0,\"\",'Energy Data Entry'!D25+'Energy Data Entry'!I25+'Energy Data Entry'!N25+'Energy Data Entry'!S25+'Energy Data Entry'!X25)","v":""},{"$f":"'Energy Data Entry'!AF25","v":0},{"$f":"IFERROR(Table4[[#This Row],[Total electric cost]]/Table4[[#This Row],[Electric kWh usage]],\"\")","v":""},{"$f":"IFERROR(Table4[[#This Row],[Electric Demand Cost]]/Table4[[#This Row],[Total Electric Demand (Billed)]],IFERROR(Table4[[#This Row],[Electric Demand Cost]]/Table4[[#This Row],[Total Electric Demand (Actual)]],\"\"))","v":""},{"$f":"IFERROR(Table4[[#This Row],[Total Gas cost]]+Table4[[#This Row],[Total electric cost]],\"\")","v":""},null,{"$f":"IFERROR(Table4[[#This Row],[Total Energy Cost]]/Table4[[#This Row],[Monthly Flow]],\"\")","v":""},{"$f":"IFERROR(Table4[[#This Row],[Total Energy Cost]]/Table4[[#This Row],[Total BOD removed]],\"\")","v":""},null,{"$f":"IF('Process Data Entry'!G6=\"\",\"\",'Process Data Entry'!G6)","v":""},{"$f":"IF('Process Data Entry'!H6=\"\",\"\",'Process Data Entry'!H6)","v":""},{"$f":"IF('Process Data Entry'!I6=\"\",0,'Process Data Entry'!I6)","v":0},{"$f":"IF('Process Data Entry'!J6=\"\",\"\",'Process Data Entry'!J6)","v":""},{"$f":"IF('Process Data Entry'!K6=\"\",\"\",'Process Data Entry'!K6)","v":""},{"$f":"IF('Process Data Entry'!L6=\"\",\"\",'Process Data Entry'!L6)","v":""},{"$f":"IFERROR(IF(OR(X4=\"\",AC4=\"\",AND(AA4=\"\",AB4=\"\"),((X4+Z4)-(MAX(AA4,AB4)+AC4))<0),\"\",(X4+Z4)-(MAX(AA4,AB4)+AC4)),\"\")","v":""},{"$f":"IF(OR(AD4=\"\",D4=\"\"),\"\",AD4*D4*8.34)","v":""},{"$f":"IF('Process Data Entry'!M6=\"\",\"\",'Process Data Entry'!M6)","v":""},{"$f":"IF('Process Data Entry'!N6=\"\",\"\",'Process Data Entry'!N6)","v":""},{"$f":"IF(OR(AF4=\"\",AG4=\"\",D4=\"\"),\"\",8.34*D4*(AF4-AG4))","v":""}]
[1,{"$f":"'Energy Data Entry'!B26","v":"2017-09-01"},{"$f":"IF(OR('Process Data Entry'!C7=\"\",'Process Data Entry'!C7=0),\"\",'Process Data Entry'!C7)","v":""},{"$f":"IF(Table4[Avg Daily Flow]=\"\",\"\",_xlfn.DAYS(EOMONTH(B5,0),EOMONTH(B5,-1))*C5)","v":""},{"$f":"IF('Process Data Entry'!F7=\"\",\"\",'Process Data Entry'!F7)","v":""},{"$f":"IF(Table4[BOD removed]=\"\",\"\",Table4[BOD removed]*_xlfn.DAYS(EOMONTH(Table4[[#This Row],[Column2]],0),EOMONTH(Table4[[#This Row],[Column2]],-1)))","v":""},{"$f":"IF(SUM('Energy Data Entry'!C26,'Energy Data Entry'!H26,'Energy Data Entry'!M26,'Energy Data Entry'!R26,'Energy Data Entry'!W26)=0,\"\",SUM('Energy Data Entry'!C26,'Energy Data Entry'!H26,'Energy Data Entry'!M26,'Energy Data Entry'!R26,'Energy Data Entry'!W26))","v":""},{"$f":"'Energy Data Entry'!AG26","v":0},{"$f":"IF(Table4[[#This Row],[Electric kWh usage]]=\"\",\"\",Table4[[#This Row],[Gas kWh usage]]+Table4[[#This Row],[Electric kWh usage]])","v":""},{"$f":"IF(OR(Table4[[#This Row],[Electric kWh usage]]=\"\",Table4[[#This Row],[Monthly Flow]]=\"\"),\"\",(Table4[[#This Row],[Electric kWh usage]]+Table4[[#This Row],[Gas kWh usage]])/Table4[[#This Row],[Monthly Flow]])","v":""},{"$f":"IFERROR(IF(Table4[[#This Row],[Electric kWh usage]]=\"\",\"\",(Table4[[#This Row],[Electric kWh usage]]+Table4[[#This Row],[Gas kWh usage]])/Table4[[#This Row],[Total BOD removed]]),\"\")","v":""},{"$f":"IF('Energy Data Entry'!E26+'Energy Data Entry'!J26+'Energy Data Entry'!O26+'Energy Data Entry'!T26+'Energy Data Entry'!Y26=0,\"\",'Energy Data Entry'!E26+'Energy Data Entry'!J26+'Energy Data Entry'!O26+'Energy Data Entry'!T26+'Energy Data Entry'!Y26)","v":""},{"$f":"IF('Energy Data Entry'!F26+'Energy Data Entry'!K26+'Energy Data Entry'!P26++'Energy Data Entry'!U26+'Energy Data Entry'!Z26=0,\"\",'Energy Data Entry'!F26+'Energy Data Entry'!K26+'Energy Data Entry'!P26++'Energy Data Entry'!U26+'Energy Data Entry'!Z26)","v":""},{"$f":"IF('Energy Data Entry'!G26+'Energy Data Entry'!L26+'Energy Data Entry'!Q26+'Energy Data Entry'!V26+'Energy Data Entry'!AA26=0,\"\",'Energy Data Entry'!G26+'Energy Data Entry'!L26+'Energy Data Entry'!Q26+'Energy Data Entry'!V26+'Energy Data Entry'!AA26)","v":""},{"$f":"IF('Energy Data Entry'!D26+'Energy Data Entry'!I26+'Energy Data Entry'!N26+'Energy Data Entry'!S26+'Energy Data Entry'!X26=0,\"\",'Energy Data Entry'!D26+'Energy Data Entry'!I26+'Energy Data Entry'!N26+'Energy Data Entry'!S26+'Energy Data Entry'!X26)","v":""},{"$f":"'Energy Data Entry'!AF26","v":0},{"$f":"IFERROR(Table4[[#This Row],[Total electric cost]]/Table4[[#This Row],[Electric kWh usage]],\"\")","v":""},{"$f":"IFERROR(Table4[[#This Row],[Electric Demand Cost]]/Table4[[#This Row],[Total Electric Demand (Billed)]],IFERROR(Table4[[#This Row],[Electric Demand Cost]]/Table4[[#This Row],[Total Electric Demand (Actual)]],\"\"))","v":""},{"$f":"IFERROR(Table4[[#This Row],[Total Gas cost]]+Table4[[#This Row],[Total electric cost]],\"\")","v":""},null,{"$f":"IFERROR(Table4[[#This Row],[Total Energy Cost]]/Table4[[#This Row],[Monthly Flow]],\"\")","v":""},{"$f":"IFERROR(Table4[[#This Row],[Total Energy Cost]]/Table4[[#This Row],[Total BOD removed]],\"\")","v":""},null,{"$f":"IF('Process Data Entry'!G7=\"\",\"\",'Process Data Entry'!G7)","v":""},{"$f":"IF('Process Data Entry'!H7=\"\",\"\",'Process Data Entry'!H7)","v":""},{"$f":"IF('Process Data Entry'!I7=\"\",0,'Process Data Entry'!I7)","v":0},{"$f":"IF('Process Data Entry'!J7=\"\",\"\",'Process Data Entry'!J7)","v":""},{"$f":"IF('Process Data Entry'!K7=\"\",\"\",'Process Data Entry'!K7)","v":""},{"$f":"IF('Process Data Entry'!L7=\"\",\"\",'Process Data Entry'!L7)","v":""},"","",{"$f":"IF('Process Data Entry'!M7=\"\",\"\",'Process Data Entry'!M7)","v":""},{"$f":"IF('Process Data Entry'!N7=\"\",\"\",'Process Data Entry'!N7)","v":""},""]
[1,{"$f":"'Energy Data Entry'!B27","v":"2017-10-01"},{"$f":"IF(OR('Process Data Entry'!C8=\"\",'Process Data Entry'!C8=0),\"\",'Process Data Entry'!C8)","v":""},{"$f":"IF(Table4[Avg Daily Flow]=\"\",\"\",_xlfn.DAYS(EOMONTH(B6,0),EOMONTH(B6,-1))*C6)","v":""},{"$f":"IF('Process Data Entry'!F8=\"\",\"\",'Process Data Entry'!F8)","v":""},{"$f":"IF(Table4[BOD removed]=\"\",\"\",Table4[BOD removed]*_xlfn.DAYS(EOMONTH(Table4[[#This Row],[Column2]],0),EOMONTH(Table4[[#This Row],[Column2]],-1)))","v":""},{"$f":"IF(SUM('Energy Data Entry'!C27,'Energy Data Entry'!H27,'Energy Data Entry'!M27,'Energy Data Entry'!R27,'Energy Data Entry'!W27)=0,\"\",SUM('Energy Data Entry'!C27,'Energy Data Entry'!H27,'Energy Data Entry'!M27,'Energy Data Entry'!R27,'Energy Data Entry'!W27))","v":""},{"$f":"'Energy Data Entry'!AG27","v":0},{"$f":"IF(Table4[[#This Row],[Electric kWh usage]]=\"\",\"\",Table4[[#This Row],[Gas kWh usage]]+Table4[[#This Row],[Electric kWh usage]])","v":""},{"$f":"IF(OR(Table4[[#This Row],[Electric kWh usage]]=\"\",Table4[[#This Row],[Monthly Flow]]=\"\"),\"\",(Table4[[#This Row],[Electric kWh usage]]+Table4[[#This Row],[Gas kWh usage]])/Table4[[#This Row],[Monthly Flow]])","v":""},{"$f":"IFERROR(IF(Table4[[#This Row],[Electric kWh usage]]=\"\",\"\",(Table4[[#This Row],[Electric kWh usage]]+Table4[[#This Row],[Gas kWh usage]])/Table4[[#This Row],[Total BOD removed]]),\"\")","v":""},{"$f":"IF('Energy Data Entry'!E27+'Energy Data Entry'!J27+'Energy Data Entry'!O27+'Energy Data Entry'!T27+'Energy Data Entry'!Y27=0,\"\",'Energy Data Entry'!E27+'Energy Data Entry'!J27+'Energy Data Entry'!O27+'Energy Data Entry'!T27+'Energy Data Entry'!Y27)","v":""},{"$f":"IF('Energy Data Entry'!F27+'Energy Data Entry'!K27+'Energy Data Entry'!P27++'Energy Data Entry'!U27+'Energy Data Entry'!Z27=0,\"\",'Energy Data Entry'!F27+'Energy Data Entry'!K27+'Energy Data Entry'!P27++'Energy Data Entry'!U27+'Energy Data Entry'!Z27)","v":""},{"$f":"IF('Energy Data Entry'!G27+'Energy Data Entry'!L27+'Energy Data Entry'!Q27+'Energy Data Entry'!V27+'Energy Data Entry'!AA27=0,\"\",'Energy Data Entry'!G27+'Energy Data Entry'!L27+'Energy Data Entry'!Q27+'Energy Data Entry'!V27+'Energy Data Entry'!AA27)","v":""},{"$f":"IF('Energy Data Entry'!D27+'Energy Data Entry'!I27+'Energy Data Entry'!N27+'Energy Data Entry'!S27+'Energy Data Entry'!X27=0,\"\",'Energy Data Entry'!D27+'Energy Data Entry'!I27+'Energy Data Entry'!N27+'Energy Data Entry'!S27+'Energy Data Entry'!X27)","v":""},{"$f":"'Energy Data Entry'!AF27","v":0},{"$f":"IFERROR(Table4[[#This Row],[Total electric cost]]/Table4[[#This Row],[Electric kWh usage]],\"\")","v":""},{"$f":"IFERROR(Table4[[#This Row],[Electric Demand Cost]]/Table4[[#This Row],[Total Electric Demand (Billed)]],IFERROR(Table4[[#This Row],[Electric Demand Cost]]/Table4[[#This Row],[Total Electric Demand (Actual)]],\"\"))","v":""},{"$f":"IFERROR(Table4[[#This Row],[Total Gas cost]]+Table4[[#This Row],[Total electric cost]],\"\")","v":""},null,{"$f":"IFERROR(Table4[[#This Row],[Total Energy Cost]]/Table4[[#This Row],[Monthly Flow]],\"\")","v":""},{"$f":"IFERROR(Table4[[#This Row],[Total Energy Cost]]/Table4[[#This Row],[Total BOD removed]],\"\")","v":""},null,{"$f":"IF('Process Data Entry'!G8=\"\",\"\",'Process Data Entry'!G8)","v":""},{"$f":"IF('Process Data Entry'!H8=\"\",\"\",'Process Data Entry'!H8)","v":""},{"$f":"IF('Process Data Entry'!I8=\"\",0,'Process Data Entry'!I8)","v":0},{"$f":"IF('Process Data Entry'!J8=\"\",\"\",'Process Data Entry'!J8)","v":""},{"$f":"IF('Process Data Entry'!K8=\"\",\"\",'Process Data Entry'!K8)","v":""},{"$f":"IF('Process Data Entry'!L8=\"\",\"\",'Process Data Entry'!L8)","v":""},"","",{"$f":"IF('Process Data Entry'!M8=\"\",\"\",'Process Data Entry'!M8)","v":""},{"$f":"IF('Process Data Entry'!N8=\"\",\"\",'Process Data Entry'!N8)","v":""},""]
{"$rows_left_out":199}
{"sheet":"Other Charts","index":12,"n_rows":0,"n_cols":0,"rows_kept":0,"cut":false,"hidden":false,"merged":[]}